com/casoftware/rest/controller/MainController.class
com/casoftware/security/OAuth2ServerConfiguration$ResourceServerConfiguration.class
com/casoftware/service/UserServiceImpl.class
com/casoftware/modal/User.class
com/casoftware/constants/CaSoftwareConstants.class
com/casoftware/security/UserRepositoryUserDetails.class
com/casoftware/spring/config/CustomLogoutSuccessHandler.class
com/casoftware/spring/config/CaSoftwareConfig.class
com/casoftware/util/ServiceStatus.class
com/casoftware/spring/config/Initializer.class
com/casoftware/dao/UserDaoImpl.class
com/casoftware/spring/config/initializers/SpringSecurityInitializer.class
com/casoftware/dao/UserDao.class
com/casoftware/spring/config/initializers/SpringMvcInitializer.class
com/casoftware/security/OAuth2ServerConfiguration$AuthorizationServerConfiguration.class
com/casoftware/dao/MainDaoImpl.class
com/casoftware/spring/config/AppConfig.class
com/casoftware/spring/config/CustomLogoutHandler.class
com/casoftware/rest/controller/UserController.class
com/casoftware/dao/Dao.class
com/casoftware/spring/config/HibernateConfiguration.class
com/casoftware/dao/AbstractDao.class
com/casoftware/service/MainServiceImpl.class
com/casoftware/service/UserService.class
com/casoftware/spring/config/CustomAuthenticationFailureHandler.class
com/casoftware/service/MainService.class
com/casoftware/security/UserRepositoryUserDetails$1.class
com/casoftware/security/OAuth2ServerConfiguration.class
com/casoftware/spring/config/EmailConfig.class
com/casoftware/spring/config/CustomAuthenticationSuccessHandler.class
com/casoftware/modal/Bank.class
com/casoftware/spring/config/DataSourceConfig.class
com/casoftware/modal/UserRole.class
com/casoftware/service/CustomUserDetailsService.class
com/casoftware/security/WebSecurityConfig.class
com/casoftware/dao/MainDao.class
