{
	"info": {
		"_postman_id": "56125daa-cf32-4c18-9788-73c0dbc3f887",
		"name": "Capstone2-revision",
		"schema": "https://schema.getpostman.com/json/collection/v2.1.0/collection.json"
	},
	"item": [
		{
			"name": "Register",
			"request": {
				"method": "POST",
				"header": [],
				"body": {
					"mode": "raw",
					"raw": "{\r\n    \"username\": \"jet\",\r\n    \"firstName\": \"jet\",\r\n    \"lastName\": \"Garcia\",\r\n    \"email\": \"jet@mail.com\",\r\n    \"password\": \"123\"\r\n\r\n}",
					"options": {
						"raw": {
							"language": "json"
						}
					}
				},
				"url": {
					"raw": "localhost:4000/users/register",
					"host": [
						"localhost"
					],
					"port": "4000",
					"path": [
						"users",
						"register"
					]
				}
			},
			"response": []
		},
		{
			"name": "Login User (create token)",
			"request": {
				"method": "POST",
				"header": [],
				"body": {
					"mode": "raw",
					"raw": "{\r\n    \"email\": \"admin@mail.com\",\r\n    \"password\": \"123\"\r\n}",
					"options": {
						"raw": {
							"language": "json"
						}
					}
				},
				"url": {
					"raw": "localhost:4000/users/login",
					"host": [
						"localhost"
					],
					"port": "4000",
					"path": [
						"users",
						"login"
					]
				}
			},
			"response": []
		},
		{
			"name": "All User (Admin)",
			"request": {
				"auth": {
					"type": "bearer",
					"bearer": [
						{
							"key": "token",
							"value": "eyJhbGciOiJIUzI1NiIsInR5cCI6IkpXVCJ9.eyJpZCI6IjYzZjQ3ZjY1ZWRhZGNhZjkyZGY0YTAwNSIsInVzZXJuYW1lIjoiYWRtaW4iLCJpc0FkbWluIjp0cnVlLCJpYXQiOjE2NzY5Njk2ODJ9.YBStEDdzM_z3M-fVGsMxdBbnmK6xwyJStnLqRLFLmxA",
							"type": "string"
						}
					]
				},
				"method": "GET",
				"header": [],
				"url": {
					"raw": "localhost:4000/users/",
					"host": [
						"localhost"
					],
					"port": "4000",
					"path": [
						"users",
						""
					]
				}
			},
			"response": []
		},
		{
			"name": "Get Admin User",
			"request": {
				"auth": {
					"type": "bearer",
					"bearer": [
						{
							"key": "token",
							"value": "eyJhbGciOiJIUzI1NiIsInR5cCI6IkpXVCJ9.eyJpZCI6IjYzZjQ3ZjY1ZWRhZGNhZjkyZGY0YTAwNSIsInVzZXJuYW1lIjoiYWRtaW4iLCJpc0FkbWluIjp0cnVlLCJpYXQiOjE2NzY5Njk2ODJ9.YBStEDdzM_z3M-fVGsMxdBbnmK6xwyJStnLqRLFLmxA",
							"type": "string"
						}
					]
				},
				"method": "GET",
				"header": [],
				"url": {
					"raw": "localhost:4000/users/admin",
					"host": [
						"localhost"
					],
					"port": "4000",
					"path": [
						"users",
						"admin"
					]
				}
			},
			"response": []
		},
		{
			"name": "User Details",
			"protocolProfileBehavior": {
				"disableBodyPruning": true
			},
			"request": {
				"auth": {
					"type": "bearer",
					"bearer": [
						{
							"key": "token",
							"value": "eyJhbGciOiJIUzI1NiIsInR5cCI6IkpXVCJ9.eyJpZCI6IjYzZjgyYTQzNzZlMmRhZjhiNjkwOGM5MSIsInVzZXJuYW1lIjoiamV0IiwiaXNBZG1pbiI6ZmFsc2UsImlhdCI6MTY3NzIwODE0MH0.3uZpypV453Jt3AckMzsNLdR5GHJY0XS4aReylaePvCQ",
							"type": "string"
						}
					]
				},
				"method": "GET",
				"header": [],
				"body": {
					"mode": "raw",
					"raw": "",
					"options": {
						"raw": {
							"language": "json"
						}
					}
				},
				"url": {
					"raw": "localhost:4000/users/details",
					"host": [
						"localhost"
					],
					"port": "4000",
					"path": [
						"users",
						"details"
					]
				}
			},
			"response": []
		},
		{
			"name": "Set as Admin",
			"request": {
				"auth": {
					"type": "bearer",
					"bearer": [
						{
							"key": "token",
							"value": "eyJhbGciOiJIUzI1NiIsInR5cCI6IkpXVCJ9.eyJpZCI6IjYzZjQ3ZjY1ZWRhZGNhZjkyZGY0YTAwNSIsInVzZXJuYW1lIjoiYWRtaW4iLCJpc0FkbWluIjp0cnVlLCJpYXQiOjE2NzcyMTI1ODF9.P7WOTkCMDrpR1WgP7C2M4JGf-2kkR0lnEB8zB76hk-k",
							"type": "string"
						}
					]
				},
				"method": "PUT",
				"header": [],
				"url": {
					"raw": "localhost:4000/users/setAdmin/63f82a4376e2daf8b6908c91",
					"host": [
						"localhost"
					],
					"port": "4000",
					"path": [
						"users",
						"setAdmin",
						"63f82a4376e2daf8b6908c91"
					]
				}
			},
			"response": []
		},
		{
			"name": "Set as User",
			"request": {
				"auth": {
					"type": "bearer",
					"bearer": [
						{
							"key": "token",
							"value": "eyJhbGciOiJIUzI1NiIsInR5cCI6IkpXVCJ9.eyJpZCI6IjYzZjQ3ZjY1ZWRhZGNhZjkyZGY0YTAwNSIsInVzZXJuYW1lIjoiYWRtaW4iLCJpc0FkbWluIjp0cnVlLCJpYXQiOjE2NzcyMTI1ODF9.P7WOTkCMDrpR1WgP7C2M4JGf-2kkR0lnEB8zB76hk-k",
							"type": "string"
						}
					]
				},
				"method": "PUT",
				"header": [],
				"url": {
					"raw": "localhost:4000/users/setUser/63f82a4376e2daf8b6908c91",
					"host": [
						"localhost"
					],
					"port": "4000",
					"path": [
						"users",
						"setUser",
						"63f82a4376e2daf8b6908c91"
					]
				}
			},
			"response": []
		},
		{
			"name": "Add Product (Admin)",
			"request": {
				"auth": {
					"type": "bearer",
					"bearer": [
						{
							"key": "token",
							"value": "eyJhbGciOiJIUzI1NiIsInR5cCI6IkpXVCJ9.eyJpZCI6IjYzZjQ3ZjY1ZWRhZGNhZjkyZGY0YTAwNSIsInVzZXJuYW1lIjoiYWRtaW4iLCJpc0FkbWluIjp0cnVlLCJpYXQiOjE2NzcyMTQ5ODB9.5Ez5FmMiouFymE6FEaL_MWk3h6ypdTVTvjMzaDASgwQ",
							"type": "string"
						}
					]
				},
				"method": "POST",
				"header": [],
				"body": {
					"mode": "raw",
					"raw": "{\r\n    \"name\": \"Chocolate Cake\",\r\n    \"description\": \"choco flavor\",\r\n    \"price\": \"1000\",\r\n    \"image\": \"fo follow link\"\r\n}",
					"options": {
						"raw": {
							"language": "json"
						}
					}
				},
				"url": {
					"raw": "localhost:4000/products/addProduct",
					"host": [
						"localhost"
					],
					"port": "4000",
					"path": [
						"products",
						"addProduct"
					]
				}
			},
			"response": []
		},
		{
			"name": "Get all products",
			"request": {
				"method": "GET",
				"header": [],
				"url": {
					"raw": "localhost:4000/products",
					"host": [
						"localhost"
					],
					"port": "4000",
					"path": [
						"products"
					]
				}
			},
			"response": []
		},
		{
			"name": "Set as InActive (Product)",
			"request": {
				"auth": {
					"type": "bearer",
					"bearer": [
						{
							"key": "token",
							"value": "eyJhbGciOiJIUzI1NiIsInR5cCI6IkpXVCJ9.eyJpZCI6IjYzZjQ3ZjY1ZWRhZGNhZjkyZGY0YTAwNSIsInVzZXJuYW1lIjoiYWRtaW4iLCJpc0FkbWluIjp0cnVlLCJpYXQiOjE2NzcyMTQ5ODB9.5Ez5FmMiouFymE6FEaL_MWk3h6ypdTVTvjMzaDASgwQ",
							"type": "string"
						}
					]
				},
				"method": "PUT",
				"header": [],
				"url": {
					"raw": "localhost:4000/products/setInActive/63f845c447f251a758184809",
					"host": [
						"localhost"
					],
					"port": "4000",
					"path": [
						"products",
						"setInActive",
						"63f845c447f251a758184809"
					]
				}
			},
			"response": []
		},
		{
			"name": "Set as Active",
			"request": {
				"auth": {
					"type": "bearer",
					"bearer": [
						{
							"key": "token",
							"value": "eyJhbGciOiJIUzI1NiIsInR5cCI6IkpXVCJ9.eyJpZCI6IjYzZjQ3ZjY1ZWRhZGNhZjkyZGY0YTAwNSIsInVzZXJuYW1lIjoiYWRtaW4iLCJpc0FkbWluIjp0cnVlLCJpYXQiOjE2NzcyMTQ5ODB9.5Ez5FmMiouFymE6FEaL_MWk3h6ypdTVTvjMzaDASgwQ",
							"type": "string"
						}
					]
				},
				"method": "PUT",
				"header": [],
				"url": {
					"raw": "localhost:4000/products/setActive/63f8456b47f251a758184806",
					"host": [
						"localhost"
					],
					"port": "4000",
					"path": [
						"products",
						"setActive",
						"63f8456b47f251a758184806"
					]
				}
			},
			"response": []
		},
		{
			"name": "Specific Product",
			"protocolProfileBehavior": {
				"disableBodyPruning": true
			},
			"request": {
				"method": "GET",
				"header": [],
				"body": {
					"mode": "raw",
					"raw": "{\r\n    \"_id\": \"63f8456b47f251a758184806\"\r\n}",
					"options": {
						"raw": {
							"language": "json"
						}
					}
				},
				"url": {
					"raw": "localhost:4000/products/specificProduct",
					"host": [
						"localhost"
					],
					"port": "4000",
					"path": [
						"products",
						"specificProduct"
					]
				}
			},
			"response": []
		},
		{
			"name": "Update Product",
			"request": {
				"auth": {
					"type": "bearer",
					"bearer": [
						{
							"key": "token",
							"value": "eyJhbGciOiJIUzI1NiIsInR5cCI6IkpXVCJ9.eyJpZCI6IjYzZjQ3ZjY1ZWRhZGNhZjkyZGY0YTAwNSIsInVzZXJuYW1lIjoiYWRtaW4iLCJpc0FkbWluIjp0cnVlLCJpYXQiOjE2NzczMDU3OTZ9.iyB3xtgJHXKUpfFFjLMgGGjllfzLPHpeJthyqY1DXtA",
							"type": "string"
						}
					]
				},
				"method": "PUT",
				"header": [],
				"body": {
					"mode": "raw",
					"raw": "{\r\n    \"name\": \"Banana Cake\",\r\n    \"description\": \"banana flavor\",\r\n    \"price\": 100,\r\n    \"image\": \"here is the link\"\r\n}",
					"options": {
						"raw": {
							"language": "json"
						}
					}
				},
				"url": {
					"raw": "localhost:4000/products/productUpdate/63f8456b47f251a758184806",
					"host": [
						"localhost"
					],
					"port": "4000",
					"path": [
						"products",
						"productUpdate",
						"63f8456b47f251a758184806"
					]
				}
			},
			"response": []
		},
		{
			"name": "Get Active Product",
			"request": {
				"method": "GET",
				"header": []
			},
			"response": []
		},
		{
			"name": "Place Order",
			"request": {
				"auth": {
					"type": "bearer",
					"bearer": [
						{
							"key": "token",
							"value": "eyJhbGciOiJIUzI1NiIsInR5cCI6IkpXVCJ9.eyJpZCI6IjYzZjQ3YWZjYzI3N2M4MjJkOWYwNzgxNiIsInVzZXJuYW1lIjoiam9obiIsImlzQWRtaW4iOmZhbHNlLCJpYXQiOjE2NzczMzE1MjJ9.3_-wYOAHS3RMmTAE7hKCi0nzFXop__IslEFPHWvaOO0",
							"type": "string"
						}
					]
				},
				"method": "POST",
				"header": [],
				"body": {
					"mode": "raw",
					"raw": "{\r\n    \"products\": {\r\n        \"productId\": \"\"\r\n    }\r\n}",
					"options": {
						"raw": {
							"language": "json"
						}
					}
				},
				"url": {
					"raw": "localhost:4000/orders/placeOrder",
					"host": [
						"localhost"
					],
					"port": "4000",
					"path": [
						"orders",
						"placeOrder"
					]
				}
			},
			"response": []
		},
		{
			"name": "Get All Order",
			"request": {
				"method": "GET",
				"header": []
			},
			"response": []
		},
		{
			"name": "Get User Order",
			"request": {
				"auth": {
					"type": "bearer",
					"bearer": [
						{
							"key": "token",
							"value": "eyJhbGciOiJIUzI1NiIsInR5cCI6IkpXVCJ9.eyJpZCI6IjYzZjgyYTQzNzZlMmRhZjhiNjkwOGM5MSIsInVzZXJuYW1lIjoiamV0IiwiaXNBZG1pbiI6ZmFsc2UsImlhdCI6MTY3NzMzOTAwNH0.Xa-pPx68uId4SyKEFbUGZO7-P2tqE9A6C0zFYOi0zXw",
							"type": "string"
						}
					]
				},
				"method": "GET",
				"header": [],
				"url": {
					"raw": "localhost:4000/orders/myOrder",
					"host": [
						"localhost"
					],
					"port": "4000",
					"path": [
						"orders",
						"myOrder"
					]
				}
			},
			"response": []
		},
		{
			"name": "Cancel Order",
			"request": {
				"method": "DELETE",
				"header": [],
				"url": {
					"raw": "localhost:4000/orders",
					"host": [
						"localhost"
					],
					"port": "4000",
					"path": [
						"orders"
					]
				}
			},
			"response": []
		}
	]
}