Keyword,nExp100,nExp67,nExp33,nExperts,nProposals
kw_A101,8,4,8,20,27
kw_A102,11,15,19,45,27
kw_A103,19,6,6,31,26
kw_A104,17,7,5,29,39
kw_A105,13,20,20,53,60
kw_A106,25,23,13,61,49
kw_A107,17,18,17,52,35
kw_A108,12,8,8,28,22
kw_A109,4,9,6,19,28
kw_A110,5,8,7,20,11
kw_A111,4,10,14,28,26
kw_A112,2,8,12,22,11
kw_A113,2,2,8,12,8
kw_A114,35,20,18,73,64
kw_A115,18,12,12,42,39
kw_A116,20,27,29,76,45
kw_A117,9,20,16,45,37
kw_A118,17,10,18,45,34
kw_A119,6,11,12,29,4
kw_A201,23,13,15,51,28
kw_A202,7,16,12,35,10
kw_A203,21,13,19,53,45
kw_A204,12,12,8,32,14
kw_A205,8,10,9,27,17
kw_A206,6,7,4,17,15
kw_A207,30,22,20,72,55
kw_A208,12,6,4,22,27
kw_A209,16,18,15,49,39
kw_A210,25,26,27,78,40
kw_A211,26,23,10,59,40
kw_A212,27,13,16,56,43
kw_A301,8,18,16,42,28
kw_A302,36,29,22,87,47
kw_A303,18,14,16,48,16
kw_A304,1,7,6,14,20
kw_A305,14,7,14,35,26
kw_A306,3,4,2,9,3
kw_A307,32,24,18,74,24
kw_A308,10,5,13,28,11
kw_A309,10,7,10,27,12
kw_A310,15,10,8,33,17
kw_A311,5,12,5,22,5
kw_A312,14,18,19,51,6
kw_A313,18,14,16,48,20
kw_A314,15,19,20,54,15
kw_A315,39,40,26,105,87
kw_A316,12,17,24,53,24
kw_A317,24,34,14,72,79
kw_A318,12,31,14,57,45
kw_A319,28,22,23,73,48
kw_A320,17,24,15,56,27
kw_A321,14,13,11,38,1
kw_A322,12,5,10,27,2
kw_A323,4,5,7,16,9
kw_A324,1,2,1,4,2
kw_B101,2,0,3,5,0
kw_B102,0,0,2,2,1
kw_B103,4,3,3,10,0
kw_B104,25,23,11,59,2
kw_B105,10,12,6,28,1
kw_B106,3,10,5,18,1
kw_B107,6,1,7,14,4
kw_B202,0,0,0,0,1
kw_B208,0,0,0,0,1
kw_B211,0,1,1,2,0
kw_B212,0,1,0,1,2
kw_B213,1,1,0,2,0
kw_B215,0,0,0,0,1
kw_B219,0,0,1,1,1
kw_B220,0,4,4,8,2
kw_B301,0,2,5,7,3
kw_B302,0,1,0,1,0
kw_B303,1,2,0,3,0
kw_B304,3,4,4,11,1
kw_B305,1,0,1,2,1
kw_B306,1,0,1,2,0
kw_B307,4,4,9,17,2
kw_B401,0,0,1,1,0
kw_B402,0,0,1,1,0
kw_B403,0,1,1,2,0
kw_B404,0,1,0,1,0
kw_B405,1,0,1,2,0
kw_C101,0,0,3,3,1
kw_C102,2,2,1,5,1
kw_C103,0,0,1,1,4
kw_C106,0,1,0,1,0
kw_C107,0,0,0,0,1
kw_C108,0,0,1,1,0
kw_C203,1,1,1,3,0
kw_C204,1,0,0,1,0
kw_C205,0,0,1,1,3
kw_C206,0,0,0,0,1
kw_C209,1,0,1,2,0
kw_C210,0,0,1,1,0
kw_C211,0,1,0,1,0
kw_C302,1,3,0,4,1
kw_C304,0,1,1,2,0
kw_C305,1,0,0,1,1
kw_C307,1,0,0,1,0
kw_C309,4,1,1,6,2
kw_C310,0,2,0,2,3
kw_C311,0,0,0,0,1
kw_C312,2,0,1,3,5
kw_C401,4,4,2,10,5
kw_C402,4,1,1,6,2
kw_C403,2,3,1,6,0
kw_C404,2,4,3,9,1
kw_C405,2,2,1,5,1
kw_C406,0,0,1,1,0
kw_C407,4,0,2,6,1
kw_C408,3,1,4,8,3
kw_C409,1,1,2,4,0
kw_C410,5,1,4,10,2
kw_C411,9,6,10,25,23
kw_C412,3,5,6,14,2
kw_C413,0,0,2,2,1
kw_C414,1,0,1,2,2
kw_C416,1,0,0,1,1
kw_C501,1,0,1,2,0
kw_C502,0,2,0,2,2
kw_C503,1,1,0,2,6
kw_C504,0,0,1,1,1
kw_C505,1,1,0,2,2
kw_C508,0,0,1,1,1
kw_C510,0,0,0,0,1
kw_C512,0,0,2,2,0
kw_C514,0,1,1,2,1
kw_C516,0,0,1,1,1
kw_C519,0,0,1,1,0
kw_C601,1,1,0,2,0
kw_C602,1,1,0,2,0
kw_C604,0,1,0,1,0
kw_C606,2,1,0,3,0
kw_C607,0,1,0,1,0
kw_C608,0,0,2,2,0
kw_C609,1,0,0,1,0
kw_C610,2,0,0,2,0
kw_C612,0,0,1,1,0
kw_C613,0,3,1,4,0
kw_C615,0,0,1,1,0
kw_C701,0,0,0,0,1
kw_C704,0,1,0,1,0
kw_C705,0,2,1,3,1
kw_C706,1,1,1,3,0
kw_C708,1,0,0,1,0
kw_C709,0,0,1,1,0
kw_D101,0,3,1,4,0
kw_D102,0,3,0,3,1
kw_D103,2,1,0,3,1
kw_D104,3,1,5,9,2
kw_D105,0,2,3,5,0
kw_D106,5,0,0,5,10
kw_D107,2,0,1,3,0
kw_D110,0,2,0,2,0
kw_D112,2,4,2,8,3
kw_D113,0,1,1,2,1
kw_D114,0,1,1,2,2
kw_D115,2,0,2,4,0
kw_D116,1,1,0,2,2
kw_D117,0,1,1,2,0
kw_D118,0,0,2,2,1
kw_D119,0,1,1,2,1
kw_D121,0,1,0,1,0
kw_D122,0,1,2,3,0
kw_D202,0,0,1,1,0
kw_D203,0,1,0,1,0
kw_D204,2,1,2,5,1
kw_D205,0,2,2,4,3
kw_D206,1,0,0,1,0
kw_D207,4,1,1,6,0
kw_D208,2,3,2,7,0
kw_D210,1,2,2,5,0
kw_D211,6,1,1,8,2
kw_D212,1,0,0,1,0
kw_D213,1,1,2,4,0
kw_D214,0,0,1,1,0
kw_D301,4,3,5,12,4
kw_D302,0,0,0,0,1
kw_D303,0,1,1,2,0
kw_D305,0,0,2,2,1
kw_D306,4,3,1,8,1
kw_D307,1,3,1,5,1
kw_D308,3,3,1,7,0
kw_D309,2,0,2,4,0
kw_D310,9,12,7,28,7
kw_D311,1,3,2,6,0
kw_D312,3,6,2,11,2
kw_D313,0,0,3,3,0
kw_D314,1,4,5,10,2
kw_D315,0,2,1,3,1
kw_D316,3,2,1,6,0
kw_D317,0,1,1,2,0
kw_D318,1,3,2,6,0
kw_D319,2,0,0,2,2
kw_D501,0,1,0,1,0
kw_D504,1,0,0,1,1
kw_D513,1,0,0,1,0
kw_D516,1,0,0,1,0
kw_D517,0,0,1,1,0
kw_D522,0,1,0,1,2
kw_D523,0,2,1,3,0
kw_E101,4,1,0,5,1
kw_E102,0,2,2,4,2
kw_E103,1,2,1,4,4
kw_E105,1,1,1,3,0
kw_E106,2,3,0,5,0
kw_E107,2,1,1,4,4
kw_E108,2,1,1,4,2
kw_E109,0,0,1,1,0
kw_E110,4,4,1,9,3
kw_E111,0,1,2,3,0
kw_E113,1,1,0,2,2
kw_E114,3,0,2,5,0
kw_E116,1,0,1,2,1
kw_E117,1,2,1,4,2
kw_E118,0,2,4,6,1
kw_E119,0,2,1,3,1
kw_E120,0,0,1,1,0
kw_E121,0,0,3,3,0
kw_E123,1,3,4,8,2
kw_E125,0,2,0,2,0
kw_E126,4,2,1,7,0
kw_E127,1,0,5,6,1
kw_E128,1,2,6,9,1
kw_E129,1,0,0,1,3
kw_E130,0,0,1,1,0
kw_E201,3,1,0,4,2
kw_E202,2,1,2,5,1
kw_E203,5,7,7,19,7
kw_E204,2,1,2,5,1
kw_E205,7,5,2,14,2
kw_E206,1,1,0,2,0
kw_E207,6,2,2,10,1
kw_E208,4,4,3,11,1
kw_E209,2,2,4,8,1
kw_E210,3,1,0,4,3
kw_E211,2,6,3,11,0
kw_E212,3,3,2,8,3
kw_E213,3,4,2,9,3
kw_E215,1,0,0,1,1
kw_E216,4,8,3,15,4
kw_E217,0,1,2,3,2
kw_E218,7,2,3,12,0
kw_E219,0,0,3,3,2
kw_E220,0,0,1,1,1
kw_E221,4,5,5,14,8
kw_E222,5,6,3,14,4
kw_E223,2,0,2,4,0
kw_E224,3,4,3,10,1
kw_E225,0,1,0,1,0
kw_E227,2,7,5,14,3
kw_E302,0,1,1,2,0
kw_E305,0,1,0,1,2
kw_E308,0,4,2,6,1
kw_E401,0,2,0,2,0
kw_E402,0,1,0,1,0
kw_E406,1,1,1,3,0
kw_E407,0,1,0,1,0
kw_E409,0,0,1,1,0
kw_E411,0,0,1,1,0
kw_E413,1,0,0,1,1
kw_E414,5,4,3,12,5
kw_E416,0,1,0,1,0
kw_E417,0,0,0,0,1
kw_F101,1,0,1,2,1
kw_F102,0,0,1,1,0
kw_F103,3,2,3,8,2
kw_F104,1,2,0,3,1
kw_F106,5,4,3,12,2
kw_F107,0,1,1,2,0
kw_F108,0,1,0,1,2
kw_F109,0,1,2,3,1
kw_F110,2,2,3,7,2
kw_F111,2,0,1,3,5
kw_F112,0,0,1,1,0
kw_F113,2,3,1,6,6
kw_F114,0,1,1,2,4
kw_F115,5,2,2,9,3
kw_F117,0,0,1,1,0
kw_F118,2,4,6,12,3
kw_F119,0,0,2,2,0
kw_F120,0,0,2,2,0
kw_F201,10,20,12,42,5
kw_F202,0,2,1,3,0
kw_F203,2,6,4,12,0
kw_F204,3,7,10,20,2
kw_F205,7,11,12,30,9
kw_F206,5,4,7,16,1
kw_F207,3,1,3,7,0
kw_F208,3,5,3,11,3
kw_F209,9,8,9,26,4
kw_F303,0,0,0,0,1
kw_F307,0,2,0,2,0
kw_F401,0,3,1,4,1
kw_F402,0,1,2,3,1
kw_F404,2,1,5,8,3
kw_F405,0,0,1,1,0
kw_F407,6,3,2,11,2
kw_F408,2,0,1,3,2
kw_F409,1,0,0,1,0
kw_F410,1,4,2,7,1
kw_F411,6,1,0,7,1
kw_F412,0,0,1,1,0
kw_G104,0,0,1,1,0
kw_G111,0,0,0,0,1
kw_G113,0,0,1,1,0
kw_G200,0,0,1,1,0
kw_G201,6,4,3,13,2
kw_G203,0,0,1,1,0
kw_G204,3,4,5,12,1
kw_G205,0,4,4,8,0
kw_G207,1,0,0,1,0
kw_G208,0,0,1,1,0
kw_G209,1,0,1,2,0
kw_G210,0,0,1,1,3
kw_G301,1,0,0,1,1
kw_G302,0,0,0,0,1
kw_G305,0,1,2,3,1
kw_G307,0,0,0,0,1
kw_G308,0,0,0,0,1
kw_G309,0,0,0,0,1
kw_G311,0,0,2,2,0
kw_G314,0,0,1,1,1
kw_G320,0,0,1,1,0
kw_G322,0,0,2,2,2
kw_G404,2,1,2,5,2
kw_G407,2,2,0,4,1
kw_G408,1,2,0,3,0
kw_G420,1,0,0,1,1
kw_G423,3,2,0,5,1
kw_G501,0,2,0,2,0
kw_G502,0,3,0,3,3
kw_G503,0,1,0,1,0
kw_G504,1,0,1,2,0
kw_G505,0,2,1,3,0
kw_G506,3,0,1,4,2
kw_G507,1,0,0,1,0
kw_G509,0,0,0,0,1
kw_G511,0,1,0,1,0
kw_G512,0,1,0,1,0
kw_G601,0,0,0,0,1
kw_G606,1,0,0,1,1
kw_G609,3,0,2,5,2
kw_G612,0,0,0,0,1
kw_G613,0,0,1,1,0
kw_G704,0,2,0,2,2
kw_G708,0,1,0,1,0
kw_G801,0,1,3,4,0
kw_G802,5,3,2,10,1
kw_G803,5,9,9,23,3
kw_G804,0,2,2,4,0
kw_G805,0,1,0,1,0
kw_G806,1,3,1,5,0
kw_G907,0,1,0,1,1
kw_H101,5,4,2,11,3
kw_H102,5,9,8,22,3
kw_H103,0,2,0,2,0
kw_H104,5,8,7,20,1
kw_H105,1,0,0,1,0
kw_H106,2,0,1,3,1
kw_H107,13,8,6,27,6
kw_H108,8,11,10,29,9
kw_H109,3,3,5,11,2
kw_H110,3,7,7,17,2
kw_H111,2,10,8,20,0
kw_H112,4,6,7,17,1
kw_H204,2,0,3,5,0
kw_H206,0,0,0,0,1
kw_H207,0,0,1,1,0
kw_H208,0,0,1,1,0
kw_H211,0,1,1,2,0
kw_H214,1,1,1,3,0
kw_H219,1,0,1,2,0
kw_H221,2,2,3,7,1
kw_H223,1,3,0,4,1
