<?xml version="1.0" encoding="UTF-8"?>
<!DOCTYPE suite SYSTEM "https://testng.org/testng-1.0.dtd">
<suite name="Failed suite [Suite]" guice-stage="DEVELOPMENT" verbose="0">
  <test thread-count="5" name="Test(failed)" verbose="0">
    <classes>
      <class name="execution.Third">
        <methods>
          <include name="preSteps"/>
        </methods>
      </class> <!-- execution.Third -->
    </classes>
  </test> <!-- Test(failed) -->
</suite> <!-- Failed suite [Suite] -->
