{
  "$schema": "http://json-schema.org/draft-07/schema#",
  "$id": "https://poketools.gamestuff.info/data/schema/berry_firmness.json",
  "title": "Berry Firmness List",
  "description": "Available Berry Firmness levels",
  "type": "array",
  "uniqueItems": true,
  "items": {
    "type": "object",
    "properties": {
      "identifier": {
        "$ref": "types/identifier.json"
      },
      "name": {
        "$ref": "types/name.json"
      }
    },
    "additionalProperties": false,
    "required": [
      "identifier",
      "name"
    ]
  }
}
