[gd_scene load_steps=8 format=2]

[ext_resource path="res://Cards/CardBase.gd" type="Script" id=1]
[ext_resource path="res://Assets/Cards/Card Borders etc/cardborder.png" type="Texture" id=2]
[ext_resource path="res://Assets/Cards/Card Borders etc/background shade.png" type="Texture" id=3]
[ext_resource path="res://Assets/font/Comfortaa-Bold.ttf" type="DynamicFontData" id=4]
[ext_resource path="res://Assets/Cards/Card Borders etc/Back_Texture.png" type="Texture" id=5]
[ext_resource path="res://Assets/Cards/Card Borders etc/Gold_Border.png" type="Texture" id=6]

[sub_resource type="DynamicFont" id=1]
size = 15
font_data = ExtResource( 4 )

[node name="CardBase" type="MarginContainer"]
margin_right = 250.0
margin_bottom = 350.0
rect_pivot_offset = Vector2( 125, 175 )
script = ExtResource( 1 )

[node name="Card" type="Sprite" parent="."]
centered = false

[node name="Border" type="Sprite" parent="."]
texture = ExtResource( 2 )
centered = false

[node name="Bars" type="VBoxContainer" parent="."]
margin_right = 250.0
margin_bottom = 350.0

[node name="TopGap" type="MarginContainer" parent="Bars"]
margin_right = 250.0
margin_bottom = 25.0
rect_min_size = Vector2( 0, 25 )

[node name="TopBar" type="HBoxContainer" parent="Bars"]
margin_top = 29.0
margin_right = 250.0
margin_bottom = 54.0

[node name="LeftGap" type="MarginContainer" parent="Bars/TopBar"]
margin_right = 25.0
margin_bottom = 25.0
rect_min_size = Vector2( 25, 25 )

[node name="Name" type="MarginContainer" parent="Bars/TopBar"]
margin_left = 29.0
margin_right = 98.0
margin_bottom = 25.0

[node name="NinePatchRect" type="NinePatchRect" parent="Bars/TopBar/Name"]
margin_right = 69.0
margin_bottom = 25.0
texture = ExtResource( 3 )

[node name="CenterContainer" type="CenterContainer" parent="Bars/TopBar/Name"]
margin_right = 69.0
margin_bottom = 25.0

[node name="Name" type="Label" parent="Bars/TopBar/Name/CenterContainer"]
margin_top = 3.0
margin_right = 69.0
margin_bottom = 21.0
custom_fonts/font = SubResource( 1 )
text = "Footman"

[node name="MidGap" type="MarginContainer" parent="Bars/TopBar"]
margin_left = 102.0
margin_right = 211.0
margin_bottom = 25.0
size_flags_horizontal = 3

[node name="Cost" type="MarginContainer" parent="Bars/TopBar"]
margin_left = 215.0
margin_right = 221.0
margin_bottom = 25.0

[node name="NinePatchRect" type="NinePatchRect" parent="Bars/TopBar/Cost"]
margin_right = 6.0
margin_bottom = 25.0
texture = ExtResource( 3 )

[node name="CenterContainer" type="CenterContainer" parent="Bars/TopBar/Cost"]
margin_right = 6.0
margin_bottom = 25.0

[node name="Cost" type="Label" parent="Bars/TopBar/Cost/CenterContainer"]
margin_top = 3.0
margin_right = 6.0
margin_bottom = 21.0
custom_fonts/font = SubResource( 1 )
text = "1"

[node name="RightGap" type="MarginContainer" parent="Bars/TopBar"]
margin_left = 225.0
margin_right = 250.0
margin_bottom = 25.0
rect_min_size = Vector2( 25, 0 )

[node name="MidGap" type="MarginContainer" parent="Bars"]
margin_top = 58.0
margin_right = 250.0
margin_bottom = 224.0
size_flags_vertical = 3

[node name="SpecialText" type="HBoxContainer" parent="Bars"]
margin_top = 228.0
margin_right = 250.0
margin_bottom = 253.0

[node name="LeftGap" type="MarginContainer" parent="Bars/SpecialText"]
margin_right = 25.0
margin_bottom = 25.0
rect_min_size = Vector2( 25, 25 )

[node name="Text" type="MarginContainer" parent="Bars/SpecialText"]
margin_left = 29.0
margin_right = 76.0
margin_bottom = 25.0

[node name="NinePatchRect" type="NinePatchRect" parent="Bars/SpecialText/Text"]
margin_right = 47.0
margin_bottom = 25.0
texture = ExtResource( 3 )

[node name="CenterContainer" type="CenterContainer" parent="Bars/SpecialText/Text"]
margin_right = 47.0
margin_bottom = 25.0

[node name="Type" type="Label" parent="Bars/SpecialText/Text/CenterContainer"]
margin_top = 3.0
margin_right = 47.0
margin_bottom = 21.0
custom_fonts/font = SubResource( 1 )
text = "Melee"

[node name="MidGap" type="MarginContainer" parent="Bars/SpecialText"]
margin_left = 80.0
margin_right = 250.0
margin_bottom = 25.0
size_flags_horizontal = 3

[node name="LowerGap" type="MarginContainer" parent="Bars"]
margin_top = 257.0
margin_right = 250.0
margin_bottom = 287.0
rect_min_size = Vector2( 0, 30 )

[node name="BottomBar" type="HBoxContainer" parent="Bars"]
margin_top = 291.0
margin_right = 250.0
margin_bottom = 316.0

[node name="LeftGap" type="MarginContainer" parent="Bars/BottomBar"]
margin_right = 25.0
margin_bottom = 25.0
rect_min_size = Vector2( 25, 25 )

[node name="Attack" type="MarginContainer" parent="Bars/BottomBar"]
margin_left = 29.0
margin_right = 48.0
margin_bottom = 25.0

[node name="NinePatchRect" type="NinePatchRect" parent="Bars/BottomBar/Attack"]
margin_right = 19.0
margin_bottom = 25.0
texture = ExtResource( 3 )

[node name="CenterContainer" type="CenterContainer" parent="Bars/BottomBar/Attack"]
margin_right = 19.0
margin_bottom = 25.0

[node name="A&R" type="Label" parent="Bars/BottomBar/Attack/CenterContainer"]
margin_top = 3.0
margin_right = 19.0
margin_bottom = 21.0
custom_fonts/font = SubResource( 1 )
text = "1/1"

[node name="MidGap" type="MarginContainer" parent="Bars/BottomBar"]
margin_left = 52.0
margin_right = 208.0
margin_bottom = 25.0
size_flags_horizontal = 3

[node name="Health" type="MarginContainer" parent="Bars/BottomBar"]
margin_left = 212.0
margin_right = 221.0
margin_bottom = 25.0

[node name="NinePatchRect" type="NinePatchRect" parent="Bars/BottomBar/Health"]
margin_right = 9.0
margin_bottom = 25.0
texture = ExtResource( 3 )

[node name="CenterContainer" type="CenterContainer" parent="Bars/BottomBar/Health"]
margin_right = 9.0
margin_bottom = 25.0

[node name="Health" type="Label" parent="Bars/BottomBar/Health/CenterContainer"]
margin_top = 3.0
margin_right = 9.0
margin_bottom = 21.0
custom_fonts/font = SubResource( 1 )
text = "2"

[node name="RightGap" type="MarginContainer" parent="Bars/BottomBar"]
margin_left = 225.0
margin_right = 250.0
margin_bottom = 25.0
rect_min_size = Vector2( 25, 0 )

[node name="BottomGap" type="MarginContainer" parent="Bars"]
margin_top = 320.0
margin_right = 250.0
margin_bottom = 350.0
rect_min_size = Vector2( 0, 30 )

[node name="Focus" type="TextureButton" parent="."]
margin_right = 250.0
margin_bottom = 350.0
texture_hover = ExtResource( 6 )
expand = true

[node name="CardBack" type="Sprite" parent="."]
texture = ExtResource( 5 )
centered = false

[connection signal="mouse_entered" from="Focus" to="." method="_on_Focus_mouse_entered"]
[connection signal="mouse_exited" from="Focus" to="." method="_on_Focus_mouse_exited"]
