[gd_scene load_steps=6 format=2]

[ext_resource path="res://Assets/Background/Background.jpg" type="Texture" id=1]
[ext_resource path="res://Playspace.gd" type="Script" id=2]
[ext_resource path="res://Assets/Cards/Card Borders etc/Back_Texture.png" type="Texture" id=3]
[ext_resource path="res://Assets/Cards/Card Borders etc/Gold_Border.png" type="Texture" id=4]
[ext_resource path="res://DeckDraw.gd" type="Script" id=5]

[node name="Playspace" type="Node2D"]
script = ExtResource( 2 )

[node name="Cards" type="Node" parent="."]

[node name="Background" type="Sprite" parent="."]
position = Vector2( 512, 300 )
scale = Vector2( 0.533333, 0.53286 )
texture = ExtResource( 1 )

[node name="Deck" type="Node2D" parent="."]
position = Vector2( 828, 113 )
__meta__ = {
"_edit_group_": true
}

[node name="DeckDraw" type="TextureButton" parent="Deck"]
margin_right = 40.0
margin_bottom = 40.0
texture_normal = ExtResource( 3 )
texture_pressed = ExtResource( 3 )
texture_hover = ExtResource( 3 )
texture_disabled = ExtResource( 4 )
script = ExtResource( 5 )
