%YAML 1.1
%TAG !u! tag:unity3d.com,2011:
--- !u!114 &-3464841568441587496
MonoBehaviour:
  m_ObjectHideFlags: 11
  m_CorrespondingSourceObject: {fileID: 0}
  m_PrefabInstance: {fileID: 0}
  m_PrefabAsset: {fileID: 0}
  m_GameObject: {fileID: 0}
  m_Enabled: 1
  m_EditorHideFlags: 0
  m_Script: {fileID: 11500000, guid: d0353a89b1f911e48b9e16bdc9f2e058, type: 3}
  m_Name: 
  m_EditorClassIdentifier: 
  version: 5
--- !u!21 &2100000
Material:
  serializedVersion: 6
  m_ObjectHideFlags: 0
  m_CorrespondingSourceObject: {fileID: 0}
  m_PrefabInstance: {fileID: 0}
  m_PrefabAsset: {fileID: 0}
  m_Name: GoodAgent 1Unlit 1
  m_Shader: {fileID: -6465566751694194690, guid: 9cd4d1b1b17c06a4da268028963e1152,
    type: 3}
  m_ShaderKeywords: DISTANCEFADEOUT_NONE _METALLICSPECGLOSSMAP _NORMALMAP
  m_LightmapFlags: 4
  m_EnableInstancingVariants: 0
  m_DoubleSidedGI: 0
  m_CustomRenderQueue: -1
  stringTagMap: {}
  disabledShaderPasses: []
  m_SavedProperties:
    serializedVersion: 3
    m_TexEnvs:
    - DissolvePattern:
        m_Texture: {fileID: 0}
        m_Scale: {x: 1, y: 1}
        m_Offset: {x: 0, y: 0}
    - Dissolve_Texture:
        m_Texture: {fileID: 2800000, guid: 394ebc3c625f8184c813f909c39394af, type: 3}
        m_Scale: {x: 1, y: 1}
        m_Offset: {x: 0, y: 0}
    - NoiseTexture:
        m_Texture: {fileID: 0}
        m_Scale: {x: 1, y: 1}
        m_Offset: {x: 0, y: 0}
    - NormalsRamp:
        m_Texture: {fileID: 2800000, guid: 08af383fce062be48840a87a47591c74, type: 3}
        m_Scale: {x: 1, y: 1}
        m_Offset: {x: 0, y: 0}
    - Pattern:
        m_Texture: {fileID: 2800000, guid: 936a43635c57b0a408fb70bee7efbb2a, type: 3}
        m_Scale: {x: 1, y: 1}
        m_Offset: {x: 0, y: 0}
    - RampTexture:
        m_Texture: {fileID: 2800000, guid: ae80cf1e3511aeb4092127140a878bcc, type: 3}
        m_Scale: {x: 1, y: 1}
        m_Offset: {x: 0, y: 0}
    - ShadingTexture:
        m_Texture: {fileID: 2800000, guid: 4398bace714b52d4b98d1331dad26a62, type: 3}
        m_Scale: {x: 1, y: 1}
        m_Offset: {x: 0, y: 0}
    - ToonRamp:
        m_Texture: {fileID: 2800000, guid: c4c8d5462e40b194e83b0d84b892d60e, type: 3}
        m_Scale: {x: 1, y: 1}
        m_Offset: {x: 0, y: 0}
    - _BaseMap:
        m_Texture: {fileID: 2800000, guid: d792953547c12f64f9a8694b5f4a3c7c, type: 3}
        m_Scale: {x: 1, y: 1}
        m_Offset: {x: 0, y: 0}
    - _BumpMap:
        m_Texture: {fileID: 2800000, guid: 486df3992c667a44cbf967dc6f072d10, type: 3}
        m_Scale: {x: 1, y: 1}
        m_Offset: {x: 0, y: 0}
    - _EmissionMap:
        m_Texture: {fileID: 0}
        m_Scale: {x: 1, y: 1}
        m_Offset: {x: 0, y: 0}
    - _MainTex:
        m_Texture: {fileID: 2800000, guid: d792953547c12f64f9a8694b5f4a3c7c, type: 3}
        m_Scale: {x: 1, y: 1}
        m_Offset: {x: 0, y: 0}
    - _MetallicGlossMap:
        m_Texture: {fileID: 2800000, guid: dc7924ddbbb126349b12c46c8d0198a3, type: 3}
        m_Scale: {x: 1, y: 1}
        m_Offset: {x: 0, y: 0}
    - _NormalTex:
        m_Texture: {fileID: 2800000, guid: 486df3992c667a44cbf967dc6f072d10, type: 3}
        m_Scale: {x: 1, y: 1}
        m_Offset: {x: 0, y: 0}
    - _OcclusionMap:
        m_Texture: {fileID: 0}
        m_Scale: {x: 1, y: 1}
        m_Offset: {x: 0, y: 0}
    - _OcclusionTex:
        m_Texture: {fileID: 2800000, guid: 486df3992c667a44cbf967dc6f072d10, type: 3}
        m_Scale: {x: 1, y: 1}
        m_Offset: {x: 0, y: 0}
    - _SmoothnessTex:
        m_Texture: {fileID: 2800000, guid: dc7924ddbbb126349b12c46c8d0198a3, type: 3}
        m_Scale: {x: 1, y: 1}
        m_Offset: {x: 0, y: 0}
    - _SpecGlossMap:
        m_Texture: {fileID: 2800000, guid: dc7924ddbbb126349b12c46c8d0198a3, type: 3}
        m_Scale: {x: 1, y: 1}
        m_Offset: {x: 0, y: 0}
    - _Texture2DAsset_4D83A2A5_Out_0:
        m_Texture: {fileID: 2800000, guid: 738a546dd8a75244c9ca9bdf6073bce8, type: 3}
        m_Scale: {x: 1, y: 1}
        m_Offset: {x: 0, y: 0}
    - _Texture2DAsset_63C58728_Out_0:
        m_Texture: {fileID: 2800000, guid: 738a546dd8a75244c9ca9bdf6073bce8, type: 3}
        m_Scale: {x: 1, y: 1}
        m_Offset: {x: 0, y: 0}
    - _Texture2DAsset_6D2D1201_Out_0:
        m_Texture: {fileID: 2800000, guid: 738a546dd8a75244c9ca9bdf6073bce8, type: 3}
        m_Scale: {x: 1, y: 1}
        m_Offset: {x: 0, y: 0}
    - _Texture2DAsset_899866B5_Out_0:
        m_Texture: {fileID: 2800000, guid: 738a546dd8a75244c9ca9bdf6073bce8, type: 3}
        m_Scale: {x: 1, y: 1}
        m_Offset: {x: 0, y: 0}
    - _Texture2DAsset_AE83B453_Out_0:
        m_Texture: {fileID: 2800000, guid: 738a546dd8a75244c9ca9bdf6073bce8, type: 3}
        m_Scale: {x: 1, y: 1}
        m_Offset: {x: 0, y: 0}
    - _Texture2DAsset_B3083E25_Out_0:
        m_Texture: {fileID: 2800000, guid: 738a546dd8a75244c9ca9bdf6073bce8, type: 3}
        m_Scale: {x: 1, y: 1}
        m_Offset: {x: 0, y: 0}
    - _Texture2DAsset_BDF093F_Out_0:
        m_Texture: {fileID: 2800000, guid: 738a546dd8a75244c9ca9bdf6073bce8, type: 3}
        m_Scale: {x: 1, y: 1}
        m_Offset: {x: 0, y: 0}
    - _Texture2DAsset_D7618179_Out_0:
        m_Texture: {fileID: 2800000, guid: 738a546dd8a75244c9ca9bdf6073bce8, type: 3}
        m_Scale: {x: 1, y: 1}
        m_Offset: {x: 0, y: 0}
    - _Texture2DAsset_E8C87502_Out_0:
        m_Texture: {fileID: 2800000, guid: bf91a9f94ae4348b09a32bb9c02a7b4d, type: 3}
        m_Scale: {x: 1, y: 1}
        m_Offset: {x: 0, y: 0}
    - _Texture2DAsset_EF66AA98_Out_0:
        m_Texture: {fileID: 2800000, guid: 738a546dd8a75244c9ca9bdf6073bce8, type: 3}
        m_Scale: {x: 1, y: 1}
        m_Offset: {x: 0, y: 0}
    m_Ints: []
    m_Floats:
    - Alpha: 0
    - ColorFill: 0.02
    - Color_Spread: 0.4
    - Color_Steps: 6
    - Cutoff: 0.1
    - DISTANCEFADEOUT: 0
    - Depth_Sensitivity: 0.15
    - FadeoutDistance: -15
    - Fadeout_Distance: -15
    - FresnelAngle: 21.3
    - FresnelPower: 4
    - FresnelSize: 14
    - GlossSize: 13.11
    - HARD_SHADING: 0
    - HardShadingFresnel: 4
    - Highlight_Intensity: 0.05
    - MaxLightIntensity: 0.8
    - MaxLuminosity: 0.5
    - MixEffect: 1
    - MixEffectAmount: 1
    - Normals_Sensitivity: 2
    - Outline_Thickness: 2
    - PatternFrequency: 30
    - PatternSpeed: 0.1
    - Pattern_Frequency: 30
    - ShowGloss: 1
    - Show_Outline: 1
    - Vector1_2FF7DD3D: 0
    - Vector1_79D7161B: 0
    - Vector1_962926F1: 0.276
    - Vector1_BB021EE6: 0.1
    - Vector1_DD45D400: 0
    - _AlphaClip: 0
    - _BacklightAmount: 2.37
    - _Blend: 0
    - _BumpScale: 0.5
    - _Cull: 2
    - _Cutoff: 0
    - _DabsRotation: 15
    - _DabsTiling: 50
    - _DstBlend: 0
    - _EnvironmentReflections: 1
    - _GlossMapScale: 0
    - _Glossiness: 0
    - _GlossyReflections: 0
    - _Metallic: 0
    - _NormalMult: 1
    - _OcclusionMult: 0.552
    - _OcclusionStrength: 1
    - _QueueOffset: 0
    - _ReceiveShadows: 1
    - _Smoothness: 0.8
    - _SmoothnessTextureChannel: 0
    - _SpecularHighlights: 1
    - _SrcBlend: 1
    - _Surface: 0
    - _WorkflowMode: 1
    - _ZWrite: 1
    m_Colors:
    - EmissionColor: {r: 0.1882353, g: 1.890196, b: 1.788235, a: 0}
    - FresnelIntensity: {r: 1.681529, g: 1.681529, b: 1.681529, a: 0}
    - GlossIntensity: {r: 0.8803151, g: 0.8803151, b: 0.8803151, a: 0.9294118}
    - Highlight_Color: {r: 1, g: 1, b: 1, a: 1}
    - Lit_Color: {r: 1, g: 1, b: 1, a: 1}
    - NoiseTiling: {r: 4, g: 4, b: 0, a: 0}
    - Outline_Color: {r: 0.31372547, g: 0.11764697, b: 0.105882265, a: 1}
    - PatternTiling: {r: 2, g: 2, b: 0, a: 0}
    - Shaded_Color: {r: 0.24528292, g: 0.24528292, b: 0.24528292, a: 1}
    - ShadingBlacks: {r: 0.07843138, g: 0.07843138, b: 0.07843138, a: 0}
    - ShadingTiling: {r: 8, g: 8, b: 0, a: 0}
    - ShadingWhites: {r: 1, g: 1, b: 1, a: 0}
    - _BaseColor: {r: 1, g: 1, b: 1, a: 1}
    - _Color: {r: 1, g: 1, b: 1, a: 1}
    - _EmissionColor: {r: 0, g: 0, b: 0, a: 1}
    - _Offset: {r: 0, g: 0, b: 0, a: 0}
    - _SpecColor: {r: 0.19999996, g: 0.19999996, b: 0.19999996, a: 1}
    - _Specular: {r: 0.6981132, g: 0.6981132, b: 0.6981132, a: 0}
    - _TextureTiling: {r: 1, g: 1, b: 0, a: 0}
    - _Tiling: {r: 1, g: 1, b: 0, a: 0}
  m_BuildTextureStacks: []
