Library\Bee\artifacts\mvdfrm\Unity.2D.PixelPerfect.Editor.ref.dll_F4FF2C57B2C1727C.mvfrm
Library\Bee\artifacts\mvdfrm\Unity.2D.PixelPerfect.ref.dll_938343FF3C89A485.mvfrm
Library\Bee\artifacts\mvdfrm\Unity.2D.Sprite.Editor.ref.dll_6C8185F9E5AE014E.mvfrm
Library\Bee\artifacts\mvdfrm\Unity.2D.Tilemap.Editor.ref.dll_C349DCD839D8880B.mvfrm
Library\Bee\artifacts\mvdfrm\Unity.Addressables.Editor.ref.dll_B6BBEF3D2DFF9438.mvfrm
Library\Bee\artifacts\mvdfrm\Unity.Addressables.ref.dll_280E9D3428C59709.mvfrm
Library\Bee\artifacts\mvdfrm\Unity.Barracuda.BurstBLAS.ref.dll_6B49089DEB1CEB31.mvfrm
Library\Bee\artifacts\mvdfrm\Unity.Barracuda.Editor.ref.dll_92C3434C986718EE.mvfrm
Library\Bee\artifacts\mvdfrm\Unity.Barracuda.MacBLAS.ref.dll_3FC273E4EA138C90.mvfrm
Library\Bee\artifacts\mvdfrm\Unity.Barracuda.ONNX.ref.dll_B7B0EDBCD67FBC4A.mvfrm
Library\Bee\artifacts\mvdfrm\Unity.Barracuda.ref.dll_5386FBB18CEFBEF3.mvfrm
Library\Bee\artifacts\mvdfrm\Unity.Barracuda.iOSBLAS.ref.dll_894EA1C53BC10C8E.mvfrm
Library\Bee\artifacts\mvdfrm\Unity.Burst.Editor.ref.dll_222C82CECB47A66F.mvfrm
Library\Bee\artifacts\mvdfrm\Unity.Burst.ref.dll_3835BB91EC2C0D62.mvfrm
Library\Bee\artifacts\mvdfrm\Unity.EditorCoroutines.Editor.ref.dll_1315E0A407C70415.mvfrm
Library\Bee\artifacts\mvdfrm\Unity.InputSystem.ref.dll_7B1D397D2193763B.mvfrm
Library\Bee\artifacts\mvdfrm\Unity.InternalAPIEditorBridge.007.ref.dll_FB3B27E0DB53967E.mvfrm
Library\Bee\artifacts\mvdfrm\Unity.InternalAPIEditorBridgeDev.001.ref.dll_DF58544ADE665769.mvfrm
Library\Bee\artifacts\mvdfrm\Unity.InternalAPIEngineBridge.007.ref.dll_EDB5E08B40627DC3.mvfrm
Library\Bee\artifacts\mvdfrm\Unity.Localization.Editor.ref.dll_4AF765091EFBEF44.mvfrm
Library\Bee\artifacts\mvdfrm\Unity.Localization.ref.dll_2CD514661EDBFB3D.mvfrm
Library\Bee\artifacts\mvdfrm\Unity.ML-Agents.CommunicatorObjects.ref.dll_AE2076D42DC6BB8F.mvfrm
Library\Bee\artifacts\mvdfrm\Unity.ML-Agents.Editor.ref.dll_34B1ADFA01CD7C53.mvfrm
Library\Bee\artifacts\mvdfrm\Unity.ML-Agents.ref.dll_819659AC7569293E.mvfrm
Library\Bee\artifacts\mvdfrm\Unity.Mathematics.Editor.ref.dll_553CFFCCE7430329.mvfrm
Library\Bee\artifacts\mvdfrm\Unity.Mathematics.ref.dll_66DE4C1C9A03AD08.mvfrm
Library\Bee\artifacts\mvdfrm\Unity.PlasticSCM.Editor.ref.dll_A558B9E65539D7D0.mvfrm
Library\Bee\artifacts\mvdfrm\Unity.Play.Publisher.Editor.ref.dll_A1CDBB08B79CBE2B.mvfrm
Library\Bee\artifacts\mvdfrm\Unity.Postprocessing.Editor.ref.dll_D390A24D3B6D11EA.mvfrm
Library\Bee\artifacts\mvdfrm\Unity.Postprocessing.Runtime.ref.dll_D64FE1030D5C6CA1.mvfrm
Library\Bee\artifacts\mvdfrm\Unity.ProBuilder.AddOns.Editor.ref.dll_ABC72966D7CAF3CC.mvfrm
Library\Bee\artifacts\mvdfrm\Unity.ProBuilder.AssetIdRemapUtility.ref.dll_975A82D5AEE9C802.mvfrm
Library\Bee\artifacts\mvdfrm\Unity.ProBuilder.Editor.ref.dll_638CF0286F7AC9EF.mvfrm
Library\Bee\artifacts\mvdfrm\Unity.ProBuilder.ref.dll_8918F62D623CB1E2.mvfrm
Library\Bee\artifacts\mvdfrm\Unity.RenderPipeline.Universal.ShaderLibrary.ref.dll_D7DD283915E480F1.mvfrm
Library\Bee\artifacts\mvdfrm\Unity.RenderPipelines.Core.Editor.ref.dll_AA6E4515E60A494B.mvfrm
Library\Bee\artifacts\mvdfrm\Unity.RenderPipelines.Core.Runtime.ref.dll_CA4A63933BEF3AB0.mvfrm
Library\Bee\artifacts\mvdfrm\Unity.RenderPipelines.Core.ShaderLibrary.ref.dll_38159DB35CC29EFE.mvfrm
Library\Bee\artifacts\mvdfrm\Unity.RenderPipelines.ShaderGraph.ShaderGraphLibrary.ref.dll_DF61AD73468C057E.mvfrm
Library\Bee\artifacts\mvdfrm\Unity.RenderPipelines.Universal.Editor.ref.dll_ECAA9E877BE61FD7.mvfrm
Library\Bee\artifacts\mvdfrm\Unity.RenderPipelines.Universal.Runtime.ref.dll_9692FC5A7F88C564.mvfrm
Library\Bee\artifacts\mvdfrm\Unity.RenderPipelines.Universal.Shaders.ref.dll_D6FB0BA3BDF7609A.mvfrm
Library\Bee\artifacts\mvdfrm\Unity.ResourceManager.ref.dll_61A71A9B3ED9C301.mvfrm
Library\Bee\artifacts\mvdfrm\Unity.Rider.Editor.ref.dll_DA88E6A3E9EB6155.mvfrm
Library\Bee\artifacts\mvdfrm\Unity.ScriptableBuildPipeline.Editor.ref.dll_4113775FDA80B934.mvfrm
Library\Bee\artifacts\mvdfrm\Unity.ScriptableBuildPipeline.ref.dll_05F0D26EEC97524D.mvfrm
Library\Bee\artifacts\mvdfrm\Unity.Searcher.Editor.ref.dll_1D712DD21DFFF248.mvfrm
Library\Bee\artifacts\mvdfrm\Unity.ShaderGraph.Editor.ref.dll_CA6C4521A25CEDB6.mvfrm
Library\Bee\artifacts\mvdfrm\Unity.Sysroot.Linux_x86_64.ref.dll_0CF00D8B82A87F25.mvfrm
Library\Bee\artifacts\mvdfrm\Unity.SysrootPackage.Editor.ref.dll_08B16BA041802A06.mvfrm
Library\Bee\artifacts\mvdfrm\Unity.TextMeshPro.Editor.ref.dll_D0BA3615D322EF6C.mvfrm
Library\Bee\artifacts\mvdfrm\Unity.TextMeshPro.ref.dll_02929A3ECA791895.mvfrm
Library\Bee\artifacts\mvdfrm\Unity.Timeline.Editor.ref.dll_17F688653313AA4C.mvfrm
Library\Bee\artifacts\mvdfrm\Unity.Timeline.ref.dll_16F8EA6B67022FB5.mvfrm
Library\Bee\artifacts\mvdfrm\Unity.Toolchain.Win-x86_64-Linux-x86_64.ref.dll_64DDAC33FF976D62.mvfrm
Library\Bee\artifacts\mvdfrm\Unity.Tutorials.Core.Editor.ref.dll_06FC4649073EB985.mvfrm
Library\Bee\artifacts\mvdfrm\Unity.Tutorials.Core.ref.dll_79744870468940EC.mvfrm
Library\Bee\artifacts\mvdfrm\Unity.VSCode.Editor.ref.dll_AE868214B5ED3D13.mvfrm
Library\Bee\artifacts\mvdfrm\Unity.VisualEffectGraph.Editor.ref.dll_F78A7DF3763851D2.mvfrm
Library\Bee\artifacts\mvdfrm\Unity.VisualEffectGraph.Runtime.ref.dll_1844AAD4CF3D1A39.mvfrm
Library\Bee\artifacts\mvdfrm\Unity.VisualScripting.Core.Editor.ref.dll_514B12BC0D1D8DB7.mvfrm
Library\Bee\artifacts\mvdfrm\Unity.VisualScripting.Core.ref.dll_BF8650D11F8E519A.mvfrm
Library\Bee\artifacts\mvdfrm\Unity.VisualScripting.Flow.Editor.ref.dll_CE7BFB6B1BFC18F8.mvfrm
Library\Bee\artifacts\mvdfrm\Unity.VisualScripting.Flow.ref.dll_06973127A197C649.mvfrm
Library\Bee\artifacts\mvdfrm\Unity.VisualScripting.SettingsProvider.Editor.ref.dll_EE1755C0672F8EE2.mvfrm
Library\Bee\artifacts\mvdfrm\Unity.VisualScripting.Shared.Editor.ref.dll_6CA31C4FA5286AB1.mvfrm
Library\Bee\artifacts\mvdfrm\Unity.VisualScripting.State.Editor.ref.dll_DC1879B0E64A8F15.mvfrm
Library\Bee\artifacts\mvdfrm\Unity.VisualScripting.State.ref.dll_900B338E31D9525C.mvfrm
Library\Bee\artifacts\mvdfrm\Unity.VisualStudio.Editor.ref.dll_0FE027DDD6F41767.mvfrm
Library\Bee\artifacts\mvdfrm\UnityEditor.CacheServer.ref.dll_D35315FE04DC6674.mvfrm
Library\Bee\artifacts\mvdfrm\UnityEditor.TestRunner.ref.dll_A805A84D9B0C22D9.mvfrm
Library\Bee\artifacts\mvdfrm\UnityEditor.UI.ref.dll_0174E068A5FA251B.mvfrm
Library\Bee\artifacts\mvdfrm\UnityEngine.TestRunner.ref.dll_7423F2FBC6CF80C4.mvfrm
Library\Bee\artifacts\mvdfrm\UnityEngine.UI.ref.dll_BDDAB6C3AC1C4D86.mvfrm
Library\Bee\artifacts\mvdfrm\UnityEditor.Graphs.dll_6EF0BD17A2091258.mvfrm
Library\Bee\artifacts\mvdfrm\UnityEditor.CoreModule.dll_14CC57ED6DF42E26.mvfrm
Library\Bee\artifacts\mvdfrm\UnityEditor.DeviceSimulatorModule.dll_F90BC291B6B3427B.mvfrm
Library\Bee\artifacts\mvdfrm\UnityEditor.DiagnosticsModule.dll_A54D081BB041DE09.mvfrm
Library\Bee\artifacts\mvdfrm\UnityEditor.dll_9EEFD057EEB4E28F.mvfrm
Library\Bee\artifacts\mvdfrm\UnityEditor.GraphViewModule.dll_D7F23073726A1AC0.mvfrm
Library\Bee\artifacts\mvdfrm\UnityEditor.PackageManagerUIModule.dll_2FD7468B37F28802.mvfrm
Library\Bee\artifacts\mvdfrm\UnityEditor.QuickSearchModule.dll_305C89290918DA62.mvfrm
Library\Bee\artifacts\mvdfrm\UnityEditor.SceneTemplateModule.dll_90B65EEEBD8A1923.mvfrm
Library\Bee\artifacts\mvdfrm\UnityEditor.TextCoreFontEngineModule.dll_E548684BF5341CE4.mvfrm
Library\Bee\artifacts\mvdfrm\UnityEditor.TextCoreTextEngineModule.dll_2D309EBD84B7D602.mvfrm
Library\Bee\artifacts\mvdfrm\UnityEditor.UIBuilderModule.dll_2C7ADD8FE52293F4.mvfrm
Library\Bee\artifacts\mvdfrm\UnityEditor.UIElementsModule.dll_522A11C778CFE7A2.mvfrm
Library\Bee\artifacts\mvdfrm\UnityEditor.UIElementsSamplesModule.dll_5C3F6E6BF25949EB.mvfrm
Library\Bee\artifacts\mvdfrm\UnityEditor.UIServiceModule.dll_656CEEF2CE59E40E.mvfrm
Library\Bee\artifacts\mvdfrm\UnityEditor.UnityConnectModule.dll_2E409C6C2D99EFDC.mvfrm
Library\Bee\artifacts\mvdfrm\UnityEngine.AccessibilityModule.dll_C35BCA85BE0040C0.mvfrm
Library\Bee\artifacts\mvdfrm\UnityEngine.AIModule.dll_A753A3E037E0B3BA.mvfrm
Library\Bee\artifacts\mvdfrm\UnityEngine.AndroidJNIModule.dll_D072FA9AC1EF5678.mvfrm
Library\Bee\artifacts\mvdfrm\UnityEngine.AnimationModule.dll_A677AC9C4CC6EF66.mvfrm
Library\Bee\artifacts\mvdfrm\UnityEngine.ARModule.dll_60C668E394FE1283.mvfrm
Library\Bee\artifacts\mvdfrm\UnityEngine.AssetBundleModule.dll_7445BC1A6B7F8F54.mvfrm
Library\Bee\artifacts\mvdfrm\UnityEngine.AudioModule.dll_59C6F55AE77506D8.mvfrm
Library\Bee\artifacts\mvdfrm\UnityEngine.ClothModule.dll_C0AF5255C191E5BC.mvfrm
Library\Bee\artifacts\mvdfrm\UnityEngine.ClusterInputModule.dll_ADDD1181DF21C2A2.mvfrm
Library\Bee\artifacts\mvdfrm\UnityEngine.ClusterRendererModule.dll_FEB88503266E4FFF.mvfrm
Library\Bee\artifacts\mvdfrm\UnityEngine.CoreModule.dll_37ED2B4015F99951.mvfrm
Library\Bee\artifacts\mvdfrm\UnityEngine.CrashReportingModule.dll_5C865C06BF66A989.mvfrm
Library\Bee\artifacts\mvdfrm\UnityEngine.DirectorModule.dll_F0F28E24383533AE.mvfrm
Library\Bee\artifacts\mvdfrm\UnityEngine.dll_D19417304D286F74.mvfrm
Library\Bee\artifacts\mvdfrm\UnityEngine.DSPGraphModule.dll_F643EF8DAA9604CF.mvfrm
Library\Bee\artifacts\mvdfrm\UnityEngine.GameCenterModule.dll_FAC044B588304769.mvfrm
Library\Bee\artifacts\mvdfrm\UnityEngine.GIModule.dll_3F8FECEDD38F9BD4.mvfrm
Library\Bee\artifacts\mvdfrm\UnityEngine.GridModule.dll_155E472E2E4E2F48.mvfrm
Library\Bee\artifacts\mvdfrm\UnityEngine.HotReloadModule.dll_27C06AA227FA0AE8.mvfrm
Library\Bee\artifacts\mvdfrm\UnityEngine.ImageConversionModule.dll_6AAA82B3A89307F3.mvfrm
Library\Bee\artifacts\mvdfrm\UnityEngine.IMGUIModule.dll_922694C1ADA69AB9.mvfrm
Library\Bee\artifacts\mvdfrm\UnityEngine.InputLegacyModule.dll_058AD73903714545.mvfrm
Library\Bee\artifacts\mvdfrm\UnityEngine.InputModule.dll_C03CBD0B5DAD2B7C.mvfrm
Library\Bee\artifacts\mvdfrm\UnityEngine.JSONSerializeModule.dll_237353C1BD3BA14A.mvfrm
Library\Bee\artifacts\mvdfrm\UnityEngine.LocalizationModule.dll_EC29DBD4769DB59B.mvfrm
Library\Bee\artifacts\mvdfrm\UnityEngine.NVIDIAModule.dll_573FFFF5EA5591DD.mvfrm
Library\Bee\artifacts\mvdfrm\UnityEngine.ParticleSystemModule.dll_AF98A5532D783517.mvfrm
Library\Bee\artifacts\mvdfrm\UnityEngine.PerformanceReportingModule.dll_ABE06EBAEEECBF10.mvfrm
Library\Bee\artifacts\mvdfrm\UnityEngine.Physics2DModule.dll_F31D9C8CEDC3E6FB.mvfrm
Library\Bee\artifacts\mvdfrm\UnityEngine.PhysicsModule.dll_8A6E15FDBCF87CA9.mvfrm
Library\Bee\artifacts\mvdfrm\UnityEngine.ProfilerModule.dll_2338C75AD18EBABB.mvfrm
Library\Bee\artifacts\mvdfrm\UnityEngine.RuntimeInitializeOnLoadManagerInitializerModule.dll_31292F5BE4D3CDC4.mvfrm
Library\Bee\artifacts\mvdfrm\UnityEngine.ScreenCaptureModule.dll_3D5B0146D1A7CDAC.mvfrm
Library\Bee\artifacts\mvdfrm\UnityEngine.SharedInternalsModule.dll_EEBBC1891FC10343.mvfrm
Library\Bee\artifacts\mvdfrm\UnityEngine.SpriteMaskModule.dll_E3ECB745A99FDCE3.mvfrm
Library\Bee\artifacts\mvdfrm\UnityEngine.SpriteShapeModule.dll_8DA6E9752121C75E.mvfrm
Library\Bee\artifacts\mvdfrm\UnityEngine.StreamingModule.dll_5B0C99EC9C4EA6A4.mvfrm
Library\Bee\artifacts\mvdfrm\UnityEngine.SubstanceModule.dll_37B7AE35E7A1A4B2.mvfrm
Library\Bee\artifacts\mvdfrm\UnityEngine.SubsystemsModule.dll_4E9A1DA777E7C4F6.mvfrm
Library\Bee\artifacts\mvdfrm\UnityEngine.TerrainModule.dll_A4B4916C92B6C597.mvfrm
Library\Bee\artifacts\mvdfrm\UnityEngine.TerrainPhysicsModule.dll_B0134E2646BB2FA4.mvfrm
Library\Bee\artifacts\mvdfrm\UnityEngine.TextCoreFontEngineModule.dll_63A7E39F0831DBAF.mvfrm
Library\Bee\artifacts\mvdfrm\UnityEngine.TextCoreTextEngineModule.dll_AB901A1097B594CD.mvfrm
Library\Bee\artifacts\mvdfrm\UnityEngine.TextRenderingModule.dll_669A735188DF4DA1.mvfrm
Library\Bee\artifacts\mvdfrm\UnityEngine.TilemapModule.dll_43B0F8EDAA73A6A0.mvfrm
Library\Bee\artifacts\mvdfrm\UnityEngine.TLSModule.dll_B585B6F3F7A9FB3D.mvfrm
Library\Bee\artifacts\mvdfrm\UnityEngine.UIElementsModule.dll_52D87F0F7B1400ED.mvfrm
Library\Bee\artifacts\mvdfrm\UnityEngine.UIElementsNativeModule.dll_7A50FB20A96AF824.mvfrm
Library\Bee\artifacts\mvdfrm\UnityEngine.UIModule.dll_A2C7420D9427B966.mvfrm
Library\Bee\artifacts\mvdfrm\UnityEngine.UmbraModule.dll_D49BA173749BB24B.mvfrm
Library\Bee\artifacts\mvdfrm\UnityEngine.UNETModule.dll_CA93732963088ECA.mvfrm
Library\Bee\artifacts\mvdfrm\UnityEngine.UnityAnalyticsModule.dll_CF38161CD99F8713.mvfrm
Library\Bee\artifacts\mvdfrm\UnityEngine.UnityConnectModule.dll_1BA0207B2821F087.mvfrm
Library\Bee\artifacts\mvdfrm\UnityEngine.UnityCurlModule.dll_D9944DCDBCDAE153.mvfrm
Library\Bee\artifacts\mvdfrm\UnityEngine.UnityTestProtocolModule.dll_1802245E4C549F41.mvfrm
Library\Bee\artifacts\mvdfrm\UnityEngine.UnityWebRequestAssetBundleModule.dll_911A5CF9006A4024.mvfrm
Library\Bee\artifacts\mvdfrm\UnityEngine.UnityWebRequestAudioModule.dll_23DCC299755789A8.mvfrm
Library\Bee\artifacts\mvdfrm\UnityEngine.UnityWebRequestModule.dll_7C498A5DB387A272.mvfrm
Library\Bee\artifacts\mvdfrm\UnityEngine.UnityWebRequestTextureModule.dll_5379182B07ED647D.mvfrm
Library\Bee\artifacts\mvdfrm\UnityEngine.UnityWebRequestWWWModule.dll_76525F6C87755139.mvfrm
Library\Bee\artifacts\mvdfrm\UnityEngine.VehiclesModule.dll_68B587A3B25F0349.mvfrm
Library\Bee\artifacts\mvdfrm\UnityEngine.VFXModule.dll_36644F62CE1764AA.mvfrm
Library\Bee\artifacts\mvdfrm\UnityEngine.VideoModule.dll_7ED079C5AA07227D.mvfrm
Library\Bee\artifacts\mvdfrm\UnityEngine.VirtualTexturingModule.dll_9EDDAF8F821978AF.mvfrm
Library\Bee\artifacts\mvdfrm\UnityEngine.VRModule.dll_F599689335E23EDE.mvfrm
Library\Bee\artifacts\mvdfrm\UnityEngine.WindModule.dll_AE3C0668A73017BA.mvfrm
Library\Bee\artifacts\mvdfrm\UnityEngine.XRModule.dll_28582B97BF1C8C3C.mvfrm
Library\Bee\artifacts\mvdfrm\Unity.Android.Gradle.dll_C39DDA4436858B0E.mvfrm
Library\Bee\artifacts\mvdfrm\Unity.Android.Types.dll_9F0094965B54F30E.mvfrm
Library\Bee\artifacts\mvdfrm\UnityEditor.Android.Extensions.dll_7DED0ABB0399AC0E.mvfrm
Library\Bee\artifacts\mvdfrm\UnityEditor.iOS.Extensions.Common.dll_5140046690BD366B.mvfrm
Library\Bee\artifacts\mvdfrm\UnityEditor.iOS.Extensions.dll_EAC35ED256CCA98A.mvfrm
Library\Bee\artifacts\mvdfrm\UnityEditor.iOS.Extensions.Xcode.dll_57558F3C808FD211.mvfrm
Library\Bee\artifacts\mvdfrm\UnityEditor.UWP.Extensions.dll_EF75D6C137E02145.mvfrm
Library\Bee\artifacts\mvdfrm\UnityEditor.WebGL.Extensions.dll_E48A6BF0E8B191EA.mvfrm
Library\Bee\artifacts\mvdfrm\UnityEditor.WindowsStandalone.Extensions.dll_B36910EC2C061BDA.mvfrm
Library\Bee\artifacts\mvdfrm\Unity.Burst.Cecil.dll_A94776148C3F4FDF.mvfrm
Library\Bee\artifacts\mvdfrm\Unity.Burst.Cecil.Mdb.dll_1FCA459DD4BE12DC.mvfrm
Library\Bee\artifacts\mvdfrm\Unity.Burst.Cecil.Pdb.dll_371CBE0D5373145F.mvfrm
Library\Bee\artifacts\mvdfrm\Unity.Burst.Cecil.Rocks.dll_5BCA080A8318665F.mvfrm
Library\Bee\artifacts\mvdfrm\Unity.Burst.Unsafe.dll_36CFCA2A7D56D404.mvfrm
Library\Bee\artifacts\mvdfrm\Unity.Plastic.Antlr3.Runtime.dll_3CE08DF79D29E255.mvfrm
Library\Bee\artifacts\mvdfrm\Unity.Plastic.Newtonsoft.Json.dll_53ED6F4DCEFAA710.mvfrm
Library\Bee\artifacts\mvdfrm\Unity.VisualScripting.IonicZip.dll_7EC3DC574DEB615F.mvfrm
Library\Bee\artifacts\mvdfrm\Unity.VisualScripting.YamlDotNet.dll_CE0063D64BBB9DCD.mvfrm
Library\Bee\artifacts\mvdfrm\Unity.VisualScripting.TextureAssets.dll_651E8D2A0C88FBC5.mvfrm
Library\Bee\artifacts\mvdfrm\Unity.VisualScripting.Antlr3.Runtime.dll_7F6D8AB77C84ADEC.mvfrm