%YAML 1.1
%TAG !u! tag:unity3d.com,2011:
--- !u!114 &-7539746398642500517
MonoBehaviour:
  m_ObjectHideFlags: 11
  m_CorrespondingSourceObject: {fileID: 0}
  m_PrefabInstance: {fileID: 0}
  m_PrefabAsset: {fileID: 0}
  m_GameObject: {fileID: 0}
  m_Enabled: 1
  m_EditorHideFlags: 0
  m_Script: {fileID: 11500000, guid: d0353a89b1f911e48b9e16bdc9f2e058, type: 3}
  m_Name: 
  m_EditorClassIdentifier: 
  version: 5
--- !u!21 &2100000
Material:
  serializedVersion: 6
  m_ObjectHideFlags: 0
  m_CorrespondingSourceObject: {fileID: 0}
  m_PrefabInstance: {fileID: 0}
  m_PrefabAsset: {fileID: 0}
  m_Name: NoiseUnlit
  m_Shader: {fileID: -6465566751694194690, guid: 1e4541427fb97384ea4b8c59c23b77fc,
    type: 3}
  m_ShaderKeywords: 
  m_LightmapFlags: 4
  m_EnableInstancingVariants: 0
  m_DoubleSidedGI: 0
  m_CustomRenderQueue: -1
  stringTagMap: {}
  disabledShaderPasses: []
  m_SavedProperties:
    serializedVersion: 3
    m_TexEnvs:
    - DistortionTexture:
        m_Texture: {fileID: 2800000, guid: c91057bea4990764b9d6c6a06a0a77a5, type: 3}
        m_Scale: {x: 1, y: 1}
        m_Offset: {x: 0, y: 0}
    - Pattern:
        m_Texture: {fileID: 2800000, guid: 936a43635c57b0a408fb70bee7efbb2a, type: 3}
        m_Scale: {x: 1, y: 1}
        m_Offset: {x: 0, y: 0}
    - ProjectedTexture:
        m_Texture: {fileID: 2800000, guid: 30182b4d0144f224dac8c87289e10440, type: 3}
        m_Scale: {x: 1, y: 1}
        m_Offset: {x: 0, y: 0}
    - ScrollingTexture:
        m_Texture: {fileID: 2800000, guid: 698aece37c3ef5a4eb3b93bec3f2eb00, type: 3}
        m_Scale: {x: 1, y: 1}
        m_Offset: {x: 0, y: 0}
    - _BaseMap:
        m_Texture: {fileID: 0}
        m_Scale: {x: 1, y: 1}
        m_Offset: {x: 0, y: 0}
    - _BumpMap:
        m_Texture: {fileID: 0}
        m_Scale: {x: 1, y: 1}
        m_Offset: {x: 0, y: 0}
    - _EmissionMap:
        m_Texture: {fileID: 0}
        m_Scale: {x: 1, y: 1}
        m_Offset: {x: 0, y: 0}
    - _MainTex:
        m_Texture: {fileID: 0}
        m_Scale: {x: 1, y: 1}
        m_Offset: {x: 0, y: 0}
    - _MetallicGlossMap:
        m_Texture: {fileID: 0}
        m_Scale: {x: 1, y: 1}
        m_Offset: {x: 0, y: 0}
    - _OcclusionMap:
        m_Texture: {fileID: 0}
        m_Scale: {x: 1, y: 1}
        m_Offset: {x: 0, y: 0}
    - _SpecGlossMap:
        m_Texture: {fileID: 0}
        m_Scale: {x: 1, y: 1}
        m_Offset: {x: 0, y: 0}
    - _Texture2DAsset_39807F01_Out_0:
        m_Texture: {fileID: 2800000, guid: ee0927d2b4c556841b34fd69bf7e06b9, type: 3}
        m_Scale: {x: 1, y: 1}
        m_Offset: {x: 0, y: 0}
    m_Ints: []
    m_Floats:
    - CellDensity: 5.6
    - ColorFill: 0
    - DissolveAmount: 0.455
    - DissolveBorder: 0.03
    - DissolveNoiseScale: 20
    - DistortionScale: 6
    - DistortionSpeed: 0.1
    - EffectAlpha: 0.4
    - FresnelOffset: 0
    - FresnelPower: 4
    - MixEffect: 1
    - PatternScale: 8
    - PatternShuffleSpeed: 1
    - PatternSpeed: 0.1
    - RippleDensity: 4
    - RippleSize: 4
    - RippleSpeed: 2
    - Vector1_DD45D400: 0
    - _Alpha: 0
    - _AlphaClip: 0
    - _Blend: 0
    - _BumpScale: 1
    - _Cull: 2
    - _Cutoff: 0
    - _DstBlend: 0
    - _EnvironmentReflections: 1
    - _GlossMapScale: 0
    - _Glossiness: 0
    - _GlossyReflections: 0
    - _Metallic: 0
    - _OcclusionStrength: 1
    - _QueueOffset: 0
    - _ReceiveShadows: 1
    - _Smoothness: 0.5
    - _SmoothnessTextureChannel: 0
    - _SpecularHighlights: 1
    - _SrcBlend: 1
    - _Surface: 0
    - _WorkflowMode: 1
    - _ZWrite: 1
    m_Colors:
    - BorderColor: {r: 0.1284246, g: 1.296477, b: 0.1383582, a: 1}
    - DistortionDirection: {r: 0.1, g: 0.1, b: 0, a: 0}
    - EmissionColor: {r: 0.1882353, g: 1.890196, b: 1.788235, a: 1}
    - NoiseDistribution: {r: -0.03, g: 0.18, b: 0, a: 0}
    - NoiseTeint: {r: 1, g: 1, b: 1, a: 1}
    - PatternSpeed: {r: 0.1, g: 0.1, b: 0, a: 0}
    - PatternTiling: {r: 2, g: 2, b: 0, a: 0}
    - RippleColor: {r: 1.0090526, g: 0.8739117, b: 0.29731017, a: 1}
    - ScrollingSpeed: {r: 0, g: 0.1, b: 0, a: 0}
    - ScrollingTextureTiling: {r: 1, g: 1, b: 0, a: 0}
    - WaterColor: {r: 0.0226949, g: 0.1698879, b: 0.3207547, a: 0.19607843}
    - _BaseColor: {r: 1, g: 1, b: 1, a: 1}
    - _Color: {r: 0.5, g: 0.5, b: 0.5, a: 1}
    - _EmissionColor: {r: 0, g: 0, b: 0, a: 1}
    - _Offset: {r: 0, g: 0, b: 0, a: 0}
    - _SpecColor: {r: 0.19999996, g: 0.19999996, b: 0.19999996, a: 1}
    - _Tiling: {r: 1, g: 1, b: 0, a: 0}
  m_BuildTextureStacks: []
