%YAML 1.1
%TAG !u! tag:unity3d.com,2011:
--- !u!114 &-7105920576135499574
MonoBehaviour:
  m_ObjectHideFlags: 11
  m_CorrespondingSourceObject: {fileID: 0}
  m_PrefabInstance: {fileID: 0}
  m_PrefabAsset: {fileID: 0}
  m_GameObject: {fileID: 0}
  m_Enabled: 1
  m_EditorHideFlags: 0
  m_Script: {fileID: 11500000, guid: d0353a89b1f911e48b9e16bdc9f2e058, type: 3}
  m_Name: 
  m_EditorClassIdentifier: 
  version: 5
--- !u!21 &2100000
Material:
  serializedVersion: 6
  m_ObjectHideFlags: 0
  m_CorrespondingSourceObject: {fileID: 0}
  m_PrefabInstance: {fileID: 0}
  m_PrefabAsset: {fileID: 0}
  m_Name: PolygonNature_Leaves_Base_Yellow
  m_Shader: {fileID: -6465566751694194690, guid: c767be1032f805747872f8fa75577d5b,
    type: 3}
  m_ShaderKeywords: 
  m_LightmapFlags: 4
  m_EnableInstancingVariants: 0
  m_DoubleSidedGI: 0
  m_CustomRenderQueue: -1
  stringTagMap: {}
  disabledShaderPasses: []
  m_SavedProperties:
    serializedVersion: 3
    m_TexEnvs:
    - Texture2D_38206155:
        m_Texture: {fileID: 2800000, guid: 99c4608ee9333d248989392de94081fd, type: 3}
        m_Scale: {x: 1, y: 1}
        m_Offset: {x: 0, y: 0}
    - Texture2D_CAD82441:
        m_Texture: {fileID: 2800000, guid: f6719627c8a45d1459ff89b93a967b05, type: 3}
        m_Scale: {x: 1, y: 1}
        m_Offset: {x: 0, y: 0}
    - Texture2D_CFD6D642:
        m_Texture: {fileID: 2800000, guid: 9f1909d95587cd442b62112b425fc2aa, type: 3}
        m_Scale: {x: 1, y: 1}
        m_Offset: {x: 0, y: 0}
    - _BumpMap:
        m_Texture: {fileID: 0}
        m_Scale: {x: 1, y: 1}
        m_Offset: {x: 0, y: 0}
    - _DetailAlbedoMap:
        m_Texture: {fileID: 0}
        m_Scale: {x: 1, y: 1}
        m_Offset: {x: 0, y: 0}
    - _DetailMask:
        m_Texture: {fileID: 0}
        m_Scale: {x: 1, y: 1}
        m_Offset: {x: 0, y: 0}
    - _DetailNormalMap:
        m_Texture: {fileID: 0}
        m_Scale: {x: 1, y: 1}
        m_Offset: {x: 0, y: 0}
    - _Emission:
        m_Texture: {fileID: 2800000, guid: 99c4608ee9333d248989392de94081fd, type: 3}
        m_Scale: {x: 1, y: 1}
        m_Offset: {x: 0, y: 0}
    - _EmissionMap:
        m_Texture: {fileID: 0}
        m_Scale: {x: 1, y: 1}
        m_Offset: {x: 0, y: 0}
    - _Leaves_NoiseTexture:
        m_Texture: {fileID: 2800000, guid: ccb2545f0a1b98248ae14305439c4e13, type: 3}
        m_Scale: {x: 1, y: 1}
        m_Offset: {x: 0, y: 0}
    - _MainTex:
        m_Texture: {fileID: 2800000, guid: 2edd58f7c433e934db9029c375173b44, type: 3}
        m_Scale: {x: 1, y: 1}
        m_Offset: {x: 0, y: 0}
    - _MainTexture:
        m_Texture: {fileID: 2800000, guid: f6719627c8a45d1459ff89b93a967b05, type: 3}
        m_Scale: {x: 1, y: 1}
        m_Offset: {x: 0, y: 0}
    - _MetallicGlossMap:
        m_Texture: {fileID: 0}
        m_Scale: {x: 1, y: 1}
        m_Offset: {x: 0, y: 0}
    - _OcclusionMap:
        m_Texture: {fileID: 0}
        m_Scale: {x: 1, y: 1}
        m_Offset: {x: 0, y: 0}
    - _ParallaxMap:
        m_Texture: {fileID: 0}
        m_Scale: {x: 1, y: 1}
        m_Offset: {x: 0, y: 0}
    - _Texture2DAsset_4489E30E_Out_0:
        m_Texture: {fileID: 2800000, guid: 9f1909d95587cd442b62112b425fc2aa, type: 3}
        m_Scale: {x: 1, y: 1}
        m_Offset: {x: 0, y: 0}
    - _TextureSample0:
        m_Texture: {fileID: 2800000, guid: 4aaf5eafc291ee24ba7cefe12e6677a8, type: 3}
        m_Scale: {x: 1, y: 1}
        m_Offset: {x: 0, y: 0}
    - _TextureSample1:
        m_Texture: {fileID: 0}
        m_Scale: {x: 1, y: 1}
        m_Offset: {x: 0, y: 0}
    - _Tree_NoiseTexture:
        m_Texture: {fileID: 2800000, guid: 4aaf5eafc291ee24ba7cefe12e6677a8, type: 3}
        m_Scale: {x: 0, y: 1}
        m_Offset: {x: 0, y: 0}
    - _texcoord:
        m_Texture: {fileID: 0}
        m_Scale: {x: 1, y: 1}
        m_Offset: {x: 0, y: 0}
    - unity_Lightmaps:
        m_Texture: {fileID: 0}
        m_Scale: {x: 1, y: 1}
        m_Offset: {x: 0, y: 0}
    - unity_LightmapsInd:
        m_Texture: {fileID: 0}
        m_Scale: {x: 1, y: 1}
        m_Offset: {x: 0, y: 0}
    - unity_ShadowMasks:
        m_Texture: {fileID: 0}
        m_Scale: {x: 1, y: 1}
        m_Offset: {x: 0, y: 0}
    m_Ints: []
    m_Floats:
    - Vector1_7722A149: 0.05
    - Vector1_989A1C37: 0.5
    - Vector1_AADD838F: 10
    - Vector1_C1D16DBE: 2
    - Vector1_C39D93FF: 0.2
    - Vector1_CE098D07: 0.01
    - Vector1_EBB5CF27: 6
    - _Big_Wave: 7.7
    - _Big_WindAmount: 0.4
    - _Big_Windspeed: 0.75
    - _BumpScale: 1
    - _Cutoff: 0.5
    - _DetailNormalMapScale: 1
    - _DstBlend: 0
    - _GlossMapScale: 1
    - _Glossiness: 0.5
    - _GlossyReflections: 1
    - _Leaves_Wave: 6.06
    - _Leaves_WindAmount: 0.26
    - _Leaves_WindSpeed: 0.2
    - _Metallic: 0
    - _Mode: 0
    - _OcclusionStrength: 1
    - _Parallax: 0.02
    - _QueueControl: 0
    - _QueueOffset: 0
    - _Small_Wave: 1.9
    - _Small_WindAmount: 0.1
    - _Small_WindSpeed: 0.01
    - _Smoothness: 0
    - _SmoothnessTextureChannel: 0
    - _Specular: 0
    - _SpecularHighlights: 1
    - _SrcBlend: 1
    - _Tree_Wave: 7.97
    - _Tree_WindAmount: 0.1
    - _Tree_WindSpeed: 0
    - _Tree_Windspeed: 0.49
    - _UVSec: 0
    - _Wave: 8.42
    - _WindSpeed: 0.1
    - _ZWrite: 1
    - __dirty: 1
    - _edgeFoamAmount: 5
    - _edgeFoamCutoff: 4.8
    - _fakeSpecular: 0.3
    - _waterDepth: 9.91
    - _waterSmoothness: 0
    m_Colors:
    - Color_369F793F: {r: 1, g: 0.6775111, b: 0, a: 0}
    - Color_FA85148A: {r: 0.8113208, g: 0.40566036, b: 0, a: 0}
    - _Color: {r: 1, g: 1, b: 1, a: 1}
    - _ColorTint: {r: 0.6838235, g: 0.47035405, b: 0.2765463, a: 0}
    - _EmissionColor: {r: 0.32352942, g: 0.1004057, b: 0, a: 0}
    - _deepColor: {r: 0.01938236, g: 0.06480328, b: 0.07036011, a: 1}
    - _edgeFoamColor: {r: 0.7454045, g: 0.7454045, b: 0.7454045, a: 1}
    - _shallowColor: {r: 0.07421358, g: 0.1529262, b: 0.1470273, a: 1}
  m_BuildTextureStacks: []
