%YAML 1.1
%TAG !u! tag:unity3d.com,2011:
--- !u!21 &2100000
Material:
  serializedVersion: 6
  m_ObjectHideFlags: 0
  m_CorrespondingSourceObject: {fileID: 0}
  m_PrefabInstance: {fileID: 0}
  m_PrefabAsset: {fileID: 0}
  m_Name: parallax
  m_Shader: {fileID: 4800000, guid: bafddbd887f0ca341981e20c05391b59, type: 3}
  m_ShaderKeywords: 
  m_LightmapFlags: 4
  m_EnableInstancingVariants: 0
  m_DoubleSidedGI: 0
  m_CustomRenderQueue: -1
  stringTagMap: {}
  disabledShaderPasses: []
  m_SavedProperties:
    serializedVersion: 3
    m_TexEnvs:
    - Texture2D_14EDE7D4:
        m_Texture: {fileID: 2800000, guid: 0dfa8f2fd623d4d429d8533c9b641c6c, type: 3}
        m_Scale: {x: 1, y: 1}
        m_Offset: {x: 0, y: 0}
    - Texture2D_171AA1FF:
        m_Texture: {fileID: 2800000, guid: 192bd2e76bf1ac7469511a05f4555790, type: 3}
        m_Scale: {x: 1, y: 1}
        m_Offset: {x: 0, y: 0}
    - Texture2D_31E0EB3B:
        m_Texture: {fileID: 2800000, guid: 192bd2e76bf1ac7469511a05f4555790, type: 3}
        m_Scale: {x: 1, y: 1}
        m_Offset: {x: 0, y: 0}
    - Texture2D_53B2CF3F:
        m_Texture: {fileID: 2800000, guid: 0dfa8f2fd623d4d429d8533c9b641c6c, type: 3}
        m_Scale: {x: 1, y: 1}
        m_Offset: {x: 0, y: 0}
    - Texture2D_6349D8AF:
        m_Texture: {fileID: 2800000, guid: d08abd1af0bdd6744be124e10c45d930, type: 3}
        m_Scale: {x: 1, y: 1}
        m_Offset: {x: 0, y: 0}
    - Texture2D_65BB42C6:
        m_Texture: {fileID: 2800000, guid: 192bd2e76bf1ac7469511a05f4555790, type: 3}
        m_Scale: {x: 1, y: 1}
        m_Offset: {x: 0, y: 0}
    - Texture2D_7F38F929:
        m_Texture: {fileID: 2800000, guid: d08abd1af0bdd6744be124e10c45d930, type: 3}
        m_Scale: {x: 1, y: 1}
        m_Offset: {x: 0, y: 0}
    - Texture2D_E6AF7F7C:
        m_Texture: {fileID: 2800000, guid: 0dfa8f2fd623d4d429d8533c9b641c6c, type: 3}
        m_Scale: {x: 1, y: 1}
        m_Offset: {x: 0, y: 0}
    - Texture2D_EC0750DC:
        m_Texture: {fileID: 2800000, guid: d08abd1af0bdd6744be124e10c45d930, type: 3}
        m_Scale: {x: 1, y: 1}
        m_Offset: {x: 0, y: 0}
    m_Ints: []
    m_Floats:
    - Vector1_16E66955: 3
    - Vector1_216A42F: 0.9
    - Vector1_21A15DBC: 1
    - Vector1_2E389516: -0.12
    - Vector1_37B8E1D2: 1
    - Vector1_3BDFEF02: -0.129
    - Vector1_3C898C9F: 1
    - Vector1_42A8C373: 4.2
    - Vector1_47C00FDC: 1
    - Vector1_6265A507: 0.9
    - Vector1_93BA0756: -0.1
    - Vector1_D1CC79DA: 2.75
    - Vector1_FF7241B9: 100
    m_Colors:
    - Vector4_3AFE3EAA: {r: 1, g: 1, b: 0, a: 0}
    - Vector4_AA8F99F8: {r: 1, g: 1, b: 0, a: 0}
    - Vector4_FFE50E7C: {r: 1, g: 1, b: 0, a: 0}
  m_BuildTextureStacks: []
--- !u!114 &7129146704051671976
MonoBehaviour:
  m_ObjectHideFlags: 11
  m_CorrespondingSourceObject: {fileID: 0}
  m_PrefabInstance: {fileID: 0}
  m_PrefabAsset: {fileID: 0}
  m_GameObject: {fileID: 0}
  m_Enabled: 1
  m_EditorHideFlags: 0
  m_Script: {fileID: 11500000, guid: d0353a89b1f911e48b9e16bdc9f2e058, type: 3}
  m_Name: 
  m_EditorClassIdentifier: 
  version: 5
