%YAML 1.1
%TAG !u! tag:unity3d.com,2011:
--- !u!114 &-9216439202231956358
MonoBehaviour:
  m_ObjectHideFlags: 0
  m_CorrespondingSourceObject: {fileID: 0}
  m_PrefabInstance: {fileID: 0}
  m_PrefabAsset: {fileID: 0}
  m_GameObject: {fileID: 0}
  m_Enabled: 1
  m_EditorHideFlags: 0
  m_Script: {fileID: 11500000, guid: 5015748d498a9d94abd4c0c69a786f28, type: 3}
  m_Name: SR_DirectOffset-[FieldMod_Root](Clone)
  m_EditorClassIdentifier: 
  Logic: 0
  Negate: 0
  Global: 0
  Enabled: 1
  Ignore: 0
  OwnerSpawner:
    Enabled: 1
    Name: WallSides
    SpawnerTag: Wall
    StampPrefabID: 4
    Parent: {fileID: -1384073903217246695}
    Rules:
    - {fileID: 5442375147986710860}
    - {fileID: -9216439202231956358}
    Mode: 3
    CellCheckMode: 0
    GridScaling: 0
    OnScalledGrid: 1
    Repeat: 1
    MultipleToSpawn: 0
    ScaleAccess: 1
    DisplayPreviewGUI: 1
    IsSubSpawner: 0
  CellAllow: 1
  AllConditionsMet: 1
  Override: 0
  Randomize: 0
  GetOffsetFromTagged: Untagged
  CheckMode: 0
  Offset: {x: 0, y: 0, z: 0.5}
  OffsetMode: 1
  RandomOffset: {x: 0, y: 0, z: 0}
--- !u!114 &-8586597563252355999
MonoBehaviour:
  m_ObjectHideFlags: 0
  m_CorrespondingSourceObject: {fileID: 0}
  m_PrefabInstance: {fileID: 0}
  m_PrefabAsset: {fileID: 0}
  m_GameObject: {fileID: 0}
  m_Enabled: 1
  m_EditorHideFlags: 0
  m_Script: {fileID: 11500000, guid: 3b7b7d2eb85d19a4da49a85b81a1cb59, type: 3}
  m_Name: SR_RemoveSpawn-[FieldMod_Root]
  m_EditorClassIdentifier: 
  Logic: 0
  Negate: 0
  Global: 0
  Enabled: 1
  Ignore: 0
  OwnerSpawner:
    Enabled: 1
    Name: Gate
    SpawnerTag: 
    StampPrefabID: 3
    Parent: {fileID: -1384073903217246695}
    Rules:
    - {fileID: 6554971827377568395}
    - {fileID: -5226628378721237962}
    - {fileID: -8079658494271421143}
    - {fileID: 37588380085245110}
    - {fileID: -8420412308248807971}
    - {fileID: -1934382550892383441}
    - {fileID: 1993715247317526852}
    Mode: 3
    CellCheckMode: 0
    GridScaling: 0
    OnScalledGrid: 1
    Repeat: 1
    MultipleToSpawn: 0
    ScaleAccess: 1
    DisplayPreviewGUI: 1
    IsSubSpawner: 0
  CellAllow: 1
  AllConditionsMet: 1
  Remove:
    AffectedTags: Wall
    CheckMode: 0
    RemoveCount: 1
    CheckOffset: 1
    OffsetCellPosition: {x: 1, y: 0, z: 0}
    RemoveWhen: 0
    UseSelfRotation: 1
    DegreesTolerance: 45
--- !u!114 &-8420412308248807971
MonoBehaviour:
  m_ObjectHideFlags: 0
  m_CorrespondingSourceObject: {fileID: 0}
  m_PrefabInstance: {fileID: 0}
  m_PrefabAsset: {fileID: 0}
  m_GameObject: {fileID: 0}
  m_Enabled: 1
  m_EditorHideFlags: 0
  m_Script: {fileID: 11500000, guid: c1780a36cb53c55428fa274638bcfb3e, type: 3}
  m_Name: SR_RemoveSpawnsTool-[FieldMod_Root]
  m_EditorClassIdentifier: 
  Logic: 0
  Negate: 0
  Global: 0
  Enabled: 1
  Ignore: 0
  OwnerSpawner:
    Enabled: 1
    Name: Gate
    SpawnerTag: Gate
    StampPrefabID: 3
    Parent: {fileID: -1384073903217246695}
    Rules:
    - {fileID: -5226628378721237962}
    - {fileID: 2166540395723974493}
    - {fileID: -2837746547098859293}
    - {fileID: 7023038663746981536}
    - {fileID: -5368161280879686544}
    - {fileID: 37588380085245110}
    - {fileID: -8420412308248807971}
    - {fileID: -8079658494271421143}
    - {fileID: 7812487417537010947}
    Mode: 3
    CellCheckMode: 0
    GridScaling: 0
    OnScalledGrid: 1
    Repeat: 1
    MultipleToSpawn: 0
    ScaleAccess: 1
    DisplayPreviewGUI: 1
    IsSubSpawner: 0
  CellAllow: 1
  AllConditionsMet: 1
  Removing:
  - AffectedTags: Front
    CheckMode: 0
    RemoveCount: 1
    CheckOffset: 0
    OffsetCellPosition: {x: 0, y: 0, z: 0}
    RemoveWhen: 0
    UseSelfRotation: 1
    DegreesTolerance: 45
  - AffectedTags: Front
    CheckMode: 0
    RemoveCount: 1
    CheckOffset: 1
    OffsetCellPosition: {x: 1, y: 0, z: 0}
    RemoveWhen: 0
    UseSelfRotation: 1
    DegreesTolerance: 45
--- !u!114 &-8079658494271421143
MonoBehaviour:
  m_ObjectHideFlags: 0
  m_CorrespondingSourceObject: {fileID: 0}
  m_PrefabInstance: {fileID: 0}
  m_PrefabAsset: {fileID: 0}
  m_GameObject: {fileID: 0}
  m_Enabled: 1
  m_EditorHideFlags: 0
  m_Script: {fileID: 11500000, guid: f5698d953b70b3542a61cfe5d4517022, type: 3}
  m_Name: SR_CellOperation-[FieldMod_Root]
  m_EditorClassIdentifier: 
  Logic: 0
  Negate: 0
  Global: 0
  Enabled: 1
  Ignore: 0
  OwnerSpawner:
    Enabled: 1
    Name: Gate
    SpawnerTag: Gate
    StampPrefabID: 3
    Parent: {fileID: -1384073903217246695}
    Rules:
    - {fileID: -5226628378721237962}
    - {fileID: 2166540395723974493}
    - {fileID: -2837746547098859293}
    - {fileID: 7023038663746981536}
    - {fileID: -5368161280879686544}
    - {fileID: 37588380085245110}
    - {fileID: -8420412308248807971}
    - {fileID: -8079658494271421143}
    - {fileID: 7812487417537010947}
    Mode: 3
    CellCheckMode: 0
    GridScaling: 0
    OnScalledGrid: 1
    Repeat: 1
    MultipleToSpawn: 0
    ScaleAccess: 1
    DisplayPreviewGUI: 1
    IsSubSpawner: 0
  CellAllow: 1
  AllConditionsMet: 1
  Operation: 2
  TargetCellOffset: {x: 1, y: 0, z: 0}
  OffsetWithRotation: 0
  ToClearTag: 
  CheckMode: 0
  OnRotations: []
--- !u!114 &-7653189938980459589
MonoBehaviour:
  m_ObjectHideFlags: 0
  m_CorrespondingSourceObject: {fileID: 0}
  m_PrefabInstance: {fileID: 0}
  m_PrefabAsset: {fileID: 0}
  m_GameObject: {fileID: 0}
  m_Enabled: 1
  m_EditorHideFlags: 0
  m_Script: {fileID: 11500000, guid: a9d04c0a05ea9784199cc0d7a9227f53, type: 3}
  m_Name: SR_RemoveInPosition-[FieldMod_ExampleDoorHoleSimple(Clone)(Clone)]
  m_EditorClassIdentifier: 
  Logic: 0
  Negate: 0
  Global: 0
  Enabled: 1
  Ignore: 0
  OwnerSpawner:
    Enabled: 1
    Name: WallHoleLarge
    SpawnerTag: 
    StampPrefabID: 0
    Parent: {fileID: 3156508996571138238}
    Rules:
    - {fileID: 5290024196324679011}
    - {fileID: -7653189938980459589}
    Mode: 3
    CellCheckMode: 0
    GridScaling: 0
    OnScalledGrid: 1
    Repeat: 1
    MultipleToSpawn: 0
    ScaleAccess: 1
    DisplayPreviewGUI: 1
    IsSubSpawner: 0
  CellAllow: 1
  AllConditionsMet: 1
  MustHaveTag: Wall
  CheckMode: 0
  CellOffsetMode: 2
  OffsetCell: {x: -1, y: 0, z: 0}
  UseSelfRotation: 2
  PointPositionOffset: {x: 0, y: 0, z: 0}
  OffsetMode: 1
  DistanceMustBe: 0
  RemoveDistance: 0.1
--- !u!114 &-7543613857461293972
MonoBehaviour:
  m_ObjectHideFlags: 0
  m_CorrespondingSourceObject: {fileID: 0}
  m_PrefabInstance: {fileID: 0}
  m_PrefabAsset: {fileID: 0}
  m_GameObject: {fileID: 0}
  m_Enabled: 1
  m_EditorHideFlags: 0
  m_Script: {fileID: 11500000, guid: 92c5d3d4a088fc7428de7e68d550c321, type: 3}
  m_Name: SR_PushPosition-[FieldMod_Root]
  m_EditorClassIdentifier: 
  Logic: 0
  Negate: 0
  Global: 0
  Enabled: 1
  Ignore: 0
  OwnerSpawner:
    Enabled: 1
    Name: FrontCeil
    SpawnerTag: 
    StampPrefabID: 2
    Parent: {fileID: -1384073903217246695}
    Rules:
    - {fileID: 4094306755518393992}
    - {fileID: -5061291862892941626}
    - {fileID: -7543613857461293972}
    Mode: 3
    CellCheckMode: 0
    GridScaling: 0
    OnScalledGrid: 1
    Repeat: 1
    MultipleToSpawn: 0
    ScaleAccess: 1
    DisplayPreviewGUI: 1
    IsSubSpawner: 0
  CellAllow: 1
  AllConditionsMet: 1
  Offset: {x: 0, y: 0.4, z: 0}
--- !u!114 &-7035022396462899400
MonoBehaviour:
  m_ObjectHideFlags: 0
  m_CorrespondingSourceObject: {fileID: 0}
  m_PrefabInstance: {fileID: 0}
  m_PrefabAsset: {fileID: 0}
  m_GameObject: {fileID: 0}
  m_Enabled: 1
  m_EditorHideFlags: 0
  m_Script: {fileID: 11500000, guid: 5015748d498a9d94abd4c0c69a786f28, type: 3}
  m_Name: SR_DirectOffset-[FieldMod_Root]
  m_EditorClassIdentifier: 
  Logic: 0
  Negate: 0
  Global: 0
  Enabled: 1
  Ignore: 0
  OwnerSpawner:
    Enabled: 1
    Name: Front
    SpawnerTag: Wall,Front
    StampPrefabID: 0
    Parent: {fileID: -1384073903217246695}
    Rules:
    - {fileID: -5924882539189695890}
    - {fileID: -7035022396462899400}
    Mode: 3
    CellCheckMode: 0
    GridScaling: 0
    OnScalledGrid: 1
    Repeat: 1
    MultipleToSpawn: 0
    ScaleAccess: 1
    DisplayPreviewGUI: 1
    IsSubSpawner: 0
  CellAllow: 1
  AllConditionsMet: 1
  Override: 0
  Randomize: 0
  GetOffsetFromTagged: 
  CheckMode: 0
  Offset: {x: 0, y: 0, z: 0.5}
  OffsetMode: 1
  RandomOffset: {x: 0, y: 0, z: 0}
--- !u!114 &-6217660547194481015
MonoBehaviour:
  m_ObjectHideFlags: 0
  m_CorrespondingSourceObject: {fileID: 0}
  m_PrefabInstance: {fileID: 0}
  m_PrefabAsset: {fileID: 0}
  m_GameObject: {fileID: 0}
  m_Enabled: 1
  m_EditorHideFlags: 0
  m_Script: {fileID: 11500000, guid: c360632d4510a074baef619f3210b541, type: 3}
  m_Name: SR_CellNeightbours-[FieldMod_Root]
  m_EditorClassIdentifier: 
  Logic: 0
  Negate: 0
  Global: 0
  Enabled: 1
  Ignore: 0
  OwnerSpawner:
    Enabled: 1
    Name: SidesColumn
    SpawnerTag: Corner
    StampPrefabID: 5
    Parent: {fileID: -1384073903217246695}
    Rules:
    - {fileID: -6217660547194481015}
    - {fileID: 6772566853582038197}
    Mode: 3
    CellCheckMode: 0
    GridScaling: 0
    OnScalledGrid: 1
    Repeat: 1
    MultipleToSpawn: 0
    ScaleAccess: 1
    DisplayPreviewGUI: 1
    IsSubSpawner: 0
  CellAllow: 1
  AllConditionsMet: 1
  CheckedCellsMustBe: 2
  NeightbourNeeds: 0
  occupiedByTag: 
  CheckMode: 0
  DirectCheck: 0
  OffsetOrigin: {x: 0, y: 0, z: 0}
  placement:
    lu: 1
    u: 1
    ru: 0
    l: 1
    m: 0
    r: 0
    ld: 0
    d: 0
    rd: 0
  quartRotor:
    q1: 1
    q2: 1
    q3: 1
    q4: 1
  OverrideRotation: 1
  initRotation: 0
  rotorEff: 90
  spawnOn: 5
  EachRotor: 0
  CustomRotors:
  - 0
  - 0
  - 0
  - 0
  GetNeightbourPos: 0
  GetNeightbourRot: 0
  GetNeightbourScale: 0
--- !u!114 &-6141878721360157331
MonoBehaviour:
  m_ObjectHideFlags: 0
  m_CorrespondingSourceObject: {fileID: 0}
  m_PrefabInstance: {fileID: 0}
  m_PrefabAsset: {fileID: 0}
  m_GameObject: {fileID: 0}
  m_Enabled: 1
  m_EditorHideFlags: 0
  m_Script: {fileID: 11500000, guid: c360632d4510a074baef619f3210b541, type: 3}
  m_Name: SR_CellNeightbours-[FieldMod_Root](Clone)
  m_EditorClassIdentifier: 
  Logic: 0
  Negate: 0
  Global: 0
  Enabled: 1
  Ignore: 0
  OwnerSpawner:
    Enabled: 1
    Name: BackCeil
    SpawnerTag: 
    StampPrefabID: 2
    Parent: {fileID: -1384073903217246695}
    Rules:
    - {fileID: -6141878721360157331}
    - {fileID: 8184593047447442981}
    - {fileID: 7622471761968713317}
    - {fileID: 7981035875318284959}
    Mode: 3
    CellCheckMode: 0
    GridScaling: 0
    OnScalledGrid: 1
    Repeat: 1
    MultipleToSpawn: 0
    ScaleAccess: 1
    DisplayPreviewGUI: 1
    IsSubSpawner: 0
  CellAllow: 0
  AllConditionsMet: 1
  CheckedCellsMustBe: 2
  NeightbourNeeds: 0
  occupiedByTag: 
  CheckMode: 0
  DirectCheck: 0
  OffsetOrigin: {x: 0, y: 0, z: 0}
  placement:
    lu: 0
    u: 0
    ru: 0
    l: 0
    m: 0
    r: 0
    ld: 0
    d: 1
    rd: 0
  quartRotor:
    q1: 1
    q2: 0
    q3: 0
    q4: 0
  OverrideRotation: 1
  initRotation: 180
  rotorEff: 90
  spawnOn: 5
  EachRotor: 0
  CustomRotors:
  - 0
  - 0
  - 0
  - 0
  GetNeightbourPos: 0
  GetNeightbourRot: 0
  GetNeightbourScale: 0
--- !u!114 &-5924882539189695890
MonoBehaviour:
  m_ObjectHideFlags: 0
  m_CorrespondingSourceObject: {fileID: 0}
  m_PrefabInstance: {fileID: 0}
  m_PrefabAsset: {fileID: 0}
  m_GameObject: {fileID: 0}
  m_Enabled: 1
  m_EditorHideFlags: 0
  m_Script: {fileID: 11500000, guid: c360632d4510a074baef619f3210b541, type: 3}
  m_Name: SR_CellNeightbours-[FieldMod_Root]
  m_EditorClassIdentifier: 
  Logic: 0
  Negate: 0
  Global: 0
  Enabled: 1
  Ignore: 0
  OwnerSpawner:
    Enabled: 1
    Name: Front
    SpawnerTag: Wall,Front
    StampPrefabID: 0
    Parent: {fileID: -1384073903217246695}
    Rules:
    - {fileID: -5924882539189695890}
    - {fileID: -7035022396462899400}
    Mode: 3
    CellCheckMode: 0
    GridScaling: 0
    OnScalledGrid: 1
    Repeat: 1
    MultipleToSpawn: 0
    ScaleAccess: 1
    DisplayPreviewGUI: 1
    IsSubSpawner: 0
  CellAllow: 1
  AllConditionsMet: 1
  CheckedCellsMustBe: 2
  NeightbourNeeds: 0
  occupiedByTag: 
  CheckMode: 0
  DirectCheck: 0
  OffsetOrigin: {x: 0, y: 0, z: 0}
  placement:
    lu: 0
    u: 1
    ru: 0
    l: 0
    m: 0
    r: 0
    ld: 0
    d: 0
    rd: 0
  quartRotor:
    q1: 1
    q2: 0
    q3: 1
    q4: 0
  OverrideRotation: 1
  initRotation: 0
  rotorEff: 90
  spawnOn: 5
  EachRotor: 0
  CustomRotors:
  - 0
  - 0
  - 0
  - 0
  GetNeightbourPos: 0
  GetNeightbourRot: 0
  GetNeightbourScale: 0
--- !u!114 &-5368161280879686544
MonoBehaviour:
  m_ObjectHideFlags: 0
  m_CorrespondingSourceObject: {fileID: 0}
  m_PrefabInstance: {fileID: 0}
  m_PrefabAsset: {fileID: 0}
  m_GameObject: {fileID: 0}
  m_Enabled: 1
  m_EditorHideFlags: 0
  m_Script: {fileID: 11500000, guid: 094c68a3bf2d9a349851f593cd6a24eb, type: 3}
  m_Name: SR_CellDistance-[FieldMod_Root]
  m_EditorClassIdentifier: 
  Logic: 0
  Negate: 0
  Global: 0
  Enabled: 1
  Ignore: 0
  OwnerSpawner:
    Enabled: 1
    Name: Gate
    SpawnerTag: Gate
    StampPrefabID: 3
    Parent: {fileID: -1384073903217246695}
    Rules:
    - {fileID: -5226628378721237962}
    - {fileID: 2166540395723974493}
    - {fileID: -2837746547098859293}
    - {fileID: 7023038663746981536}
    - {fileID: -5368161280879686544}
    - {fileID: 37588380085245110}
    - {fileID: -8420412308248807971}
    - {fileID: -8079658494271421143}
    - {fileID: 7812487417537010947}
    Mode: 3
    CellCheckMode: 0
    GridScaling: 0
    OnScalledGrid: 1
    Repeat: 1
    MultipleToSpawn: 0
    ScaleAccess: 1
    DisplayPreviewGUI: 1
    IsSubSpawner: 0
  CellAllow: 0
  AllConditionsMet: 1
  OffsetCellMode: 1
  OffsetCell: {x: 1, y: 0, z: 0}
  DistanceMustBe: 1
  DistanceToTagged: Gate
  Distance: 1
  DistanceMulVariable:
    name: 
  CheckMode: 0
  MeasureIn: 1
--- !u!114 &-5226628378721237962
MonoBehaviour:
  m_ObjectHideFlags: 0
  m_CorrespondingSourceObject: {fileID: 0}
  m_PrefabInstance: {fileID: 0}
  m_PrefabAsset: {fileID: 0}
  m_GameObject: {fileID: 0}
  m_Enabled: 1
  m_EditorHideFlags: 0
  m_Script: {fileID: 11500000, guid: c360632d4510a074baef619f3210b541, type: 3}
  m_Name: SR_CellNeightbours-[FieldMod_Root]
  m_EditorClassIdentifier: 
  Logic: 0
  Negate: 0
  Global: 0
  Enabled: 1
  Ignore: 0
  OwnerSpawner:
    Enabled: 1
    Name: Gate
    SpawnerTag: Gate
    StampPrefabID: 3
    Parent: {fileID: -1384073903217246695}
    Rules:
    - {fileID: -5226628378721237962}
    - {fileID: 2166540395723974493}
    - {fileID: -2837746547098859293}
    - {fileID: 7023038663746981536}
    - {fileID: -5368161280879686544}
    - {fileID: 37588380085245110}
    - {fileID: -8420412308248807971}
    - {fileID: -8079658494271421143}
    - {fileID: 7812487417537010947}
    Mode: 3
    CellCheckMode: 0
    GridScaling: 0
    OnScalledGrid: 1
    Repeat: 1
    MultipleToSpawn: 0
    ScaleAccess: 1
    DisplayPreviewGUI: 1
    IsSubSpawner: 0
  CellAllow: 1
  AllConditionsMet: 1
  CheckedCellsMustBe: 2
  NeightbourNeeds: 0
  occupiedByTag: 
  CheckMode: 0
  DirectCheck: 0
  OffsetOrigin: {x: 0, y: 0, z: 0}
  placement:
    lu: 0
    u: 1
    ru: 0
    l: 0
    m: 0
    r: 0
    ld: 0
    d: 0
    rd: 0
  quartRotor:
    q1: 1
    q2: 0
    q3: 0
    q4: 0
  OverrideRotation: 1
  initRotation: 180
  rotorEff: 90
  spawnOn: 5
  EachRotor: 0
  CustomRotors:
  - 0
  - 0
  - 0
  - 0
  GetNeightbourPos: 0
  GetNeightbourRot: 0
  GetNeightbourScale: 0
--- !u!114 &-5061291862892941626
MonoBehaviour:
  m_ObjectHideFlags: 0
  m_CorrespondingSourceObject: {fileID: 0}
  m_PrefabInstance: {fileID: 0}
  m_PrefabAsset: {fileID: 0}
  m_GameObject: {fileID: 0}
  m_Enabled: 1
  m_EditorHideFlags: 0
  m_Script: {fileID: 11500000, guid: 5015748d498a9d94abd4c0c69a786f28, type: 3}
  m_Name: SR_DirectOffset-[FieldMod_Root]
  m_EditorClassIdentifier: 
  Logic: 0
  Negate: 0
  Global: 0
  Enabled: 1
  Ignore: 0
  OwnerSpawner:
    Enabled: 1
    Name: FrontCeil
    SpawnerTag: 
    StampPrefabID: 2
    Parent: {fileID: -1384073903217246695}
    Rules:
    - {fileID: 4094306755518393992}
    - {fileID: -5061291862892941626}
    - {fileID: -7543613857461293972}
    Mode: 3
    CellCheckMode: 0
    GridScaling: 0
    OnScalledGrid: 1
    Repeat: 1
    MultipleToSpawn: 0
    ScaleAccess: 1
    DisplayPreviewGUI: 1
    IsSubSpawner: 0
  CellAllow: 1
  AllConditionsMet: 1
  Override: 0
  Randomize: 0
  GetOffsetFromTagged: Untagged
  CheckMode: 0
  Offset: {x: 0, y: 1, z: 0.5}
  OffsetMode: 1
  RandomOffset: {x: 0, y: 0, z: 0}
--- !u!114 &-2837746547098859293
MonoBehaviour:
  m_ObjectHideFlags: 0
  m_CorrespondingSourceObject: {fileID: 0}
  m_PrefabInstance: {fileID: 0}
  m_PrefabAsset: {fileID: 0}
  m_GameObject: {fileID: 0}
  m_Enabled: 1
  m_EditorHideFlags: 0
  m_Script: {fileID: 11500000, guid: 094c68a3bf2d9a349851f593cd6a24eb, type: 3}
  m_Name: SR_CellDistance-[FieldMod_Root]
  m_EditorClassIdentifier: 
  Logic: 0
  Negate: 0
  Global: 0
  Enabled: 1
  Ignore: 0
  OwnerSpawner:
    Enabled: 1
    Name: Gate
    SpawnerTag: Gate
    StampPrefabID: 3
    Parent: {fileID: -1384073903217246695}
    Rules:
    - {fileID: -5226628378721237962}
    - {fileID: 2166540395723974493}
    - {fileID: -2837746547098859293}
    - {fileID: 7023038663746981536}
    - {fileID: -5368161280879686544}
    - {fileID: 37588380085245110}
    - {fileID: -8420412308248807971}
    - {fileID: -8079658494271421143}
    - {fileID: 7812487417537010947}
    Mode: 3
    CellCheckMode: 0
    GridScaling: 0
    OnScalledGrid: 1
    Repeat: 1
    MultipleToSpawn: 0
    ScaleAccess: 1
    DisplayPreviewGUI: 1
    IsSubSpawner: 0
  CellAllow: 0
  AllConditionsMet: 1
  OffsetCellMode: 1
  OffsetCell: {x: 1, y: 0, z: 0}
  DistanceMustBe: 1
  DistanceToTagged: Corner
  Distance: 1
  DistanceMulVariable:
    name: 
  CheckMode: 0
  MeasureIn: 0
--- !u!114 &-1934382550892383441
MonoBehaviour:
  m_ObjectHideFlags: 0
  m_CorrespondingSourceObject: {fileID: 0}
  m_PrefabInstance: {fileID: 0}
  m_PrefabAsset: {fileID: 0}
  m_GameObject: {fileID: 0}
  m_Enabled: 1
  m_EditorHideFlags: 0
  m_Script: {fileID: 11500000, guid: 3b7b7d2eb85d19a4da49a85b81a1cb59, type: 3}
  m_Name: SR_RemoveSpawn-[FieldMod_Root]
  m_EditorClassIdentifier: 
  Logic: 0
  Negate: 0
  Global: 0
  Enabled: 0
  Ignore: 0
  OwnerSpawner:
    Enabled: 1
    Name: Gate
    SpawnerTag: Gate
    StampPrefabID: 3
    Parent: {fileID: -1384073903217246695}
    Rules:
    - {fileID: -5226628378721237962}
    - {fileID: 2166540395723974493}
    - {fileID: 7023038663746981536}
    - {fileID: 37588380085245110}
    - {fileID: -8420412308248807971}
    - {fileID: -8079658494271421143}
    Mode: 3
    CellCheckMode: 0
    GridScaling: 0
    OnScalledGrid: 1
    Repeat: 1
    MultipleToSpawn: 0
    ScaleAccess: 1
    DisplayPreviewGUI: 1
    IsSubSpawner: 0
  CellAllow: 1
  AllConditionsMet: 1
  Remove:
    AffectedTags: Front
    CheckMode: 0
    RemoveCount: 1
    CheckOffset: 0
    OffsetCellPosition: {x: 0, y: 0, z: 0}
    RemoveWhen: 0
    UseSelfRotation: 1
    DegreesTolerance: 45
--- !u!114 &-1384073903217246695
MonoBehaviour:
  m_ObjectHideFlags: 0
  m_CorrespondingSourceObject: {fileID: 0}
  m_PrefabInstance: {fileID: 0}
  m_PrefabAsset: {fileID: 0}
  m_GameObject: {fileID: 0}
  m_Enabled: 1
  m_EditorHideFlags: 0
  m_Script: {fileID: 11500000, guid: 671fd9c659a53a04eb310656f11c9125, type: 3}
  m_Name: Garage Setup
  m_EditorClassIdentifier: 
  TemporaryContainer: {fileID: 0}
  Enabled: 1
  ModTag: 
  DrawMeshAndBox: 0
  RunEmittersIfContains: 0
  DrawSetupFor: 0
  OStamp: {fileID: 0}
  DrawObjectStamps: 1
  OMultiStamp: {fileID: 0}
  PrefabsList:
  - Prefab: {fileID: 8394662625911064514, guid: 5ecd46493cd437f46bcf1b3218178ab3,
      type: 3}
    subID: 0
    _refMesh: {fileID: -387298209978578080, guid: 57d0cb2bd12322d4c9e9261e84dcb914,
      type: 3}
    _refCol: {fileID: 0}
  - Prefab: {fileID: 4975003551630434156, guid: 8a63de8624506c443ad5a0244281a1a5,
      type: 3}
    subID: 0
    _refMesh: {fileID: -1294124566197350770, guid: bc2f340d071a91147984d5683fecd538,
      type: 3}
    _refCol: {fileID: 0}
  - Prefab: {fileID: 8194999310750821996, guid: d5b4472f0e5f3544dbb31667daeb770d,
      type: 3}
    subID: 0
    _refMesh: {fileID: 485405130210934535, guid: c5703c63187116c4984ee4cd3f415138,
      type: 3}
    _refCol: {fileID: 0}
  - Prefab: {fileID: 103749338659586176, guid: b5aa8d4fb32b07c41a0b0d470e1bf336, type: 3}
    subID: 0
    _refMesh: {fileID: -9011381436011714577, guid: f5c0c52a092967c459cffcfdedc51166,
      type: 3}
    _refCol: {fileID: 0}
  - Prefab: {fileID: 2615868514414940226, guid: a4d1a9efdad54f345b9772e1e1c181a3,
      type: 3}
    subID: 0
    _refMesh: {fileID: -387298209978578080, guid: fec6e48cdde39b94a8726ab0c2efcc74,
      type: 3}
    _refCol: {fileID: 0}
  - Prefab: {fileID: 3861817537337001396, guid: 100073f6c89e2ca44ab18a21e6e8150e,
      type: 3}
    subID: 0
    _refMesh: {fileID: -5495902117074765545, guid: ccb9a06ac27aa0446a6393dea51505c4,
      type: 3}
    _refCol: {fileID: 0}
  DrawMultiObjectStamps: 1
  Spawners:
  - Enabled: 1
    Name: Front
    SpawnerTag: Wall,Front
    StampPrefabID: 0
    Parent: {fileID: -1384073903217246695}
    Rules:
    - {fileID: -5924882539189695890}
    - {fileID: -7035022396462899400}
    Mode: 3
    CellCheckMode: 0
    GridScaling: 0
    OnScalledGrid: 1
    Repeat: 1
    MultipleToSpawn: 0
    ScaleAccess: 1
    DisplayPreviewGUI: 1
    IsSubSpawner: 0
  - Enabled: 1
    Name: WallSides
    SpawnerTag: Wall
    StampPrefabID: 4
    Parent: {fileID: -1384073903217246695}
    Rules:
    - {fileID: 5442375147986710860}
    - {fileID: -9216439202231956358}
    Mode: 3
    CellCheckMode: 0
    GridScaling: 0
    OnScalledGrid: 1
    Repeat: 1
    MultipleToSpawn: 0
    ScaleAccess: 1
    DisplayPreviewGUI: 1
    IsSubSpawner: 0
  - Enabled: 1
    Name: Ceiling
    SpawnerTag: 
    StampPrefabID: 1
    Parent: {fileID: -1384073903217246695}
    Rules:
    - {fileID: 3507117604536328007}
    Mode: 3
    CellCheckMode: 0
    GridScaling: 0
    OnScalledGrid: 1
    Repeat: 1
    MultipleToSpawn: 0
    ScaleAccess: 1
    DisplayPreviewGUI: 1
    IsSubSpawner: 0
  - Enabled: 1
    Name: SidesColumn
    SpawnerTag: Corner
    StampPrefabID: 5
    Parent: {fileID: -1384073903217246695}
    Rules:
    - {fileID: -6217660547194481015}
    - {fileID: 6772566853582038197}
    Mode: 3
    CellCheckMode: 0
    GridScaling: 0
    OnScalledGrid: 1
    Repeat: 1
    MultipleToSpawn: 0
    ScaleAccess: 1
    DisplayPreviewGUI: 1
    IsSubSpawner: 0
  - Enabled: 1
    Name: FrontCeil
    SpawnerTag: 
    StampPrefabID: 2
    Parent: {fileID: -1384073903217246695}
    Rules:
    - {fileID: 4094306755518393992}
    - {fileID: -5061291862892941626}
    - {fileID: -7543613857461293972}
    Mode: 3
    CellCheckMode: 0
    GridScaling: 0
    OnScalledGrid: 1
    Repeat: 1
    MultipleToSpawn: 0
    ScaleAccess: 1
    DisplayPreviewGUI: 1
    IsSubSpawner: 0
  - Enabled: 1
    Name: Gate
    SpawnerTag: Gate
    StampPrefabID: 3
    Parent: {fileID: -1384073903217246695}
    Rules:
    - {fileID: -5226628378721237962}
    - {fileID: 2166540395723974493}
    - {fileID: -2837746547098859293}
    - {fileID: 7023038663746981536}
    - {fileID: -5368161280879686544}
    - {fileID: 37588380085245110}
    - {fileID: -8420412308248807971}
    - {fileID: -8079658494271421143}
    - {fileID: 7812487417537010947}
    Mode: 3
    CellCheckMode: 0
    GridScaling: 0
    OnScalledGrid: 1
    Repeat: 1
    MultipleToSpawn: 0
    ScaleAccess: 1
    DisplayPreviewGUI: 1
    IsSubSpawner: 0
  - Enabled: 1
    Name: BackCeil
    SpawnerTag: 
    StampPrefabID: 2
    Parent: {fileID: -1384073903217246695}
    Rules:
    - {fileID: -6141878721360157331}
    - {fileID: 8184593047447442981}
    - {fileID: 7622471761968713317}
    - {fileID: 7981035875318284959}
    Mode: 3
    CellCheckMode: 0
    GridScaling: 0
    OnScalledGrid: 1
    Repeat: 1
    MultipleToSpawn: 0
    ScaleAccess: 1
    DisplayPreviewGUI: 1
    IsSubSpawner: 0
  VariantOf: {fileID: 0}
  _editor_drawStamp: 1
  _editor_drawSpawners: 1
  _editor_shareSelected: 0
  ParentPreset: {fileID: 11400000}
  ParentPack: {fileID: 2970008458415219706}
--- !u!114 &11400000
MonoBehaviour:
  m_ObjectHideFlags: 0
  m_CorrespondingSourceObject: {fileID: 0}
  m_PrefabInstance: {fileID: 0}
  m_PrefabAsset: {fileID: 0}
  m_GameObject: {fileID: 0}
  m_Enabled: 1
  m_EditorHideFlags: 0
  m_Script: {fileID: 11500000, guid: 3b6c361108247f045b5087f48c0c7951, type: 3}
  m_Name: FS_GarageBuilding
  m_EditorClassIdentifier: 
  CellSize: 2
  NonUniformSize: 1
  NonUniformCellSize: {x: 2, y: 5, z: 2}
  InfoText: 
  Variables:
  - Name: Spawn Propability Multiplier
    v3Val: {x: 1, y: 0, z: 0}
    str: 
    mat: {fileID: 0}
    gameObj: {fileID: 0}
    helper: {x: 0, y: 5, z: 0}
    ValueType: 1
  - Name: Spawn Count Multiplier
    v3Val: {x: 1, y: 0, z: 0}
    str: 
    mat: {fileID: 0}
    gameObj: {fileID: 0}
    helper: {x: 0, y: 5, z: 0}
    ValueType: 1
  - Name: EnableDoors
    v3Val: {x: 1, y: 0, z: 0}
    str: 
    mat: {fileID: 0}
    gameObj: {fileID: 0}
    helper: {x: 0, y: 0, z: 0}
    ValueType: 2
  DoorsModificator: {fileID: 11400000, guid: 7500e28d48a8ac44da90dfc8719e91ef, type: 2}
  EraseWallModificator: {fileID: 11400000, guid: c5bd286613ebcb24c932c8d5e7f79f9b,
    type: 2}
  CellsInstructions:
  - Title: Door Hole
    InstructionType: 1
    TargetModification: {fileID: 3156508996571138238}
    Tags: Props
    InstructionArgument: 
  RootPack: {fileID: 2970008458415219706}
  ModificatorPacks:
  - {fileID: 2970008458415219706}
  Ignores: []
  DontSpawnOn: 
  disabledMods: []
  AddReflectionProbes: 0
  MainReflectionSettings: {fileID: 11400000, guid: dabe448206028124294db7edb02eed3f,
    type: 2}
  AddMultipleProbes: 0
  SmallerReflSettings: {fileID: 11400000, guid: 290a908b3df7c6a4a84c21c932841cde,
    type: 2}
  MiniReflSettings: {fileID: 11400000, guid: b243a7973537dbf4faacf7bbda74dada, type: 2}
  SmallerReflLowerSpaceThan: 4
  AddLightProbes: 0
  ProbesPerCell: 1
  TriggerColliderGeneration: 0
  TriggerGenSettings:
    ScaleupTriggers: 1
    FillHeight: 1
    MaxCellChecks: 10
    JoinBounds: 1
    GenerateRelations: 1
    GroupUpToSize: 8
    MaxGroupDistance: 8
--- !u!114 &37588380085245110
MonoBehaviour:
  m_ObjectHideFlags: 0
  m_CorrespondingSourceObject: {fileID: 0}
  m_PrefabInstance: {fileID: 0}
  m_PrefabAsset: {fileID: 0}
  m_GameObject: {fileID: 0}
  m_Enabled: 1
  m_EditorHideFlags: 0
  m_Script: {fileID: 11500000, guid: 5015748d498a9d94abd4c0c69a786f28, type: 3}
  m_Name: SR_DirectOffset-[FieldMod_Root]
  m_EditorClassIdentifier: 
  Logic: 0
  Negate: 0
  Global: 0
  Enabled: 1
  Ignore: 0
  OwnerSpawner:
    Enabled: 1
    Name: Gate
    SpawnerTag: Gate
    StampPrefabID: 3
    Parent: {fileID: -1384073903217246695}
    Rules:
    - {fileID: -5226628378721237962}
    - {fileID: 2166540395723974493}
    - {fileID: -2837746547098859293}
    - {fileID: 7023038663746981536}
    - {fileID: -5368161280879686544}
    - {fileID: 37588380085245110}
    - {fileID: -8420412308248807971}
    - {fileID: -8079658494271421143}
    - {fileID: 7812487417537010947}
    Mode: 3
    CellCheckMode: 0
    GridScaling: 0
    OnScalledGrid: 1
    Repeat: 1
    MultipleToSpawn: 0
    ScaleAccess: 1
    DisplayPreviewGUI: 1
    IsSubSpawner: 0
  CellAllow: 1
  AllConditionsMet: 1
  Override: 0
  Randomize: 0
  GetOffsetFromTagged: 
  CheckMode: 0
  Offset: {x: -0.5, y: 0, z: -0.5}
  OffsetMode: 1
  RandomOffset: {x: 0, y: 0, z: 0}
--- !u!114 &1993715247317526852
MonoBehaviour:
  m_ObjectHideFlags: 0
  m_CorrespondingSourceObject: {fileID: 0}
  m_PrefabInstance: {fileID: 0}
  m_PrefabAsset: {fileID: 0}
  m_GameObject: {fileID: 0}
  m_Enabled: 1
  m_EditorHideFlags: 0
  m_Script: {fileID: 11500000, guid: 3b7b7d2eb85d19a4da49a85b81a1cb59, type: 3}
  m_Name: SR_RemoveSpawn-[FieldMod_Root]
  m_EditorClassIdentifier: 
  Logic: 0
  Negate: 0
  Global: 0
  Enabled: 0
  Ignore: 0
  OwnerSpawner:
    Enabled: 1
    Name: Gate
    SpawnerTag: Gate
    StampPrefabID: 3
    Parent: {fileID: -1384073903217246695}
    Rules:
    - {fileID: -5226628378721237962}
    - {fileID: 2166540395723974493}
    - {fileID: 7023038663746981536}
    - {fileID: 37588380085245110}
    - {fileID: -8420412308248807971}
    - {fileID: -8079658494271421143}
    Mode: 3
    CellCheckMode: 0
    GridScaling: 0
    OnScalledGrid: 1
    Repeat: 1
    MultipleToSpawn: 0
    ScaleAccess: 1
    DisplayPreviewGUI: 1
    IsSubSpawner: 0
  CellAllow: 1
  AllConditionsMet: 1
  Remove:
    AffectedTags: Front
    CheckMode: 0
    RemoveCount: 1
    CheckOffset: 1
    OffsetCellPosition: {x: 1, y: 0, z: 0}
    RemoveWhen: 0
    UseSelfRotation: 1
    DegreesTolerance: 45
--- !u!114 &2166540395723974493
MonoBehaviour:
  m_ObjectHideFlags: 0
  m_CorrespondingSourceObject: {fileID: 0}
  m_PrefabInstance: {fileID: 0}
  m_PrefabAsset: {fileID: 0}
  m_GameObject: {fileID: 0}
  m_Enabled: 1
  m_EditorHideFlags: 0
  m_Script: {fileID: 11500000, guid: 094c68a3bf2d9a349851f593cd6a24eb, type: 3}
  m_Name: SR_CellDistance-[FieldMod_Root]
  m_EditorClassIdentifier: 
  Logic: 0
  Negate: 0
  Global: 0
  Enabled: 1
  Ignore: 0
  OwnerSpawner:
    Enabled: 1
    Name: Gate
    SpawnerTag: Gate
    StampPrefabID: 3
    Parent: {fileID: -1384073903217246695}
    Rules:
    - {fileID: -5226628378721237962}
    - {fileID: 2166540395723974493}
    - {fileID: -2837746547098859293}
    - {fileID: 7023038663746981536}
    - {fileID: -5368161280879686544}
    - {fileID: 37588380085245110}
    - {fileID: -8420412308248807971}
    - {fileID: -8079658494271421143}
    - {fileID: 7812487417537010947}
    Mode: 3
    CellCheckMode: 0
    GridScaling: 0
    OnScalledGrid: 1
    Repeat: 1
    MultipleToSpawn: 0
    ScaleAccess: 1
    DisplayPreviewGUI: 1
    IsSubSpawner: 0
  CellAllow: 0
  AllConditionsMet: 1
  OffsetCellMode: 0
  OffsetCell: {x: 0, y: 0, z: 0}
  DistanceMustBe: 1
  DistanceToTagged: Corner
  Distance: 1.5
  DistanceMulVariable:
    name: 
  CheckMode: 0
  MeasureIn: 0
--- !u!114 &2970008458415219706
MonoBehaviour:
  m_ObjectHideFlags: 0
  m_CorrespondingSourceObject: {fileID: 0}
  m_PrefabInstance: {fileID: 0}
  m_PrefabAsset: {fileID: 0}
  m_GameObject: {fileID: 0}
  m_Enabled: 1
  m_EditorHideFlags: 0
  m_Script: {fileID: 11500000, guid: f132315e3189e59479a1674dc7e52576, type: 3}
  m_Name: Root
  m_EditorClassIdentifier: 
  FieldModificators:
  - {fileID: -1384073903217246695}
  ParentPreset: {fileID: 11400000}
  DisableWholePackage: 0
  ModPackType: 0
--- !u!114 &3156508996571138238
MonoBehaviour:
  m_ObjectHideFlags: 0
  m_CorrespondingSourceObject: {fileID: 0}
  m_PrefabInstance: {fileID: 0}
  m_PrefabAsset: {fileID: 0}
  m_GameObject: {fileID: 0}
  m_Enabled: 1
  m_EditorHideFlags: 0
  m_Script: {fileID: 11500000, guid: 671fd9c659a53a04eb310656f11c9125, type: 3}
  m_Name: FieldMod_ExampleDoorHoleSimple(Clone)(Clone)
  m_EditorClassIdentifier: 
  TemporaryContainer: {fileID: 0}
  Enabled: 1
  ModTag: Hole
  DrawMeshAndBox: 0
  RunEmittersIfContains: 0
  DrawSetupFor: 0
  OStamp: {fileID: 0}
  DrawObjectStamps: 1
  OMultiStamp: {fileID: 0}
  PrefabsList:
  - Prefab: {fileID: 919132149155446097, guid: f5c0c52a092967c459cffcfdedc51166, type: 3}
    subID: 0
    _refMesh: {fileID: 8568771882487935041, guid: 12bdb1582ddc2bd4d9248e99494e1b8e,
      type: 3}
    _refCol: {fileID: 0}
  DrawMultiObjectStamps: 1
  Spawners:
  - Enabled: 1
    Name: WallHoleLarge
    SpawnerTag: 
    StampPrefabID: 0
    Parent: {fileID: 3156508996571138238}
    Rules:
    - {fileID: 5290024196324679011}
    - {fileID: -7653189938980459589}
    Mode: 3
    CellCheckMode: 0
    GridScaling: 0
    OnScalledGrid: 1
    Repeat: 1
    MultipleToSpawn: 0
    ScaleAccess: 1
    DisplayPreviewGUI: 1
    IsSubSpawner: 0
  VariantOf: {fileID: 0}
  _editor_drawStamp: 1
  _editor_drawSpawners: 1
  _editor_shareSelected: 0
  ParentPreset: {fileID: 11400000}
  ParentPack: {fileID: 6324579637144589045, guid: 12e73cd70f60cb04083024599008d4c5,
    type: 2}
--- !u!114 &3507117604536328007
MonoBehaviour:
  m_ObjectHideFlags: 0
  m_CorrespondingSourceObject: {fileID: 0}
  m_PrefabInstance: {fileID: 0}
  m_PrefabAsset: {fileID: 0}
  m_GameObject: {fileID: 0}
  m_Enabled: 1
  m_EditorHideFlags: 0
  m_Script: {fileID: 11500000, guid: d1e4d5aac49ca0345b5c3ac36491d897, type: 3}
  m_Name: SR_WorldOffset-[FieldMod_Root]
  m_EditorClassIdentifier: 
  Logic: 0
  Negate: 0
  Global: 0
  Enabled: 1
  Ignore: 0
  OwnerSpawner:
    Enabled: 1
    Name: Ceiling
    SpawnerTag: 
    StampPrefabID: 1
    Parent: {fileID: -1384073903217246695}
    Rules:
    - {fileID: 3507117604536328007}
    Mode: 3
    CellCheckMode: 0
    GridScaling: 0
    OnScalledGrid: 1
    Repeat: 1
    MultipleToSpawn: 0
    ScaleAccess: 1
    DisplayPreviewGUI: 1
    IsSubSpawner: 0
  CellAllow: 1
  AllConditionsMet: 1
  OverrideOffset: 1
  Randomize: 0
  GetOffsetFromTagged: Untagged
  CheckMode: 0
  WorldOffset: {x: 0, y: 1, z: 0}
  OffsetMode: 1
  RandomWorldOffset: {x: 0, y: 0, z: 0}
--- !u!114 &4094306755518393992
MonoBehaviour:
  m_ObjectHideFlags: 0
  m_CorrespondingSourceObject: {fileID: 0}
  m_PrefabInstance: {fileID: 0}
  m_PrefabAsset: {fileID: 0}
  m_GameObject: {fileID: 0}
  m_Enabled: 1
  m_EditorHideFlags: 0
  m_Script: {fileID: 11500000, guid: c360632d4510a074baef619f3210b541, type: 3}
  m_Name: SR_CellNeightbours-[FieldMod_Root]
  m_EditorClassIdentifier: 
  Logic: 0
  Negate: 0
  Global: 0
  Enabled: 1
  Ignore: 0
  OwnerSpawner:
    Enabled: 1
    Name: FrontCeil
    SpawnerTag: 
    StampPrefabID: 2
    Parent: {fileID: -1384073903217246695}
    Rules:
    - {fileID: 4094306755518393992}
    - {fileID: -5061291862892941626}
    - {fileID: -7543613857461293972}
    Mode: 3
    CellCheckMode: 0
    GridScaling: 0
    OnScalledGrid: 1
    Repeat: 1
    MultipleToSpawn: 0
    ScaleAccess: 1
    DisplayPreviewGUI: 1
    IsSubSpawner: 0
  CellAllow: 1
  AllConditionsMet: 1
  CheckedCellsMustBe: 2
  NeightbourNeeds: 0
  occupiedByTag: 
  CheckMode: 0
  DirectCheck: 0
  OffsetOrigin: {x: 0, y: 0, z: 0}
  placement:
    lu: 0
    u: 1
    ru: 0
    l: 0
    m: 0
    r: 0
    ld: 0
    d: 0
    rd: 0
  quartRotor:
    q1: 1
    q2: 0
    q3: 0
    q4: 0
  OverrideRotation: 1
  initRotation: 0
  rotorEff: 90
  spawnOn: 5
  EachRotor: 0
  CustomRotors:
  - 0
  - 0
  - 0
  - 0
  GetNeightbourPos: 0
  GetNeightbourRot: 0
  GetNeightbourScale: 0
--- !u!114 &5290024196324679011
MonoBehaviour:
  m_ObjectHideFlags: 0
  m_CorrespondingSourceObject: {fileID: 0}
  m_PrefabInstance: {fileID: 0}
  m_PrefabAsset: {fileID: 0}
  m_GameObject: {fileID: 0}
  m_Enabled: 1
  m_EditorHideFlags: 0
  m_Script: {fileID: 11500000, guid: 93fc507b1b266014ab43f9ce92622c2a, type: 3}
  m_Name: SR_DoorwayPlacer-[FieldMod_ExampleDoorHoleSimple(Clone)]
  m_EditorClassIdentifier: 
  Logic: 0
  Negate: 0
  Global: 0
  Enabled: 1
  Ignore: 0
  OwnerSpawner:
    Enabled: 1
    Name: WallHoleLarge
    SpawnerTag: 
    StampPrefabID: 0
    Parent: {fileID: 3156508996571138238}
    Rules:
    - {fileID: 5290024196324679011}
    - {fileID: -7653189938980459589}
    Mode: 3
    CellCheckMode: 0
    GridScaling: 0
    OnScalledGrid: 1
    Repeat: 1
    MultipleToSpawn: 0
    ScaleAccess: 1
    DisplayPreviewGUI: 1
    IsSubSpawner: 0
  CellAllow: 1
  AllConditionsMet: 1
  replaceOnTag: Wall,Window
  CheckMode: 0
  Offset: {x: 0.5, y: 0, z: 0.5}
  OffsetMode: 1
  YawRotationOffset: 180
  RemoveDistance: 55
  DebugDirection: 0
--- !u!114 &5442375147986710860
MonoBehaviour:
  m_ObjectHideFlags: 0
  m_CorrespondingSourceObject: {fileID: 0}
  m_PrefabInstance: {fileID: 0}
  m_PrefabAsset: {fileID: 0}
  m_GameObject: {fileID: 0}
  m_Enabled: 1
  m_EditorHideFlags: 0
  m_Script: {fileID: 11500000, guid: c360632d4510a074baef619f3210b541, type: 3}
  m_Name: SR_CellNeightbours-[FieldMod_Root](Clone)
  m_EditorClassIdentifier: 
  Logic: 0
  Negate: 0
  Global: 0
  Enabled: 1
  Ignore: 0
  OwnerSpawner:
    Enabled: 1
    Name: WallSides
    SpawnerTag: Wall
    StampPrefabID: 4
    Parent: {fileID: -1384073903217246695}
    Rules:
    - {fileID: 5442375147986710860}
    - {fileID: -9216439202231956358}
    Mode: 3
    CellCheckMode: 0
    GridScaling: 0
    OnScalledGrid: 1
    Repeat: 1
    MultipleToSpawn: 0
    ScaleAccess: 1
    DisplayPreviewGUI: 1
    IsSubSpawner: 0
  CellAllow: 1
  AllConditionsMet: 1
  CheckedCellsMustBe: 2
  NeightbourNeeds: 0
  occupiedByTag: 
  CheckMode: 0
  DirectCheck: 0
  OffsetOrigin: {x: 0, y: 0, z: 0}
  placement:
    lu: 0
    u: 0
    ru: 0
    l: 0
    m: 0
    r: 1
    ld: 0
    d: 0
    rd: 0
  quartRotor:
    q1: 1
    q2: 0
    q3: 1
    q4: 0
  OverrideRotation: 1
  initRotation: 90
  rotorEff: 90
  spawnOn: 5
  EachRotor: 0
  CustomRotors:
  - 0
  - 0
  - 0
  - 0
  GetNeightbourPos: 0
  GetNeightbourRot: 0
  GetNeightbourScale: 0
--- !u!114 &6554971827377568395
MonoBehaviour:
  m_ObjectHideFlags: 0
  m_CorrespondingSourceObject: {fileID: 0}
  m_PrefabInstance: {fileID: 0}
  m_PrefabAsset: {fileID: 0}
  m_GameObject: {fileID: 0}
  m_Enabled: 1
  m_EditorHideFlags: 0
  m_Script: {fileID: 11500000, guid: 6a80a4eda1baa814cb0a342f0acfc697, type: 3}
  m_Name: SR_LimitSpawnCount-[FieldMod_Root]
  m_EditorClassIdentifier: 
  Logic: 0
  Negate: 0
  Global: 0
  Enabled: 1
  Ignore: 0
  OwnerSpawner:
    Enabled: 1
    Name: Gate
    SpawnerTag: Gate
    StampPrefabID: 3
    Parent: {fileID: -1384073903217246695}
    Rules:
    - {fileID: -5226628378721237962}
    - {fileID: 2166540395723974493}
    - {fileID: 7023038663746981536}
    - {fileID: 37588380085245110}
    - {fileID: -8420412308248807971}
    - {fileID: -8079658494271421143}
    Mode: 3
    CellCheckMode: 0
    GridScaling: 0
    OnScalledGrid: 1
    Repeat: 1
    MultipleToSpawn: 0
    ScaleAccess: 1
    DisplayPreviewGUI: 1
    IsSubSpawner: 0
  CellAllow: 0
  AllConditionsMet: 1
  Count:
    Min: 1
    Max: 1
  CountMulVariable:
    name: 
  InheritFromCellsCount: 0
  RoomCellsDivBy:
    Min: 4
    Max: 6
--- !u!114 &6772566853582038197
MonoBehaviour:
  m_ObjectHideFlags: 0
  m_CorrespondingSourceObject: {fileID: 0}
  m_PrefabInstance: {fileID: 0}
  m_PrefabAsset: {fileID: 0}
  m_GameObject: {fileID: 0}
  m_Enabled: 1
  m_EditorHideFlags: 0
  m_Script: {fileID: 11500000, guid: 5015748d498a9d94abd4c0c69a786f28, type: 3}
  m_Name: SR_DirectOffset-[FieldMod_Root]
  m_EditorClassIdentifier: 
  Logic: 0
  Negate: 0
  Global: 0
  Enabled: 1
  Ignore: 0
  OwnerSpawner:
    Enabled: 1
    Name: SidesColumn
    SpawnerTag: Corner
    StampPrefabID: 5
    Parent: {fileID: -1384073903217246695}
    Rules:
    - {fileID: -6217660547194481015}
    - {fileID: 6772566853582038197}
    Mode: 3
    CellCheckMode: 0
    GridScaling: 0
    OnScalledGrid: 1
    Repeat: 1
    MultipleToSpawn: 0
    ScaleAccess: 1
    DisplayPreviewGUI: 1
    IsSubSpawner: 0
  CellAllow: 1
  AllConditionsMet: 1
  Override: 0
  Randomize: 0
  GetOffsetFromTagged: Untagged
  CheckMode: 0
  Offset: {x: -0.5, y: 0, z: 0.5}
  OffsetMode: 1
  RandomOffset: {x: 0, y: 0, z: 0}
--- !u!114 &7023038663746981536
MonoBehaviour:
  m_ObjectHideFlags: 0
  m_CorrespondingSourceObject: {fileID: 0}
  m_PrefabInstance: {fileID: 0}
  m_PrefabAsset: {fileID: 0}
  m_GameObject: {fileID: 0}
  m_Enabled: 1
  m_EditorHideFlags: 0
  m_Script: {fileID: 11500000, guid: 094c68a3bf2d9a349851f593cd6a24eb, type: 3}
  m_Name: SR_CellDistance-[FieldMod_Root]
  m_EditorClassIdentifier: 
  Logic: 0
  Negate: 0
  Global: 0
  Enabled: 1
  Ignore: 0
  OwnerSpawner:
    Enabled: 1
    Name: Gate
    SpawnerTag: Gate
    StampPrefabID: 3
    Parent: {fileID: -1384073903217246695}
    Rules:
    - {fileID: -5226628378721237962}
    - {fileID: 2166540395723974493}
    - {fileID: -2837746547098859293}
    - {fileID: 7023038663746981536}
    - {fileID: -5368161280879686544}
    - {fileID: 37588380085245110}
    - {fileID: -8420412308248807971}
    - {fileID: -8079658494271421143}
    - {fileID: 7812487417537010947}
    Mode: 3
    CellCheckMode: 0
    GridScaling: 0
    OnScalledGrid: 1
    Repeat: 1
    MultipleToSpawn: 0
    ScaleAccess: 1
    DisplayPreviewGUI: 1
    IsSubSpawner: 0
  CellAllow: 1
  AllConditionsMet: 1
  OffsetCellMode: 0
  OffsetCell: {x: 0, y: 0, z: 0}
  DistanceMustBe: 1
  DistanceToTagged: Gate
  Distance: 1
  DistanceMulVariable:
    name: 
  CheckMode: 0
  MeasureIn: 1
--- !u!114 &7622471761968713317
MonoBehaviour:
  m_ObjectHideFlags: 0
  m_CorrespondingSourceObject: {fileID: 0}
  m_PrefabInstance: {fileID: 0}
  m_PrefabAsset: {fileID: 0}
  m_GameObject: {fileID: 0}
  m_Enabled: 1
  m_EditorHideFlags: 0
  m_Script: {fileID: 11500000, guid: 92c5d3d4a088fc7428de7e68d550c321, type: 3}
  m_Name: SR_PushPosition-[FieldMod_Root](Clone)
  m_EditorClassIdentifier: 
  Logic: 0
  Negate: 0
  Global: 0
  Enabled: 1
  Ignore: 0
  OwnerSpawner:
    Enabled: 1
    Name: BackCeil
    SpawnerTag: 
    StampPrefabID: 2
    Parent: {fileID: -1384073903217246695}
    Rules:
    - {fileID: -6141878721360157331}
    - {fileID: 8184593047447442981}
    - {fileID: 7622471761968713317}
    - {fileID: 7981035875318284959}
    Mode: 3
    CellCheckMode: 0
    GridScaling: 0
    OnScalledGrid: 1
    Repeat: 1
    MultipleToSpawn: 0
    ScaleAccess: 1
    DisplayPreviewGUI: 1
    IsSubSpawner: 0
  CellAllow: 1
  AllConditionsMet: 1
  Offset: {x: 0, y: 0.15, z: 0}
--- !u!114 &7812487417537010947
MonoBehaviour:
  m_ObjectHideFlags: 0
  m_CorrespondingSourceObject: {fileID: 0}
  m_PrefabInstance: {fileID: 0}
  m_PrefabAsset: {fileID: 0}
  m_GameObject: {fileID: 0}
  m_Enabled: 1
  m_EditorHideFlags: 0
  m_Script: {fileID: 11500000, guid: 749e2955633fe5c469e8987607e107ed, type: 3}
  m_Name: SR_CompareVariable-[Garage Setup]
  m_EditorClassIdentifier: 
  Logic: 0
  Negate: 0
  Global: 0
  Enabled: 1
  Ignore: 0
  OwnerSpawner:
    Enabled: 1
    Name: Gate
    SpawnerTag: Gate
    StampPrefabID: 3
    Parent: {fileID: -1384073903217246695}
    Rules:
    - {fileID: -5226628378721237962}
    - {fileID: 2166540395723974493}
    - {fileID: -2837746547098859293}
    - {fileID: 7023038663746981536}
    - {fileID: -5368161280879686544}
    - {fileID: 37588380085245110}
    - {fileID: -8420412308248807971}
    - {fileID: -8079658494271421143}
    - {fileID: 7812487417537010947}
    Mode: 3
    CellCheckMode: 0
    GridScaling: 0
    OnScalledGrid: 1
    Repeat: 1
    MultipleToSpawn: 0
    ScaleAccess: 1
    DisplayPreviewGUI: 1
    IsSubSpawner: 0
  CellAllow: 0
  AllConditionsMet: 1
  VariableMustBe: 2
  ThisValue: 1
  CompareVariable:
    name: EnableDoors
--- !u!114 &7981035875318284959
MonoBehaviour:
  m_ObjectHideFlags: 0
  m_CorrespondingSourceObject: {fileID: 0}
  m_PrefabInstance: {fileID: 0}
  m_PrefabAsset: {fileID: 0}
  m_GameObject: {fileID: 0}
  m_Enabled: 1
  m_EditorHideFlags: 0
  m_Script: {fileID: 11500000, guid: f0acc9caea68f8c4b8c90c5e659b5f87, type: 3}
  m_Name: SR_Scale-[FieldMod_Root]
  m_EditorClassIdentifier: 
  Logic: 0
  Negate: 0
  Global: 0
  Enabled: 1
  Ignore: 0
  OwnerSpawner:
    Enabled: 1
    Name: BackCeil
    SpawnerTag: 
    StampPrefabID: 2
    Parent: {fileID: -1384073903217246695}
    Rules:
    - {fileID: -6141878721360157331}
    - {fileID: 8184593047447442981}
    - {fileID: 7622471761968713317}
    - {fileID: 7981035875318284959}
    Mode: 3
    CellCheckMode: 0
    GridScaling: 0
    OnScalledGrid: 1
    Repeat: 1
    MultipleToSpawn: 0
    ScaleAccess: 1
    DisplayPreviewGUI: 1
    IsSubSpawner: 0
  CellAllow: 1
  AllConditionsMet: 1
  ScaleMultiplier: {x: 1, y: 0.5, z: 0.8}
  ScaleMulVariable:
    name: 
  RandomizeScale: {x: 0, y: 0, z: 0}
--- !u!114 &8184593047447442981
MonoBehaviour:
  m_ObjectHideFlags: 0
  m_CorrespondingSourceObject: {fileID: 0}
  m_PrefabInstance: {fileID: 0}
  m_PrefabAsset: {fileID: 0}
  m_GameObject: {fileID: 0}
  m_Enabled: 1
  m_EditorHideFlags: 0
  m_Script: {fileID: 11500000, guid: 5015748d498a9d94abd4c0c69a786f28, type: 3}
  m_Name: SR_DirectOffset-[FieldMod_Root](Clone)
  m_EditorClassIdentifier: 
  Logic: 0
  Negate: 0
  Global: 0
  Enabled: 1
  Ignore: 0
  OwnerSpawner:
    Enabled: 1
    Name: BackCeil
    SpawnerTag: 
    StampPrefabID: 2
    Parent: {fileID: -1384073903217246695}
    Rules:
    - {fileID: -6141878721360157331}
    - {fileID: 8184593047447442981}
    - {fileID: 7622471761968713317}
    - {fileID: 7981035875318284959}
    Mode: 3
    CellCheckMode: 0
    GridScaling: 0
    OnScalledGrid: 1
    Repeat: 1
    MultipleToSpawn: 0
    ScaleAccess: 1
    DisplayPreviewGUI: 1
    IsSubSpawner: 0
  CellAllow: 1
  AllConditionsMet: 1
  Override: 0
  Randomize: 0
  GetOffsetFromTagged: Untagged
  CheckMode: 0
  Offset: {x: 0, y: 1, z: 0.5}
  OffsetMode: 1
  RandomOffset: {x: 0, y: 0, z: 0}
--- !u!114 &8864240020621661635
MonoBehaviour:
  m_ObjectHideFlags: 0
  m_CorrespondingSourceObject: {fileID: 0}
  m_PrefabInstance: {fileID: 0}
  m_PrefabAsset: {fileID: 0}
  m_GameObject: {fileID: 0}
  m_Enabled: 1
  m_EditorHideFlags: 0
  m_Script: {fileID: 11500000, guid: 893e62798003cfc4ba6de159ef003bf2, type: 3}
  m_Name: SR_WallPlacer-[FieldMod_Root]
  m_EditorClassIdentifier: 
  Logic: 0
  Negate: 0
  Global: 0
  Enabled: 1
  Ignore: 0
  OwnerSpawner:
    Enabled: 1
    Name: GarageWall-Base
    SpawnerTag: 
    StampPrefabID: 0
    Parent: {fileID: -1384073903217246695}
    Rules:
    - {fileID: 8864240020621661635}
    Mode: 3
    CellCheckMode: 0
    GridScaling: 0
    OnScalledGrid: 1
    Repeat: 1
    MultipleToSpawn: 0
    ScaleAccess: 1
    DisplayPreviewGUI: 1
    IsSubSpawner: 0
  CellAllow: 1
  AllConditionsMet: 1
  Module: 0
  CornerMode: 0
  CornerMode45: 0
  SpawnOnEachSide: 1
  AutoRemoveOverlaps: 1
  Padding: 0
  YawOffset: 0
  DirectOffset: {x: 0, y: 0, z: -0.5}
  OffsetMode: 1
  IgnoreOtherMods: 1
