%YAML 1.1
%TAG !u! tag:unity3d.com,2011:
--- !u!21 &2100000
Material:
  serializedVersion: 6
  m_ObjectHideFlags: 0
  m_CorrespondingSourceObject: {fileID: 0}
  m_PrefabInstance: {fileID: 0}
  m_PrefabAsset: {fileID: 0}
  m_Name: Scenario_WaterReflection
  m_Shader: {fileID: -6465566751694194690, guid: b5375287814428b4bbd535bc6bfb735c,
    type: 3}
  m_ShaderKeywords: 
  m_LightmapFlags: 4
  m_EnableInstancingVariants: 0
  m_DoubleSidedGI: 0
  m_CustomRenderQueue: -1
  stringTagMap: {}
  disabledShaderPasses: []
  m_SavedProperties:
    serializedVersion: 3
    m_TexEnvs:
    - DistortionTexture:
        m_Texture: {fileID: 2800000, guid: 936a43635c57b0a408fb70bee7efbb2a, type: 3}
        m_Scale: {x: 1, y: 1}
        m_Offset: {x: 0, y: 0}
    - Pattern:
        m_Texture: {fileID: 2800000, guid: d96151e5565589c48b168acbd866c091, type: 3}
        m_Scale: {x: 1, y: 1}
        m_Offset: {x: 0, y: 0}
    - _BaseMap:
        m_Texture: {fileID: 2800000, guid: d6a112020bf17704e8dbcc04f1b878bf, type: 3}
        m_Scale: {x: 1, y: 1}
        m_Offset: {x: 0, y: 0}
    - _BumpMap:
        m_Texture: {fileID: 0}
        m_Scale: {x: 1, y: 1}
        m_Offset: {x: 0, y: 0}
    - _EmissionMap:
        m_Texture: {fileID: 0}
        m_Scale: {x: 1, y: 1}
        m_Offset: {x: 0, y: 0}
    - _MainTex:
        m_Texture: {fileID: 0}
        m_Scale: {x: 1, y: 1}
        m_Offset: {x: 0, y: 0}
    - _MetallicGlossMap:
        m_Texture: {fileID: 0}
        m_Scale: {x: 1, y: 1}
        m_Offset: {x: 0, y: 0}
    - _OcclusionMap:
        m_Texture: {fileID: 0}
        m_Scale: {x: 1, y: 1}
        m_Offset: {x: 0, y: 0}
    - _SpecGlossMap:
        m_Texture: {fileID: 0}
        m_Scale: {x: 1, y: 1}
        m_Offset: {x: 0, y: 0}
    m_Ints: []
    m_Floats:
    - CellDensity: 5.6
    - ColorFill: 0.01
    - Density: 7
    - Dissolve: 0.5
    - DissolveBorder: -0.1
    - DissolveNoiseScale: 20
    - DistortionScale: 6
    - DistortionSpeed: 0.02
    - FoamOpacity: 1
    - FoamScale: 1
    - FresnelOffset: 0.2
    - FresnelPower: 4
    - MixEffect: 1
    - PatternScale: 8
    - PatternShuffleSpeed: 1
    - PatternSpeed: 0.1
    - RimPower: 2
    - RimSize: 3
    - RippleDensity: 4
    - RippleSize: 4
    - RippleSpeed: 2
    - Slimness: 2
    - WaveHeight: 0.2
    - WaveScale: 5
    - _AlphaClip: 0
    - _Blend: 0
    - _BumpScale: 1
    - _Cull: 2
    - _Cutoff: 0.5
    - _DstBlend: 0
    - _EnvironmentReflections: 1
    - _GlossMapScale: 0
    - _Glossiness: 0
    - _GlossyReflections: 0
    - _Metallic: 0
    - _OcclusionStrength: 1
    - _QueueOffset: 0
    - _ReceiveShadows: 1
    - _Smoothness: 0.5
    - _SmoothnessTextureChannel: 0
    - _SpecularHighlights: 1
    - _SrcBlend: 1
    - _Surface: 0
    - _WorkflowMode: 1
    - _ZWrite: 1
    m_Colors:
    - Color_C7B0A506: {r: 0.7490196, g: 0.2392157, b: 0.2392157, a: 0}
    - DistortionDirection: {r: 0.05, g: 0.05, b: 0, a: 0}
    - DistortionTileset: {r: 1, g: 1, b: 0, a: 0}
    - EmissionColor: {r: 0.1882353, g: 1.890196, b: 1.788235, a: 0}
    - EmissiveColor: {r: 0.1284246, g: 1.296477, b: 0.1383582, a: 1}
    - FluidColor: {r: 0.7490196, g: 0.09411765, b: 0.09019608, a: 0.4980392}
    - FoamMinMax: {r: 0.6, g: 0.8, b: 0, a: 0}
    - HologramColor: {r: 0.2196078, g: 0, b: 1.396078, a: 0}
    - PatternSpeed: {r: 0.1, g: 0.1, b: 0, a: 0}
    - PatternTiling: {r: 10, g: 10, b: 0, a: 0}
    - RimColor: {r: 0, g: 1.370351, b: 0.774281, a: 0.7843137}
    - RippleColor: {r: 0.2607245, g: 0.8773585, b: 0.6678643, a: 0.5882353}
    - RippleDirection: {r: 0.2, g: 0, b: 0, a: 0}
    - Tiling: {r: 1, g: 1, b: 0, a: 0}
    - WaterColor: {r: 0.0226949, g: 0.1698879, b: 0.3207547, a: 0.5882353}
    - _BaseColor: {r: 0, g: 0.6788498, b: 0.9528302, a: 1}
    - _Color: {r: 0.5, g: 0.5, b: 0.5, a: 1}
    - _EmissionColor: {r: 0, g: 0, b: 0, a: 1}
    - _Offset: {r: 0, g: 0, b: 0, a: 0}
    - _SpecColor: {r: 0.19999996, g: 0.19999996, b: 0.19999996, a: 1}
    - _Tiling: {r: 1, g: 1, b: 0, a: 0}
  m_BuildTextureStacks: []
--- !u!114 &102279310832704288
MonoBehaviour:
  m_ObjectHideFlags: 11
  m_CorrespondingSourceObject: {fileID: 0}
  m_PrefabInstance: {fileID: 0}
  m_PrefabAsset: {fileID: 0}
  m_GameObject: {fileID: 0}
  m_Enabled: 1
  m_EditorHideFlags: 0
  m_Script: {fileID: 11500000, guid: d0353a89b1f911e48b9e16bdc9f2e058, type: 3}
  m_Name: 
  m_EditorClassIdentifier: 
  version: 5
