,BattleLevelType,StageType,PositionX,PositionY,PositionZ,RotationYaw
1,3,1,3050,650,920,90
2,3,1,3050,883,920,-90
3,3,1,1510,650,920,90
4,3,1,1510,883,920,-90
5,3,1,-30,650,920,90
6,3,1,-30,883,920,-90
7,3,1,-1570,650,920,90
8,3,1,-1570,883,920,-90
9,3,1,-3115,650,920,90
10,3,1,-3115,883,920,-90
11,3,1,3050,-877,920,90
12,3,1,3050,-645,920,-90
13,3,1,1510,-877,920,90
14,3,1,1510,-645,920,-90
15,3,1,-30,-877,920,90
16,3,1,-30,-645,920,-90
17,3,1,-1570,-877,920,90
18,3,1,-1570,-645,920,-90
19,3,1,-3115,-877,920,90
20,3,1,-3115,-645,920,-90
21,3,2,-4670,-2245,990,0
22,3,2,-4670,2250,990,0
23,3,2,-2200,3170,750,-90
24,3,2,2260,3170,750,-90
25,3,2,4570,2337,920,-90
26,3,2,1300,7668,920,90
27,3,2,-285,6565,1000,90
28,3,2,-4580,6565,1000,90
29,3,2,-8325,7007,920,90
30,3,2,-7700,2372,920,-90
31,3,2,-7249,2225,920,180
32,3,3,-8885,697,920,90
33,3,3,-8885,930,920,-90
34,3,3,-10425,697,920,90
35,3,3,-10425,930,920,-90
36,3,3,-11965,697,920,90
37,3,3,-11965,930,920,-90
38,3,3,-13505,697,920,90
39,3,3,-13505,930,920,-90
40,3,3,-15050,697,920,90
41,3,3,-15050,930,920,-90
42,3,3,-8885,-830,920,90
43,3,3,-8885,-598,920,-90
44,3,3,-10425,-830,920,90
45,3,3,-10425,-598,920,-90
46,3,3,-11965,-830,920,90
47,3,3,-11965,-598,920,-90
48,3,3,-13505,-830,920,90
49,3,3,-13505,-598,920,-90
50,3,3,-15050,-830,920,90
51,3,3,-15050,-598,920,-90
52,3,3,-9636,8575,920,0
53,3,3,-9403,8575,920,180
54,3,3,-9636,10115,920,0
55,3,3,-9403,10115,920,180
56,3,3,-9636,11655,920,0
57,3,3,-9403,11655,920,180
58,3,3,-9636,13195,920,0
59,3,3,-9403,13195,920,180
60,3,3,-9636,14740,920,0
61,3,3,-9403,14740,920,180
62,3,3,-11163,8575,920,0
63,3,3,-10931,8575,920,180
64,3,3,-11163,10115,920,0
65,3,3,-10931,10115,920,180
66,3,3,-11163,11655,920,0
67,3,3,-10931,11655,920,180
68,3,3,-11163,13195,920,0
69,3,3,-10931,13195,920,180
70,3,3,-11163,14740,920,0
71,3,3,-10931,14740,920,180
72,2,1,-3280,9700,920,0
73,2,1,-3047,9700,920,180
74,2,1,-1753,9700,920,0
75,2,1,-1520,9700,920,180
76,2,1,-3280,11239,920,0
77,2,1,-3047,11239,920,180
78,2,1,-1753,11239,920,0
79,2,1,-1520,11239,920,180
