A001,A002,A003,A004,A005,A006,A007,A008,A009,A010,A011,A012,A013,A014,A015,A016,A017,A018,A019,A020
A021,A022,A023,A024,A025,A026,A027,A028,A029,A030,A031,A032,A033,A034,A035,A036,A037,A038,A039,A040
A041,A042,A043,A044,A045,A046,A047,A048,A049,A050,A051,A052,A053,A054,A055,A056,A057,A058,A059,A060
A061,A062,A063,A064,A065,A066,A067,A068,A069,A070,A071,A072,A073,A074,A075,A076,A077,A078,A079,A080
A081,A082,A083,A084,A085,A086,A087,A088,A089,A090,A091,A092,A093,A094,A095,A096,A097,A098,A099,A100
A101,A102,A103,A104,A105,A106,A107,A108,A109,A110,A111,A112,A113,A114,A115,A116,A117,A118,A119,A120
A121,A122,A123,A124,A125,A126,A127,A128,A129,A130,A131,A132,A133,A134,A135,A136,A137,A138,A139,A140
A141,A142,A143,A144,A145,A146,A147,A148,A149,A150,A151,A152,A153,A154,A155,A156,A157,A158,A159,A160
A161,A162,A163,A164,A165,A166,A167,A168,A169,A170,A171,A172,A173,A174,A175,A176,A177,A178,A179,A180
A181,A182,A183,A184,A185,A186,A187,A188,A189,A190,A191,A192,A193,A194,A195,A196,A197,A198,A199,A200
A201,A202,A203,A204,A205,A206,A207,A208,A209,A210,A211,A212,A213,A214,A215,A216,A217,A218,A219,A220
A221,A222,A223,A224,A225,A226,A227,A228,A229,A230,A231,A232,A233,A234,A235,A236,A237,A238,A239,A240
B001,B002,B003,B004,B005,B006,B007,B008,B009,B010,C001,C002,C003,C004,C005,C006,C007,C008,C009,C010
B011,B012,B013,B014,B015,B016,B017,B018,B019,B020,C011,C012,C013,C014,C015,C016,C017,C018,C019,C020
B021,B022,B023,B024,B025,B026,B027,B028,B029,B030,C021,C022,C023,C024,C025,C026,C027,C028,C029,C030
B031,B032,B033,B034,B035,B036,B037,B038,B039,B040,C031,C032,C033,C034,C035,C036,C037,C038,C039,C040
B041,B042,B043,B044,B045,B046,B047,B048,B049,B050,C041,C042,C043,C044,C045,C046,C047,C048,C049,C050
B051,B052,B053,B054,B055,B056,B057,B058,B059,B060,C051,C052,C053,C054,C055,C056,C057,C058,C059,C060
B061,B062,B063,B064,B065,B066,B067,B068,B069,B070,C061,C062,C063,C064,C065,C066,C067,C068,C069,C070
B071,B072,B073,B074,B075,B076,B077,B078,B079,B080,C071,C072,C073,C074,C075,C076,C077,C078,C079,C080
B081,B082,B083,B084,B085,B086,B087,B088,B089,B090,C081,C082,C083,C084,C085,C086,C087,C088,C089,C090
B091,B092,B093,B094,B095,B096,B097,B098,B099,B100,C091,C092,C093,C094,C095,C096,C097,C098,C099,C100
B101,B102,B103,B104,B105,B106,B107,B108,B109,B110,C101,C102,C103,C104,C105,C106,C107,C108,C109,C110
B111,B112,B113,B114,B115,B116,B117,B118,B119,B120,C111,C112,C113,C114,C115,C116,C117,C118,C119,C120
B121,B122,B123,B124,B125,B126,B127,B128,B129,B130,C121,C122,C123,C124,C125,C126,C127,C128,C129,C130
B131,B132,B133,B134,B135,B136,B137,B138,B139,B140,C131,C132,C133,C134,C135,C136,C137,C138,C139,C140
B141,B142,B143,B144,B145,B146,B147,B148,B149,B150,C141,C142,C143,C144,C145,C146,C147,C148,C149,C150
