,,LevelType,WeatherType,SpawnPosX,SpawnPosY,SpawnPosZ
1,1,3,0,-7000,-2350,3000
2,2,3,0,-7000,-1350,3000
3,3,3,0,-7000,-350,3000
4,4,3,0,-7000,650,3000
5,5,3,0,-7000,1650,3000
6,6,3,0,-7000,2650,3000
7,7,3,0,-6000,-2350,3000
8,8,3,0,-6000,-1350,3000
9,9,3,0,-6000,-350,3000
10,10,3,0,-6000,650,3000
11,11,3,0,-6000,1650,3000
12,12,3,0,-6000,2650,3000
13,13,3,0,-5000,-2350,3000
14,14,3,0,-5000,-1350,3000
15,15,3,0,-5000,-350,3000
16,16,3,0,-5000,650,3000
17,17,3,0,-5000,1650,3000
18,18,3,0,-5000,2650,3000
19,19,3,0,-9000,2650,3000
20,20,3,0,-8000,2650,3000
21,21,3,0,-7000,2650,3000
22,22,3,0,-6000,2650,3000
23,23,3,0,-5000,2650,3000
24,24,3,0,-4000,2650,3000
25,25,3,0,-3000,2650,3000
26,26,3,0,-2000,2650,3000
27,27,3,0,-1000,2650,3000
28,28,3,0,0,2650,3000
29,29,3,0,1000,2650,3000
30,30,3,0,2000,2650,3000
31,31,3,0,3000,2650,3000
32,32,3,0,4000,2650,3000
33,33,3,0,5000,2650,3000
34,34,3,0,6000,2650,3000
35,35,3,0,-9000,3650,3000
36,36,3,0,-8000,3650,3000
37,37,3,0,-7000,3650,3000
38,38,3,0,-6000,3650,3000
39,39,3,0,-5000,3650,3000
40,40,3,0,-4000,3650,3000
41,41,3,0,-3000,3650,3000
42,42,3,0,-2000,3650,3000
43,43,3,0,-1000,3650,3000
44,44,3,0,0,3650,3000
45,45,3,0,1000,3650,3000
46,46,3,0,2000,3650,3000
47,47,3,0,3000,3650,3000
48,48,3,0,4000,3650,3000
49,49,3,0,5000,3650,3000
50,50,3,0,6000,3650,3000
51,51,3,0,-9000,4650,3000
52,52,3,0,-8000,4650,3000
53,53,3,0,-7000,4650,3000
54,54,3,0,-6000,4650,3000
55,55,3,0,-5000,4650,3000
56,56,3,0,-4000,4650,3000
57,57,3,0,-3000,4650,3000
58,58,3,0,-2000,4650,3000
59,59,3,0,-1000,4650,3000
60,60,3,0,0,4650,3000
61,61,3,0,1000,4650,3000
62,62,3,0,2000,4650,3000
63,63,3,0,3000,4650,3000
64,64,3,0,4000,4650,3000
65,65,3,0,5000,4650,3000
66,66,3,0,6000,4650,3000
67,67,3,0,-9000,5650,3000
68,68,3,0,-8000,5650,3000
69,69,3,0,-7000,5650,3000
70,70,3,0,-6000,5650,3000
71,71,3,0,-5000,5650,3000
72,72,3,0,-4000,5650,3000
73,73,3,0,-3000,5650,3000
74,74,3,0,-2000,5650,3000
75,75,3,0,-1000,5650,3000
76,76,3,0,0,5650,3000
77,77,3,0,1000,5650,3000
78,78,3,0,2000,5650,3000
79,79,3,0,3000,5650,3000
80,80,3,0,4000,5650,3000
81,81,3,0,5000,5650,3000
82,82,3,0,6000,5650,3000
83,83,3,0,-9000,6650,3000
84,84,3,0,-8000,6650,3000
85,85,3,0,-7000,6650,3000
86,86,3,0,-6000,6650,3000
87,87,3,0,-5000,6650,3000
88,88,3,0,-4000,6650,3000
89,89,3,0,-3000,6650,3000
90,90,3,0,-2000,6650,3000
91,91,3,0,-1000,6650,3000
92,92,3,0,0,6650,3000
93,93,3,0,1000,6650,3000
94,94,3,0,2000,6650,3000
95,95,3,0,3000,6650,3000
96,96,3,0,4000,6650,3000
97,97,3,0,5000,6650,3000
98,98,3,0,6000,6650,3000
99,99,3,0,-7000,7650,3000
100,100,3,0,-6000,7650,3000
101,101,3,0,-5000,7650,3000
102,102,3,0,-6000,8650,3000
103,103,3,0,-5000,8650,3000
104,104,3,0,-6000,9650,3000
105,105,3,0,-5000,9650,3000
106,106,3,0,5000,-1350,3000
107,107,3,0,5000,-350,3000
108,108,3,0,5000,650,3000
109,109,3,0,5000,1650,3000
110,110,3,0,6000,-1350,3000
111,111,3,0,6000,-350,3000
112,112,3,0,6000,650,3000
113,113,3,0,6000,1650,3000
114,114,3,0,-12000,17650,3000
115,115,3,0,-12000,16650,3000
116,116,3,0,-11000,17650,3000
117,117,3,0,-11000,16650,3000
118,118,3,0,-10000,17650,3000
119,119,3,0,-10000,16650,3000
120,120,3,0,-9000,17650,3000
121,121,3,0,-9000,16650,3000
