,,BoneName,BodyPartsType
1,1,head,1
2,2,neck_01,1
3,3,pelvis,2
4,4,spine_01,2
5,5,spine_02,2
6,6,upperarm_l,3
7,7,lowerarm_l,3
8,8,hand_l,3
9,9,upperarm_r,3
10,10,lowerarm_r,3
11,11,hand_r,3
12,12,thigh_l,4
13,13,calf_l,4
14,14,foot_l,4
15,15,ball_l,4
16,16,thigh_r,4
17,17,calf_r,4
18,18,foot_r,4
19,19,ball_r,4
