ObjectNum,Path
Z001,/Game/Blueprints/BP_Pillar.BP_Pillar_C
Z002,/Game/Blueprints/BP_Statue.BP_Statue_C
Z003,/Game/Blueprints/BP_Tree.BP_Tree_C
Z004,/Game/Blueprints/BP_Grass.BP_Grass_C
Z005,/Game/Blueprints/BP_Rock.BP_Rock_C
Z006,/Game/Blueprints/BP_SmallRock.BP_SmallRock_C