Num,Text
1,【開発環境】
2, UnrealEngine4 ver4.27.2
3, VisualStudio2019
4, 使用言語：Unreal C++
5,
6,【著作情報】
7, < 3Dモデル、2Dアセット >
8,　・Epic Games Store
9,	Virtual Studio
10,	ActionRPG
11,	Megascans Blood
12,	Military Weapons Dark
13,	AnimationStarterPack
14,	Infinity Blade:Effects
15,　ShooterGame
16,	OldFactory
17,	Shooter Crosshair V2.0
18,　Industrial Lights and Switches Blueprints Set2.0
19,	
20,　・自作
21,　上記に含まれないテクスチャアセット
22,　
23,  < フォント >
24,　・Epic Games Store
25,　ActionRPG
26,　
27,  < 楽曲 >
28,　・BGMer(https://https://bgmer.net/)
29,	TitleBGM「奪還作戦(255_BPM160)」
30,	PlayBGM「深淵を覗くもの(323_BPM90)」
31,　BattleBGM「BattleMaster(159_BPM130)」
32,　ResultBGM「戦いの果てに(099_BPM170)」
33,　・Epic Games Store シューターゲーム
34,	足音 SCue_FS_Tile
35,　・効果音ラボ(https://soundeffect-lab.info/sound/anime/)
36,　SelectButton「決定ボタンを押す44」
37,	Decide「決定ボタンを押す53」
38,　Update「決定ボタンを押す47」
39,　Heal「回復魔法2」
40,	HeartBeat「心臓の鼓動1」
41,	Landing「ジャンプの着地」
42, 	Critical「狙撃銃で撃たれる(スロー演出)※最後の部分のみ使用」
43,	Found「レーザー」
44,	Return「キャンセル8」
45,　・音人(https://on-jin.com/)
46,　WarningAlert「警報05」
