,,BattleLevelType,WeaponType,StageType,PositionX,PositionY,PositionZ,RotationYaw
1,1,2,1,-2285,9100,20,0
2,2,2,1,-550,11600,850,0
7,7,3,1,-3165,-1842,869,90
8,8,3,1,300,-470,869,90
9,9,3,1,3350,1250,492,180
10,10,3,1,1085,-1129,108,90
11,11,3,1,1730,2864,108,180
12,12,3,1,-780,-1560,108,90
13,13,3,1,4300,-1600,493,90
14,14,3,1,-1175,1154,108,0

