0,サイコロを振る：[ Space ]キー\nマップ確認：[ C ]キー
1,サイコロを止める：[ Enter ]キー
2,進む方向の選択：[ W ] [ A ] [ D ]キー\n進む方向の決定：[ Enter ]キー\nマップ確認：[ C ]キー
3,何も起こらなかった。
4,止まったマスはお金獲得マス!\nABC円獲得した!
5,お金損失マスに止まってしまった。\nABC円失った。
6,強制移動マスに止まった。\nプレイヤーは指定マスに飛ばされてしまう。
7,カメラ移動：[ W ] [ S ] [ A ] [ D ]キー\nズーム：[ ↑ ] [ ↓ ]キー\nゲームに戻る：[ C ]キー
8,XYZ着でゴール!\n賞金としてABC円獲得した!
9,CPU操作中です