[gd_scene load_steps=4 format=3 uid="uid://dk1ctt8lufi7j"]

[ext_resource type="PackedScene" uid="uid://fhk26kw5alwx" path="res://scenes/Environment.tscn" id="1"]
[ext_resource type="PackedScene" uid="uid://urydr0rqxuxr" path="res://scenes/Player.tscn" id="2"]
[ext_resource type="PackedScene" uid="uid://o6guho11r4et" path="res://scenes/Crate.tscn" id="3"]

[node name="Scene" type="Node2D"]

[node name="Environment" parent="." instance=ExtResource("1")]

[node name="Player" parent="." instance=ExtResource("2")]
position = Vector2(572, 271)

[node name="Crate" parent="." instance=ExtResource("3")]

[editable path="Player"]
