# Blender v2.81 (sub 16) OBJ File: ''
# www.blender.org
mtllib sample_terrain.mtl
o Cube
v 10.000000 0.100000 -10.000000
v 10.000000 -0.100000 -10.000000
v 10.000000 0.100000 10.000000
v 10.000000 -0.100000 10.000000
v -10.000000 0.100000 -10.000000
v -10.000000 -0.100000 -10.000000
v -10.000000 0.100000 10.000000
v -10.000000 -0.100000 10.000000
v 0.000000 0.100000 10.000000
v 10.000000 0.100000 0.000000
v -10.000000 0.100000 0.000000
v 0.000000 0.100000 -10.000000
v 0.000000 0.100000 0.000000
v -5.000000 0.100000 10.000000
v 10.000000 0.100000 5.000000
v -10.000000 0.100000 -5.000000
v 5.000000 0.100000 -10.000000
v 5.000000 0.100000 10.000000
v 10.000000 0.100000 -5.000000
v -10.000000 0.100000 5.000000
v -5.000000 0.100000 -10.000000
v 0.000000 0.100000 5.000000
v 0.000000 0.100000 -5.000000
v 5.000000 0.100000 0.000000
v -5.000000 0.100000 0.000000
v -5.000000 0.100000 -5.000000
v 5.000000 0.100000 -5.000000
v 5.000000 0.100000 5.000000
v -5.000000 0.100000 5.000000
vt 0.812500 0.687500
vt 0.875000 0.687500
vt 0.875000 0.750000
vt 0.812500 0.750000
vt 0.375000 0.750000
vt 0.625000 0.750000
vt 0.625000 0.812500
vt 0.625000 0.875000
vt 0.625000 0.937500
vt 0.625000 1.000000
vt 0.375000 1.000000
vt 0.375000 0.000000
vt 0.625000 0.000000
vt 0.625000 0.062500
vt 0.625000 0.125000
vt 0.625000 0.187500
vt 0.625000 0.250000
vt 0.375000 0.250000
vt 0.125000 0.500000
vt 0.375000 0.500000
vt 0.125000 0.750000
vt 0.625000 0.500000
vt 0.625000 0.562500
vt 0.625000 0.625000
vt 0.625000 0.687500
vt 0.625000 0.312500
vt 0.625000 0.375000
vt 0.625000 0.437500
vt 0.687500 0.687500
vt 0.750000 0.687500
vt 0.750000 0.750000
vt 0.687500 0.750000
vt 0.687500 0.562500
vt 0.750000 0.562500
vt 0.750000 0.625000
vt 0.687500 0.625000
vt 0.812500 0.562500
vt 0.875000 0.562500
vt 0.875000 0.625000
vt 0.812500 0.625000
vt 0.750000 0.500000
vt 0.812500 0.500000
vt 0.875000 0.500000
vt 0.687500 0.500000
vn 0.0000 1.0000 0.0000
vn 0.0000 0.0000 1.0000
vn -1.0000 0.0000 0.0000
vn 0.0000 -1.0000 0.0000
vn 1.0000 0.0000 0.0000
vn 0.0000 0.0000 -1.0000
usemtl Material
s off
f 29/1/1 20/2/1 7/3/1 14/4/1
f 4/5/2 3/6/2 18/7/2 9/8/2 14/9/2 7/10/2 8/11/2
f 8/12/3 7/13/3 20/14/3 11/15/3 16/16/3 5/17/3 6/18/3
f 6/19/4 2/20/4 4/5/4 8/21/4
f 2/20/5 1/22/5 19/23/5 10/24/5 15/25/5 3/6/5 4/5/5
f 6/18/6 5/17/6 21/26/6 12/27/6 17/28/6 1/22/6 2/20/6
f 28/29/1 22/30/1 9/31/1 18/32/1
f 27/33/1 23/34/1 13/35/1 24/36/1
f 26/37/1 16/38/1 11/39/1 25/40/1
f 23/34/1 26/37/1 25/40/1 13/35/1
f 12/41/1 21/42/1 26/37/1 23/34/1
f 21/42/1 5/43/1 16/38/1 26/37/1
f 19/23/1 27/33/1 24/36/1 10/24/1
f 1/22/1 17/44/1 27/33/1 19/23/1
f 17/44/1 12/41/1 23/34/1 27/33/1
f 15/25/1 28/29/1 18/32/1 3/6/1
f 10/24/1 24/36/1 28/29/1 15/25/1
f 24/36/1 13/35/1 22/30/1 28/29/1
f 22/30/1 29/1/1 14/4/1 9/31/1
f 13/35/1 25/40/1 29/1/1 22/30/1
f 25/40/1 11/39/1 20/2/1 29/1/1
