%YAML 1.1
%TAG !u! tag:unity3d.com,2011:
--- !u!21 &2100000
Material:
  serializedVersion: 6
  m_ObjectHideFlags: 0
  m_CorrespondingSourceObject: {fileID: 0}
  m_PrefabInstance: {fileID: 0}
  m_PrefabAsset: {fileID: 0}
  m_Name: Grass
  m_Shader: {fileID: 4800000, guid: 01eab4087a959ef4cbc34b8a3fba1e1f, type: 3}
  m_ShaderKeywords: 
  m_LightmapFlags: 4
  m_EnableInstancingVariants: 0
  m_DoubleSidedGI: 0
  m_CustomRenderQueue: -1
  stringTagMap: {}
  disabledShaderPasses: []
  m_SavedProperties:
    serializedVersion: 3
    m_TexEnvs:
    - _BumpMap:
        m_Texture: {fileID: 0}
        m_Scale: {x: 1, y: 1}
        m_Offset: {x: 0, y: 0}
    - _DetailAlbedoMap:
        m_Texture: {fileID: 0}
        m_Scale: {x: 1, y: 1}
        m_Offset: {x: 0, y: 0}
    - _DetailMask:
        m_Texture: {fileID: 0}
        m_Scale: {x: 1, y: 1}
        m_Offset: {x: 0, y: 0}
    - _DetailNormalMap:
        m_Texture: {fileID: 0}
        m_Scale: {x: 1, y: 1}
        m_Offset: {x: 0, y: 0}
    - _EmissionMap:
        m_Texture: {fileID: 0}
        m_Scale: {x: 1, y: 1}
        m_Offset: {x: 0, y: 0}
    - _InteractionRT:
        m_Texture: {fileID: 8600000, guid: 5f9b07d1f1284d24ba1362081be83863, type: 2}
        m_Scale: {x: 1, y: 1}
        m_Offset: {x: 0, y: 0}
    - _MainTex:
        m_Texture: {fileID: 0}
        m_Scale: {x: 1, y: 1}
        m_Offset: {x: 0, y: 0}
    - _MetallicGlossMap:
        m_Texture: {fileID: 0}
        m_Scale: {x: 1, y: 1}
        m_Offset: {x: 0, y: 0}
    - _OcclusionMap:
        m_Texture: {fileID: 0}
        m_Scale: {x: 1, y: 1}
        m_Offset: {x: 0, y: 0}
    - _ParallaxMap:
        m_Texture: {fileID: 0}
        m_Scale: {x: 1, y: 1}
        m_Offset: {x: 0, y: 0}
    - _WindDistortionMap:
        m_Texture: {fileID: 2800000, guid: f28bba76fb944bc48be841e3ab6c411f, type: 3}
        m_Scale: {x: 0.01, y: 0.01}
        m_Offset: {x: 0, y: 0}
    m_Floats:
    - _BendRotationRandom: 0.2
    - _BladeCurve: 2
    - _BladeForward: 0.2
    - _BladeHeight: 0.2
    - _BladeHeightRandom: 0.3
    - _BladeRandomAmount: 0.5
    - _BladeSegments: 3
    - _BladeWidth: 0.05
    - _BladeWidthRandom: 0.02
    - _BumpScale: 1
    - _Cutoff: 0.5
    - _DetailNormalMapScale: 1
    - _DstBlend: 0
    - _GlossMapScale: 1
    - _Glossiness: 0.5
    - _GlossyReflections: 1
    - _Metallic: 0
    - _Mode: 0
    - _OcclusionStrength: 1
    - _Parallax: 0.02
    - _Rotation: 0
    - _RotationRandom: 0.174
    - _SmoothnessTextureChannel: 0
    - _SpecularHighlights: 1
    - _SrcBlend: 1
    - _TessellationUniform: 10
    - _TranslucentGain: 0.5
    - _UVSec: 0
    - _WindScale: 1
    - _WindStrength: 0.2
    - _ZWrite: 1
    m_Colors:
    - _BottomColor: {r: 0.061297283, g: 0.378, b: 0.07151349, a: 1}
    - _Color: {r: 0, g: 0.5754717, b: 0.06694827, a: 1}
    - _EmissionColor: {r: 0, g: 0, b: 0, a: 1}
    - _TopColor: {r: 0.5792569, g: 0.84599996, b: 0.3297231, a: 1}
    - _WindFrequency: {r: 0.025, g: 0.025, b: 0, a: 0}
