{
  "_id": {
    "$oid": "6033ff9bf95f532835952479"
  },
  "p": {
    "x": -1.4028402631,
    "y": 2.7263059094,
    "z": -0.0142625685
  },
  "i": 6,
  "r": 160167,
  "__v": 1.0,
  "baseName": "FG-44663",
  "seed": "0x3260ae77b0579f663ee20a9eb7de1148e38cac084783faa7ab5ea294326a24fb",
  "spectralType": 0,
  "orbital": {
    "a": 2.447,
    "e": 0.269,
    "i": 0.04974188368183839,
    "o": 2.1395991300198487,
    "w": 3.312111321509639,
    "m": 0.9262462340333908
  },
  "name": "FG-44663",
  "events": []
}
