{
	"defaultSeverity": "INFO",
	"checks": [{
			"type": "Anonymous"
		},
		{
			"type": "ArrayAccess"
		},
		{
			"type": "ArrayLiteral"
		},
		{
			"type": "AvoidStarImport"
		},
		{
			"props": {
				"format": "^(e)$"
			},
			"type": "CatchParameterName"
		},
		{
			"props": {
				"ignoreExtern": true,
				"format": "^[A-Z][A-Z0-9]*(_[A-Z0-9_]+)*$"
			},
			"type": "ConstantName"
		},
		{
			"props": {
				"thresholds": [{
						"complexity": 20,
						"severity": "WARNING"
					},
					{
						"complexity": 25,
						"severity": "ERROR"
					}
				]
			},
			"type": "CyclomaticComplexity"
		},
		{
			"type": "DefaultComesLast"
		},
		{
			"type": "Dynamic"
		},
		{
			"type": "ERegLiteral"
		},
		{
			"props": {
				"tokens": [
					"CLASS_DEF",
					"ENUM_DEF",
					"ABSTRACT_DEF",
					"TYPEDEF_DEF",
					"INTERFACE_DEF",
					"OBJECT_DECL",
					"FUNCTION",
					"FOR",
					"IF",
					"WHILE",
					"SWITCH",
					"TRY",
					"CATCH"
				],
				"option": "empty"
			},
			"type": "EmptyBlock"
		},
		{
			"props": {
				"max": 1,
				"requireEmptyLineAfterAbstract": false,
				"requireEmptyLineAfterClass": false,
				"requireEmptyLineAfterInterface": false

			},
			"type": "EmptyLines"
		},
		{
			"type": "EmptyPackage"
		},
		{
			"props": {
				"max": 1,
				"skipSingleLineTypes": true,
				"defaultPolicy": "ignore",
				"exact": [
					"inFunction",
					"afterPackage",
					"afterImports",
					"beforeUsing",
					"betweenTypes",
					"afterAbstractVars",
					"betweenAbstractMethods",
					"afterClassStaticVars",
					"afterClassVars",
					"betweenClassMethods"
				],
				"upto": [
					"betweenImports",
					"anywhereInFile",
					"betweenAbstractVars",
					"beginClass",
					"betweenClassStaticVars",
					"betweenClassVars",
					"beginInterface",
					"betweenInterfaceFields"
				],
				"ignore": [
					"beforeSingleLineComment"
				]
			},
			"type": "ExtendedEmptyLines"
		},
		{
			"props": {
				"max": 2000
			},
			"type": "FileLength"
		},
		{
			"props": {
				"option": "upperCase"
			},
			"type": "HexadecimalLiteral"
		},
		{
			"props": {
				"ignoreSetter": true,
				"ignoreFormat": "^(main|run)$",
				"ignoreConstructorParameter": true
			},
			"type": "HiddenField"
		},
		{
			"type": "MagicNumber",
			"props": {
				"ignoreNumbers": [
					-1,
					0,
					1,
					2,
					3,
					4,
					5,
					6,
					7,
					8,
					9
				],
				"severity": "INFO"
			}
		},
		{
			"props": {
				"character": "  ",
				"ignoreConditionals": true,
				"conditionalPolicy": "aligned_increase",
				"wrapPolicy": "larger",
				"severity": "IGNORE"
			},
			"type": "Indentation"
		},
		{
			"type": "InnerAssignment"
		},
		{
			"props": {
				"allowMarkerInterfaces": true,
				"allowProperties": false
			},
			"type": "Interface"
		},
		{
			"props": {
				"tokens": [
					"CLASS_DEF",
					"ENUM_DEF",
					"ABSTRACT_DEF",
					"TYPEDEF_DEF",
					"INTERFACE_DEF",
					"FUNCTION",
					"FOR",
					"IF",
					"WHILE",
					"SWITCH",
					"TRY",
					"CATCH"
				],
				"ignoreEmptySingleline": true,
				"option": "eol"
			},
			"type": "LeftCurly"
		},
		{
			"props": {
				"max": 160,
				"ignorePattern": "(^@desc)|(LONG LINE TEST)",
				"severity": "WARNING"
			},
			"type": "LineLength"
		},
		{
			"props": {
				"listeners": [
					"addEventListener",
					"addListener",
					"on",
					"once"
				],
				"format": "^_?[a-z][a-zA-Z0-9]*$"
			},
			"type": "ListenerName"
		},
		{
			"props": {
				"ignoreExtern": true,
				"format": "^[a-z][a-zA-Z0-9]*$"
			},
			"type": "LocalVariableName"
		},
		{
			"props": {
				"ignoreExtern": true,
				"format": "^[a-z][a-zA-Z0-9]*$",
				"tokens": [
					"CLASS",
					"PUBLIC",
					"PRIVATE",
					"TYPEDEF"
				]
			},
			"type": "MemberName"
		},
		{
			"props": {
				"ignoreExtern": true,
				"format": "^[A-Z0-9_]*$",
				"tokens": [
					"ENUM"
				]
			},
			"type": "MemberName"
		},
		{
			"props": {
				"maxPrivate": 50,
				"maxPublic": 50,
				"maxTotal": 50
			},
			"type": "MethodCount"
		},
		{
			"props": {
				"max": 50
			},
			"type": "MethodLength"
		},
		{
			"props": {
				"ignoreExtern": true,
				"format": "^[a-z][a-zA-Z0-9]*$"
			},
			"type": "MethodName"
		},
		{
			"props": {
				"modifiers": [
					"MACRO",
					"OVERRIDE",
					"PUBLIC_PRIVATE",
					"STATIC",
					"INLINE",
					"DYNAMIC"
				]
			},
			"type": "ModifierOrder"
		},
		{
			"props": {
				"minLength": 2,
				"ignore": "^\\s+$",
				"allowDuplicates": 2
			},
			"type": "MultipleStringLiterals"
		},
		{
			"type": "MultipleVariableDeclarations"
		},
		{
			"props": {
				"allowSingleLineStatement": true,
				"tokens": [
					"FOR",
					"IF",
					"ELSE_IF",
					"WHILE",
					"DO_WHILE"
				]
			},
			"type": "NeedBraces"
		},
		{
			"type": "NestedForDepth"
		},
		{
			"type": "NestedIfDepth"
		},
		{
			"type": "NestedTryDepth"
		},
		{
			"props": {
				"assignOpPolicy": "around",
				"unaryOpPolicy": "none",
				"ternaryOpPolicy": "around",
				"arithmeticOpPolicy": "around",
				"compareOpPolicy": "around",
				"bitwiseOpPolicy": "around",
				"boolOpPolicy": "around",
				"intervalOpPolicy": "none",
				"arrowPolicy": "around",
				"functionArgPolicy": "before"
			},
			"type": "OperatorWhitespace"
		},
		{
			"props": {
				"tokens": [
					"=",
					"+",
					"-",
					"*",
					"/",
					"%",
					">",
					"<",
					">=",
					"<=",
					"==",
					"!=",
					"&",
					"|",
					"^",
					"&&",
					"||",
					"<<",
					">>",
					">>>",
					"+=",
					"-=",
					"*=",
					"/=",
					"%=",
					"<<=",
					">>=",
					">>>=",
					"|=",
					"&=",
					"^=",
					"...",
					"=>",
					"++",
					"--"
				],
				"option": "eol"
			},
			"type": "OperatorWrap"
		},
		{
			"props": {
				"ignoreExtern": true,
				"format": "^(_|[a-z][a-zA-Z0-9]*$)"
			},
			"type": "ParameterName"
		},
		{
			"props": {
				"max": 7,
				"ignoreOverriddenMethods": false
			},
			"type": "ParameterNumber"
		},
		{
			"type": "RedundantModifier"
		},
		{
			"props": {
				"allowEmptyReturn": true,
				"enforceReturnType": false
			},
			"type": "Return"
		},
		{
			"props": {
				"tokens": [
					"CLASS_DEF",
					"ENUM_DEF",
					"ABSTRACT_DEF",
					"TYPEDEF_DEF",
					"INTERFACE_DEF",
					"OBJECT_DECL",
					"FUNCTION",
					"FOR",
					"IF",
					"WHILE",
					"SWITCH",
					"TRY",
					"CATCH"
				],
				"option": "aloneorsingle"
			},
			"type": "RightCurly"
		},
		{
			"props": {
				"dotPolicy": "none",
				"commaPolicy": "after",
				"semicolonPolicy": "after"
			},
			"type": "SeparatorWhitespace"
		},
		{
			"props": {
				"tokens": [
					","
				],
				"option": "eol"
			},
			"type": "SeparatorWrap"
		},
		{
			"type": "SimplifyBooleanExpression"
		},
		{
			"type": "SimplifyBooleanReturn"
		},
		{
			"props": {
				"spaceIfCondition": "should",
				"spaceAroundBinop": true,
				"spaceForLoop": "should",
				"ignoreRangeOperator": true,
				"spaceWhileLoop": "should",
				"spaceCatch": "should",
				"spaceSwitchCase": "should",
				"noSpaceAroundUnop": true
			},
			"type": "Spacing"
		},
		{
			"props": {
				"allowException": true,
				"policy": "doubleAndInterpolation"
			},
			"type": "StringLiteral"
		},
		{
			"type": "TODOComment"
		},
		{
			"type": "TabForAligning"
		},
		{
			"props": {
				"severity": "IGNORE"
			},
			"type": "Trace"
		},
		{
			"type": "TrailingWhitespace"
		},
		{
			"props": {
				"ignoreEnumAbstractValues": true,
				"severity": "IGNORE"
			},
			"type": "Type"
		},
		{
			"props": {
				"ignoreExtern": true,
				"format": "^[A-Z]+[a-zA-Z0-9]*$"
			},
			"type": "TypeName"
		},
		{
			"type": "UnnecessaryConstructor"
		},
		{
			"props": {
				"ignoreModules": [
					"haxeparser.Data",
					"haxeparser.Data.Token",
					"haxeparser.Data.TokenDef",
					"haxeparser.Data.TypeDecl",
					"haxe.macro.Expr",
					"haxe.macro.Expr.Access",
					"haxe.macro.Expr.Field",
					"haxe.macro.Expr.Function"
				],
				"moduleTypeMap": {
					"checkstyle.Config": [
						"CheckConfig"
					],
					"checkstyle.ChecksInfo": [
						"CheckInfo"
					]
				}
			},
			"type": "UnusedImport"
		},
		{
			"type": "UnusedLocalVar"
		},
		{
			"type": "VariableInitialisation"
		},
		{
			"props": {
				"tokens": [
					",",
					";"
				]
			},
			"type": "WhitespaceAfter"
		},
		{
			"props": {
				"tokens": [
					"=",
					"+",
					"-",
					"*",
					"/",
					"%",
					">",
					"<",
					">=",
					"<=",
					"==",
					"!=",
					"&",
					"|",
					"^",
					"&&",
					"||",
					"<<",
					">>",
					">>>",
					"+=",
					"-=",
					"*=",
					"/=",
					"%=",
					"<<=",
					">>=",
					">>>=",
					"|=",
					"&=",
					"^=",
					"=>"
				]
			},
			"type": "WhitespaceAround"
		}
	],
	"exclude": {
		"path": "RELATIVE_TO_PROJECT",
		"all": [],
		"Dynamic": [
			"TestMain",
			"tokentree/TokenTreeBuilderParsingTest"
		],
		"MultipleStringLiterals": [
			"token"
		],
		"CyclomaticComplexity": [
			"tokentree/walk/WalkStatement",
			"tokentree/utils/TokenTreeCheckUtils:getBrOpenType",
			"tokentree/utils/TokenTreeCheckUtils:getPOpenType",
			"tokentree/utils/TokenTreeCheckUtils:determinBrChildren"
		],
		"MemberName": [
			"tokentree/utils/TokenTreeCheckUtils:BrOpenType",
			"tokentree/utils/TokenTreeCheckUtils:POpenType"
		],
		"MethodLength": [
			"tokentree/walk/WalkStatement",
			"tokentree/walk/WalkFinal",
			"tokentree/utils/TokenTreeCheckUtils"
		],
		"NestedForDepth": [
			"TestMain"
		]
	}
}