%YAML 1.1
%TAG !u! tag:unity3d.com,2011:
--- !u!21 &2100000
Material:
  serializedVersion: 6
  m_ObjectHideFlags: 0
  m_CorrespondingSourceObject: {fileID: 0}
  m_PrefabInstance: {fileID: 0}
  m_PrefabAsset: {fileID: 0}
  m_Name: Metal pattern 04
  m_Shader: {fileID: 54, guid: 0000000000000000f000000000000000, type: 0}
  m_ShaderKeywords: 
  m_LightmapFlags: 4
  m_EnableInstancingVariants: 0
  m_DoubleSidedGI: 0
  m_CustomRenderQueue: -1
  stringTagMap: {}
  disabledShaderPasses: []
  m_SavedProperties:
    serializedVersion: 3
    m_TexEnvs:
    - _BumpMap:
        m_Texture: {fileID: 2800000, guid: 1e1dd049614ab114c964d06be44cc7a3, type: 3}
        m_Scale: {x: 4, y: 5}
        m_Offset: {x: 0, y: 4}
    - _MainTex:
        m_Texture: {fileID: 2800000, guid: fe2a0c89a1db804408d0ce437e3d2f59, type: 3}
        m_Scale: {x: 4, y: 4}
        m_Offset: {x: 0, y: 4}
    m_Floats:
    - _Cutoff: 0.23134328
    - _Shininess: 0.15685356
    m_Colors:
    - _Color: {r: 1, g: 1, b: 1, a: 1}
    - _SpecColor: {r: 1, g: 1, b: 1, a: 1}
