{
  "TimeSeries": [
    25.0,
    20.0,
    30.0,
    25.0,
    20.0,
    15.0,
    25.0,
    20.0,
    30.0,
    25.0,
    35.0,
    30.0,
    25.0,
    20.0,
    30.0,
    25.0,
    20.0,
    15.0,
    25.0,
    20.0,
    15.0,
    10.0,
    20.0,
    15.0,
    25.0,
    20.0,
    30.0,
    25.0,
    20.0,
    15.0,
    25.0,
    20.0,
    30.0,
    25.0,
    35.0,
    30.0,
    25.0,
    20.0,
    30.0,
    25.0,
    35.0,
    30.0,
    40.0,
    35.0,
    30.0,
    25.0,
    35.0,
    30.0,
    25.0,
    20.0
  ],
  "Accuracy": 1.0
}