<svg width="288" height="288" viewBox="0 0 288 288" fill="none" xmlns="http://www.w3.org/2000/svg">
<path d="M218.93 223.682C218.93 223.682 207.308 187.707 204.641 174.966C201.976 162.225 191.017 121.252 178.62 111.102C166.224 100.951 158.376 95.7643 147.921 96.7248C137.467 97.6853 117.693 77.4432 117.693 77.4432L54.6278 37.4285C54.6278 37.4285 129.878 102.097 113.527 107.366C96.1445 112.967 42.7579 100.649 42.7579 100.649C42.7579 100.649 113.414 148.162 129.518 167.839C154.176 197.968 142.848 212.969 148.225 245.596C150.579 259.885 192.936 258.038 205.328 255.335C240.931 247.568 218.93 223.682 218.93 223.682Z" fill="#0D010F"/>
<path d="M37.9786 27.936C40.2869 29.039 42.5448 30.2342 44.8186 31.4021L51.5563 35.0554C56.0376 37.5149 60.4469 40.0954 64.8302 42.7277C73.584 48.011 82.1592 53.6054 90.5141 59.5814C94.6843 62.581 98.8085 65.6611 102.826 68.9184C106.865 72.1498 110.786 75.5597 114.579 79.213C116.48 81.0374 118.319 82.9512 120.099 84.9802C121.876 87.0134 123.594 89.1576 125.169 91.5653C125.944 92.7994 126.694 94.0522 127.336 95.4994C127.977 96.9365 128.559 98.4917 128.873 100.332C128.943 100.912 128.987 101.521 129.008 102.116C128.991 102.747 128.896 103.424 128.788 104.066C128.619 104.718 128.386 105.381 128.121 106.003C127.807 106.579 127.46 107.178 127.079 107.686C126.688 108.144 126.269 108.625 125.846 109.015C125.43 109.364 124.998 109.706 124.563 110.026C124.15 110.284 123.729 110.534 123.306 110.776C122.884 111.014 122.496 111.165 122.086 111.357C120.479 112.042 118.963 112.448 117.51 112.74L116.418 112.956L115.353 113.118C114.636 113.236 113.944 113.301 113.246 113.377C110.467 113.655 107.775 113.73 105.111 113.71C99.7906 113.629 94.5979 113.224 89.447 112.641C79.1568 111.45 69.0466 109.668 59.0256 107.549C49.0075 105.425 39.0802 102.989 29.2349 100.261C24.3158 98.8848 19.4098 97.4707 14.5382 95.9314L7.24176 93.5957C4.82256 92.7662 2.3976 91.967 0 91.0757C20.2306 93.9557 40.2926 97.2302 60.3432 99.9965C70.3642 101.354 80.3808 102.642 90.3398 103.435C95.3122 103.82 100.279 104.132 105.133 104.079C107.554 104.066 109.954 103.984 112.234 103.735C112.798 103.667 113.374 103.612 113.911 103.516L114.731 103.388L115.508 103.225C116.546 103.016 117.49 102.721 118.221 102.408C118.385 102.328 118.598 102.259 118.727 102.18C118.85 102.099 118.979 102.027 119.112 101.962C119.18 101.893 119.246 101.838 119.33 101.795C119.369 101.752 119.353 101.736 119.399 101.732C119.39 101.729 119.343 101.762 119.369 101.801C119.323 101.83 119.308 101.89 119.323 101.938C119.284 101.948 119.301 101.995 119.314 101.994C119.288 101.953 119.291 101.929 119.31 101.876C119.095 100.493 118.191 98.555 117.048 96.7046C114.696 92.9275 111.429 89.2598 108.053 85.729C101.213 78.6658 93.5741 72.085 85.847 65.6251C78.0941 59.1725 70.1381 52.897 62.1317 46.6517L37.9786 27.936Z" fill="#0200F0"/>
<path d="M105.788 69.889C110.763 72.2102 115.404 75.2414 119.916 78.4181C124.371 81.6638 128.694 85.2005 132.431 89.5248C134.306 91.6819 136.028 94.0392 137.421 96.7478C138.105 98.1058 138.691 99.5616 139.098 101.134C139.297 101.912 139.463 102.754 139.545 103.555C139.63 104.358 139.668 105.183 139.634 106.024C139.584 107.699 139.236 109.449 138.555 111.09C137.874 112.733 136.836 114.225 135.626 115.442C133.184 117.893 130.258 119.324 127.408 120.286C124.538 121.247 121.667 121.794 118.82 122.115C115.973 122.439 113.151 122.563 110.35 122.537C104.748 122.52 99.2376 121.954 93.7915 121.179C82.9138 119.51 72.2765 116.934 61.9243 113.412C72.8107 114.369 83.5747 115.642 94.2998 116.211C99.6523 116.523 104.995 116.662 110.251 116.472C115.479 116.243 120.731 115.716 125.312 114.16C127.571 113.367 129.642 112.311 131.05 110.897C132.46 109.492 133.235 107.81 133.364 105.729C133.717 101.562 131.269 96.984 128.281 92.8296C126.765 90.7459 125.086 88.7198 123.309 86.7571C121.549 84.7757 119.693 82.8504 117.76 80.9885C113.941 77.2027 109.908 73.4933 105.788 69.889Z" fill="#F0CD03"/>
<path d="M90.2693 133.461C92.8181 132.388 95.6074 131.908 98.3952 131.687C101.193 131.481 104.021 131.619 106.825 131.986C109.621 132.394 112.392 133.04 115.098 133.903C117.792 134.793 120.42 135.884 122.956 137.157C128.039 139.692 132.719 142.942 137.028 146.572C138.102 147.483 139.14 148.432 140.188 149.373C141.204 150.355 142.206 151.299 143.207 152.34C145.212 154.417 147.066 156.655 148.702 159.047C151.991 163.819 154.452 169.155 155.971 174.696C157.527 180.233 158.141 185.957 158.08 191.593C158.004 197.238 157.18 202.808 155.864 208.2C154.476 213.572 152.663 218.832 150.039 223.669C151.396 218.36 152.332 213.018 152.869 207.671C153.432 202.333 153.531 196.988 153.134 191.739C152.372 181.251 149.291 171.086 143.389 162.73C141.916 160.648 140.296 158.666 138.541 156.803C137.668 155.867 136.682 154.947 135.77 154.004C134.817 153.096 133.871 152.176 132.895 151.295C128.988 147.776 124.848 144.526 120.39 141.784C118.158 140.423 115.864 139.154 113.482 138.061C111.113 136.94 108.657 135.986 106.125 135.253C103.601 134.497 101.006 133.903 98.3534 133.593C97.0286 133.416 95.688 133.305 94.3416 133.286C92.9895 133.25 91.633 133.288 90.2693 133.461Z" fill="#0200F0"/>
<path d="M162.052 232.916C163.24 230.579 164.242 228.165 165.126 225.716C166.022 223.272 166.791 220.788 167.429 218.278C168.708 213.263 169.584 208.159 169.826 203.04C170.113 197.928 169.9 192.809 169.069 187.805C168.218 182.807 166.884 177.909 164.964 173.244C164.449 172.092 164.01 170.909 163.439 169.785C162.864 168.661 162.338 167.517 161.728 166.414L159.867 163.123L157.83 159.935C155.013 155.724 151.737 151.979 148.287 147.855C144.916 143.767 141.631 139.588 138.745 134.8L137.72 132.929C137.393 132.286 137.097 131.603 136.787 130.941C136.512 130.232 136.237 129.522 136.002 128.775C135.809 127.981 135.557 127.246 135.478 126.364C135.433 125.932 135.347 125.528 135.351 125.071C135.353 124.618 135.361 124.161 135.379 123.708C135.403 123.252 135.518 122.779 135.598 122.316C135.667 121.847 135.828 121.401 135.996 120.954C136.293 120.03 136.786 119.264 137.282 118.466C137.585 118.086 137.89 117.668 138.217 117.34C138.547 117.026 138.876 116.688 139.222 116.41C140.597 115.271 142.116 114.533 143.692 114.003C144.475 113.714 145.29 113.57 146.1 113.401C146.917 113.321 147.74 113.178 148.562 113.221C150.215 113.177 151.831 113.514 153.387 113.944C154.145 114.206 154.901 114.49 155.625 114.816C156.313 115.191 157.048 115.52 157.689 115.955C158.316 116.401 158.992 116.808 159.568 117.301C160.137 117.798 160.733 118.279 161.27 118.8L162.799 120.419C163.051 120.694 163.325 121.049 163.565 121.359C163.786 121.671 164.028 121.99 164.225 122.298C165.845 124.773 167.016 127.178 168.156 129.623C170.388 134.499 172.346 139.389 174.217 144.308C176.102 149.219 177.877 154.153 179.628 159.09L184.877 173.881C186.6 178.816 188.355 183.735 190.169 188.629C191.946 193.535 193.823 198.4 195.873 203.183C196.898 205.573 197.993 207.933 199.248 210.198C199.871 211.334 200.546 212.44 201.329 213.464C201.73 213.965 202.147 214.462 202.641 214.868C203.122 215.279 203.684 215.657 204.349 215.702C203.681 215.751 203.036 215.441 202.481 215.084C201.912 214.724 201.424 214.266 200.946 213.8C200.015 212.846 199.188 211.801 198.415 210.724C196.89 208.557 195.54 206.28 194.253 203.979C191.687 199.367 189.439 194.607 187.214 189.847C185.037 185.064 182.962 180.243 180.901 175.422C178.841 170.601 176.892 165.74 174.889 160.908C170.853 151.278 167.039 141.497 162.588 132.277C161.459 130.013 160.292 127.716 159.005 125.836C158.846 125.595 158.685 125.398 158.528 125.176C158.361 124.976 158.239 124.809 158.046 124.606L156.861 123.389C156.453 123.006 156.017 122.678 155.602 122.315C155.183 121.958 154.715 121.712 154.28 121.396C152.49 120.254 150.525 119.668 148.581 119.683C148.092 119.642 147.616 119.76 147.135 119.789C146.668 119.906 146.187 119.971 145.744 120.151C144.85 120.452 143.977 120.891 143.339 121.434C143.173 121.563 143.055 121.706 142.903 121.833C142.764 121.964 142.7 122.092 142.58 122.208C142.41 122.53 142.152 122.856 142.073 123.195C141.826 123.859 141.722 124.58 141.877 125.505C142.088 127.316 143.119 129.506 144.295 131.594C146.735 135.827 149.901 139.932 153.066 144.004C156.211 147.997 159.72 152.253 162.592 156.839C165.519 161.401 167.878 166.336 169.685 171.448C171.48 176.564 172.738 181.873 173.269 187.25C173.791 192.627 173.673 198.036 172.983 203.34C172.824 204.667 172.557 205.98 172.338 207.294C172.05 208.598 171.814 209.909 171.465 211.195C170.839 213.781 170.058 216.324 169.135 218.808C167.308 223.779 165.021 228.583 162.052 232.916Z" fill="#F0CD03"/>
<path d="M105.402 146.013C107.109 145.931 108.557 146.712 110.213 147.144C111.878 147.59 113.456 148.251 115.026 148.958C118.128 150.425 121.009 152.313 123.657 154.446C124.337 154.964 124.988 155.51 125.613 156.083C126.24 156.652 126.896 157.202 127.502 157.791C128.683 159.001 129.931 160.16 131.013 161.453L132.687 163.354L134.284 165.381C134.79 166.077 135.308 166.762 135.799 167.468C136.279 168.18 136.763 168.89 137.21 169.622C140.859 175.44 143.45 181.853 144.952 188.44C145.695 191.736 146.184 195.075 146.375 198.422C146.471 200.095 146.494 201.768 146.422 203.439C146.363 205.105 146.228 206.773 145.93 208.411C144.691 201.91 142.842 195.716 140.558 189.779C138.247 183.853 135.38 178.24 131.89 173.089C131.008 171.808 130.098 170.551 129.155 169.318L127.692 167.511L126.156 165.702C124.114 163.282 122.001 160.943 119.834 158.656C117.665 156.367 115.37 154.254 112.974 152.173C111.764 151.158 110.506 150.169 109.267 149.121C107.973 148.157 106.752 147.09 105.402 146.013Z" fill="#F0CD03"/>
<path d="M142.808 96.277C144.197 96.264 149.279 96.9019 150.532 97.5485C151.178 97.8408 151.776 98.2123 152.376 98.5824C152.97 98.9611 153.606 99.2894 154.166 99.7142C155.297 100.552 156.492 101.331 157.536 102.279L159.155 103.65C159.702 104.102 160.168 104.629 160.68 105.117C161.679 106.114 162.707 107.093 163.606 108.177C164.519 109.248 165.509 110.271 166.36 111.391L168.948 114.739C172.205 119.331 175.203 124.118 177.83 129.083L179.806 132.808C180.459 134.055 181.027 135.32 181.642 136.575L183.453 140.35L185.198 144.153C189.891 154.28 193.939 164.677 198.072 174.953C202.198 185.219 206.176 195.517 211.319 204.998C213.898 209.722 216.775 214.23 220.14 218.284L222.778 221.204L224.261 222.831C224.79 223.379 225.268 223.995 225.743 224.617C227.625 227.084 229.258 230.03 229.841 233.441C230.391 236.844 229.743 240.539 228.076 243.418C226.469 246.348 224.205 248.651 221.777 250.484C216.891 254.164 211.373 256.352 205.798 257.833C200.202 259.263 194.488 260.05 188.771 260.057C185.9 260.074 183.079 259.911 180.279 259.667C177.473 259.42 174.668 259.093 171.883 258.61C169.101 258.114 166.336 257.486 163.62 256.663C160.907 255.842 158.233 254.821 155.727 253.44C153.249 252.043 150.661 250.701 149.092 248.043C148.359 246.8 147.685 245.461 147.416 244.053C147.148 242.643 146.962 241.046 147.406 239.734C147.584 241.214 147.717 242.519 148.019 243.894C148.424 245.18 149.027 246.377 149.914 247.368C151.688 249.371 154.071 250.744 156.524 251.823C161.495 253.932 166.91 254.916 172.319 255.447C175.029 255.717 177.754 255.879 180.484 255.938C183.221 256.003 185.952 255.984 188.623 255.797C193.992 255.449 199.32 254.527 204.401 252.956C206.94 252.171 209.403 251.195 211.742 250.039C214.079 248.888 216.298 247.552 218.233 245.978C220.179 244.418 221.783 242.577 222.804 240.612C223.871 238.648 224.114 236.563 223.772 234.501C223.354 232.435 222.261 230.367 220.759 228.47C220.386 227.994 220.013 227.517 219.567 227.075L218.229 225.645L215.247 222.432C211.49 217.968 208.364 213.096 205.612 208.099C200.202 198.04 196.249 187.55 192.347 177.153C190.421 171.945 188.52 166.743 186.561 161.577C185.583 158.993 184.592 156.413 183.587 153.845L182.102 149.98L180.559 146.143L179.005 142.308L177.386 138.504C176.838 137.242 176.327 135.95 175.748 134.712L174.041 130.978C171.796 125.977 169.167 121.179 166.321 116.513C163.446 111.871 160.154 107.487 156.332 103.598C155.412 102.581 154.348 101.736 153.334 100.817C152.832 100.351 152.258 99.985 151.721 99.563C151.178 99.1469 150.631 98.7365 150.045 98.3894C148.908 97.6349 143.497 96.3504 142.808 96.277Z" fill="#0200F0"/>
<path d="M177.096 181.378C178.495 184.788 179.739 188.266 180.868 191.782C182.007 195.297 183.015 198.86 183.852 202.477C184.692 206.093 185.387 209.762 185.702 213.52C185.858 215.4 185.936 217.302 185.829 219.234C185.715 221.164 185.458 223.137 184.738 225.108C184.552 225.598 184.34 226.087 184.078 226.565C183.954 226.806 183.815 227.043 183.66 227.275C183.542 227.474 183.298 227.822 183.07 228.06C182.163 229.006 181.297 229.507 180.436 230.028C178.718 231.016 177.025 231.791 175.344 232.577C172.001 234.145 168.67 235.585 165.639 237.351C164.133 238.232 162.7 239.191 161.496 240.265C160.289 241.332 159.36 242.542 158.944 243.711L158.874 243.932C158.855 243.983 158.862 243.973 158.864 243.969C158.864 243.969 158.862 243.963 158.867 243.955C158.872 243.929 158.872 243.864 158.867 243.816C158.846 243.711 158.826 243.746 158.952 243.875C159.185 244.142 159.81 244.541 160.485 244.843C161.875 245.472 163.554 245.926 165.243 246.279C172.107 247.607 179.421 247.811 186.584 247.484C193.751 247.108 200.974 246.165 207.635 243.877C210.933 242.731 214.137 241.187 216.461 238.89C216.743 238.601 217.02 238.307 217.276 238C217.398 237.845 217.528 237.691 217.642 237.529L217.814 237.287L217.898 237.165L217.94 237.105L217.961 237.074L217.914 237.162C217.765 237.492 217.819 237.747 217.832 237.804C217.858 237.895 217.866 237.887 217.86 237.866C217.845 237.813 217.774 237.685 217.678 237.554C217.486 237.288 217.217 236.992 216.927 236.709C215.739 235.567 214.262 234.547 212.743 233.651C206.614 230.037 199.377 228.074 192.005 228.187C199.303 226.914 207.058 228.178 213.931 231.43C215.646 232.278 217.312 233.224 218.889 234.514C219.283 234.847 219.672 235.198 220.058 235.647C220.251 235.873 220.445 236.125 220.637 236.483C220.732 236.668 220.83 236.874 220.899 237.191C220.964 237.472 221.013 237.97 220.765 238.509L220.681 238.674L220.657 238.717L220.608 238.804L220.51 238.975L220.307 239.312C220.172 239.537 220.022 239.751 219.875 239.967C219.573 240.392 219.252 240.8 218.909 241.184C216.121 244.243 212.576 246.118 209.038 247.588C205.474 249.057 201.771 249.981 198.068 250.724C194.357 251.44 190.619 251.945 186.864 252.189C183.112 252.448 179.346 252.511 175.576 252.34C171.804 252.177 168.032 251.797 164.238 250.975C162.337 250.548 160.436 250.046 158.476 249.14C157.499 248.656 156.482 248.136 155.461 247.043C154.966 246.499 154.447 245.719 154.251 244.706C154.152 244.208 154.152 243.675 154.234 243.197C154.251 243.073 154.279 242.96 154.308 242.846C154.336 242.729 154.369 242.608 154.39 242.552L154.536 242.117C155.39 239.806 156.97 238.147 158.532 236.825C160.125 235.502 161.81 234.472 163.506 233.551C166.908 231.728 170.385 230.332 173.795 228.989C175.488 228.309 177.182 227.635 178.701 226.868C179.44 226.493 180.181 226.048 180.569 225.678C180.684 225.585 180.943 225.22 181.122 224.906C181.318 224.587 181.486 224.235 181.643 223.872C182.28 222.415 182.625 220.715 182.821 218.987C183.017 217.251 183.05 215.464 183.002 213.671C182.886 210.082 182.472 206.459 181.912 202.853C180.742 195.646 179.078 188.471 177.096 181.378Z" fill="#0200F0"/>
<path d="M162.23 99.5429C164.642 100.305 166.944 101.429 169.147 102.707C171.354 103.982 173.481 105.425 175.483 107.031C179.508 110.222 183.108 113.982 186.234 118.113C186.981 119.169 187.806 120.18 188.492 121.28L190.561 124.577C191.798 126.852 193.085 129.122 194.075 131.521C194.587 132.705 195.16 133.903 195.587 135.092L196.93 138.663C197.381 139.853 197.745 141.071 198.157 142.273C198.564 143.479 198.956 144.687 199.313 145.904C202.298 155.632 204.091 165.563 206.054 175.258C207.024 180.117 208.106 184.918 209.415 189.683C209.707 190.888 210.087 192.06 210.439 193.249L210.964 195.036L211.545 196.806C212.283 199.189 212.119 202.176 212.931 204.574C209.969 200.493 208.542 195.389 206.412 190.774C204.29 186.155 202.573 181.348 201.102 176.521C198.166 166.847 195.967 157.169 193.091 147.78C192.758 146.596 192.391 145.426 192.01 144.261C191.629 143.094 191.275 141.919 190.873 140.761L189.685 137.28C189.305 136.103 188.814 135.036 188.402 133.898C187.608 131.625 186.503 129.495 185.532 127.292L183.848 124.105C183.308 123.026 182.631 122.031 182.029 120.986C179.516 116.873 176.61 112.975 173.321 109.359C170.027 105.751 166.392 102.372 162.23 99.5429Z" fill="#F0CD03"/>
<path d="M78.0955 59.3611C86.9054 65.0621 96.7118 72.792 104.629 79.7054C108.546 83.2205 112.398 86.8061 115.93 90.9547C116.811 92.0002 117.684 93.0773 118.502 94.2739C118.908 94.8874 119.311 95.5008 119.688 96.2136C120.063 96.9307 120.436 97.6853 120.708 98.7379C120.774 98.9986 120.835 99.275 120.869 99.612C120.915 99.9072 120.921 100.3 120.9 100.686C120.902 100.832 120.846 101.195 120.786 101.458C120.712 101.73 120.622 102.02 120.504 102.257C120.272 102.774 119.981 103.152 119.686 103.487C119.101 104.116 118.554 104.453 118.067 104.723C117.577 104.986 117.134 105.166 116.716 105.313C115.052 105.882 113.635 106.085 112.216 106.272C109.407 106.619 106.723 106.641 104.049 106.646C101.379 106.635 98.7365 106.5 96.1056 106.348C90.8467 105.988 85.631 105.454 80.4442 104.738C70.0762 103.301 59.7888 101.405 49.6613 98.6256C60.1546 98.6414 70.547 99.1382 80.905 99.5703C86.0818 99.7747 91.2456 100.02 96.3821 100.128C98.9482 100.207 101.508 100.223 104.04 100.205C106.567 100.194 109.093 100.083 111.455 99.8352C112.614 99.707 113.589 98.195 113.292 97.7155C112.668 96.7478 111.964 95.7514 111.21 94.775C108.151 90.8654 104.665 87.0451 101.143 83.291C94.1069 75.7296 85.2048 67.0622 78.0955 59.3611Z" fill="#F0CD03"/>
<path d="M71.0827 53.761C77.5699 57.5366 99.1598 79.3886 103.648 83.9592C105.875 86.2675 108.056 88.6162 110.092 91.1966C110.601 91.8461 111.105 92.5056 111.594 93.2126C112.078 93.9355 112.55 94.6498 113 95.6275L113.165 96.0322C113.22 96.1862 113.272 96.3446 113.322 96.5146C113.404 96.9091 113.545 97.3094 113.422 98.1504C113.318 98.725 113.041 99.1901 112.802 99.4853C112.548 99.7992 112.342 99.959 112.134 100.12C111.744 100.404 111.436 100.548 111.151 100.675C110.048 101.13 109.208 101.282 108.336 101.458C104.94 102.053 101.75 102.165 98.5219 102.25C95.305 102.3 92.1067 102.244 88.9157 102.079C82.5336 101.746 49.1933 99.72 35.6083 96.3907C41.9832 95.5267 82.5739 98.5622 88.8912 98.1605L98.3261 97.5715C101.434 97.3613 104.604 97.151 107.473 96.683C108.158 96.5664 108.081 96.3792 107.7 95.7715C107.32 95.1494 106.897 94.5202 106.462 93.8938C104.698 91.3882 102.777 88.8826 100.85 86.3899C96.997 81.3859 74.7806 59.0054 71.0827 53.761Z" fill="#0D010F"/>
<path d="M209.915 237.983C210.326 240.854 199.858 242.654 189.216 242.847C179.008 243.032 168.494 245.308 168.083 242.437C167.671 239.566 177.552 233.662 187.659 232.21C197.765 230.76 209.503 235.112 209.915 237.983Z" fill="#F0CD03"/>
</svg>
