<svg width="40" height="39" viewBox="0 0 40 39" fill="none" xmlns="http://www.w3.org/2000/svg">
<path d="M33.1249 7.72242C32.3429 6.9229 31.4136 6.28853 30.3905 5.85568C29.3674 5.42283 28.2704 5.20001 27.1626 5.20001C26.0547 5.20001 24.9578 5.42283 23.9346 5.85568C22.9115 6.28853 21.9823 6.9229 21.2003 7.72242L20 8.96119L18.7998 7.72242C18.0178 6.9229 17.0886 6.28853 16.0654 5.85568C15.0423 5.42283 13.9453 5.20001 12.8375 5.20001C11.7296 5.20001 10.6327 5.42283 9.60955 5.85568C8.58641 6.28853 7.65719 6.9229 6.87519 7.72242C3.5706 11.0893 3.36796 16.7749 7.52987 21.0947L20 33.8L32.4702 21.0947C36.6321 16.7749 36.4294 11.0893 33.1249 7.72242Z" stroke="#E6E6E6" stroke-width="2" stroke-linecap="round" stroke-linejoin="round"/>
<path d="M20.527 28.4594L11.0405 18.973" stroke="#E6E6E6" stroke-width="2" stroke-linecap="round"/>
</svg>
