{
  "file_generated_by": "FlutterFire CLI",
  "purpose": "FirebaseAppID & ProjectID for this Firebase app in this directory",
  "GOOGLE_APP_ID": "1:598711147826:ios:63f0ede9e12b311a370b2b",
  "FIREBASE_PROJECT_ID": "galix-cashback",
  "GCM_SENDER_ID": "598711147826"
}