{
  "project_info": {
    "project_number": "598711147826",
    "project_id": "galix-cashback",
    "storage_bucket": "galix-cashback.appspot.com"
  },
  "client": [
    {
      "client_info": {
        "mobilesdk_app_id": "1:598711147826:android:c3c4bd9714dd4a5e370b2b",
        "android_client_info": {
          "package_name": "com.example.cashback_app"
        }
      },
      "oauth_client": [
        {
          "client_id": "598711147826-n3h6iu2t5l0s447gug046uiuuii2ge2e.apps.googleusercontent.com",
          "client_type": 3
        }
      ],
      "api_key": [
        {
          "current_key": "AIzaSyCbee-xXbWO2sicgTV90xYhSVzTamuATFs"
        }
      ],
      "services": {
        "appinvite_service": {
          "other_platform_oauth_client": [
            {
              "client_id": "598711147826-n3h6iu2t5l0s447gug046uiuuii2ge2e.apps.googleusercontent.com",
              "client_type": 3
            },
            {
              "client_id": "598711147826-4esakpbj16hcdqs0uo2b1d7154hbgdd7.apps.googleusercontent.com",
              "client_type": 2,
              "ios_info": {
                "bundle_id": "com.example.cashbackApp"
              }
            }
          ]
        }
      }
    }
  ],
  "configuration_version": "1"
}