20170707 09:54:00
Signal on stock MU --- ADX = 17.35475054489935  |  previous slow K 14 = 75.0  |  slow K 14 = 81.25  |  slow K 70 = 81.5789


20170707 10:00:00
Signal on stock COG --- ADX = 15.380834390468694  |  previous slow K 14 = 75.0  |  slow K 14 = 80.5556  |  slow K 70 = 54.6667


20170707 10:08:00
Signal on stock MAT --- ADX = 15.809041482893106  |  previous slow K 14 = 76.1905  |  slow K 14 = 80.9524  |  slow K 70 = 91.6667


20170707 10:08:00
Signal on stock UGAZ --- ADX = 19.89320492861355  |  previous slow K 14 = 66.6667  |  slow K 14 = 84.8485  |  slow K 70 = 75.0


20170707 10:14:00
Signal on stock MAT --- ADX = 12.120605873672607  |  previous slow K 14 = 71.4286  |  slow K 14 = 95.2381  |  slow K 70 = 97.9167


20170707 10:31:00
Signal on stock MU --- ADX = 16.45186660882013  |  previous slow K 14 = 74.7685  |  slow K 14 = 89.5833  |  slow K 70 = 72.7273


20170707 10:33:00
Signal on stock NFLX --- ADX = 14.75806032854531  |  previous slow K 14 = 76.2255  |  slow K 14 = 81.3725  |  slow K 70 = 90.4704


20170707 10:38:00
Signal on stock MU --- ADX = 14.248361236932652  |  previous slow K 14 = 70.8333  |  slow K 14 = 83.3333  |  slow K 70 = 71.7172


20170707 10:44:00
Signal on stock AMD --- ADX = 13.313185677008624  |  previous slow K 14 = 73.3333  |  slow K 14 = 83.3333  |  slow K 70 = 77.0313


20170707 10:55:00
Signal on stock JDST --- ADX = 15.309469087569704  |  previous slow K 14 = 76.6277  |  slow K 14 = 84.4021  |  slow K 70 = 67.0292


20170707 10:56:00
Signal on stock TZA --- ADX = 18.504498704550336  |  previous slow K 14 = 75.0842  |  slow K 14 = 92.5926  |  slow K 70 = 64.1414


20170707 10:58:00
Signal on stock NFLX --- ADX = 11.282649538975877  |  previous slow K 14 = 77.3789  |  slow K 14 = 88.49  |  slow K 70 = 78.5141


20170707 10:59:00
Signal on stock JDST --- ADX = 14.911729823225825  |  previous slow K 14 = 74.4877  |  slow K 14 = 84.0329  |  slow K 70 = 72.9167


20170707 11:03:00
Signal on stock CY --- ADX = 11.151175198568604  |  previous slow K 14 = 66.6667  |  slow K 14 = 100.0  |  slow K 70 = 64.1751


20170707 11:09:00
Signal on stock MU --- ADX = 19.495089662147183  |  previous slow K 14 = 76.7677  |  slow K 14 = 87.8788  |  slow K 70 = 84.6154


20170707 11:11:00
Signal on stock OXY --- ADX = 14.883570760015967  |  previous slow K 14 = 77.193  |  slow K 14 = 82.1188  |  slow K 70 = 57.5758


20170707 11:12:00
Signal on stock AFSI --- ADX = 15.711678673343446  |  previous slow K 14 = 77.7778  |  slow K 14 = 100.0  |  slow K 70 = 59.375


20170707 11:13:00
Signal on stock GUSH --- ADX = 18.796079433557743  |  previous slow K 14 = 71.3889  |  slow K 14 = 85.0  |  slow K 70 = 50.9471


20170707 11:18:00
Signal on stock GUSH --- ADX = 19.97035402571183  |  previous slow K 14 = 68.8889  |  slow K 14 = 88.8889  |  slow K 70 = 66.9859


20170707 11:19:00
Signal on stock MT --- ADX = 16.899222179751273  |  previous slow K 14 = 72.2222  |  slow K 14 = 83.3333  |  slow K 70 = 57.3132


20170707 11:19:00
Signal on stock FCX --- ADX = 11.706326278289533  |  previous slow K 14 = 69.4444  |  slow K 14 = 80.5556  |  slow K 70 = 85.7143


20170707 11:26:00
Signal on stock VRX --- ADX = 18.079065698100127  |  previous slow K 14 = 61.1111  |  slow K 14 = 80.0  |  slow K 70 = 89.7788


20170707 11:28:00
Signal on stock UWT --- ADX = 19.211445593029744  |  previous slow K 14 = 78.5714  |  slow K 14 = 85.7143  |  slow K 70 = 92.5926


20170707 11:28:00
Signal on stock GUSH --- ADX = 17.792193178276616  |  previous slow K 14 = 73.0159  |  slow K 14 = 83.2451  |  slow K 70 = 92.8095


20170707 11:29:00
Signal on stock MT --- ADX = 15.734604527010514  |  previous slow K 14 = 77.7778  |  slow K 14 = 88.8889  |  slow K 70 = 82.1429


20170707 11:29:00
Signal on stock FCX --- ADX = 13.69487896506175  |  previous slow K 14 = 71.1111  |  slow K 14 = 83.0159  |  slow K 70 = 93.3135


20170707 11:29:00
Signal on stock LABU --- ADX = 19.02888111748192  |  previous slow K 14 = 76.2626  |  slow K 14 = 81.8455  |  slow K 70 = 76.1574


20170707 11:30:00
Signal on stock MU --- ADX = 18.150525168634243  |  previous slow K 14 = 77.1429  |  slow K 14 = 85.7143  |  slow K 70 = 96.1538


20170707 11:30:00
Signal on stock MRO --- ADX = 18.837066630106673  |  previous slow K 14 = 75.8333  |  slow K 14 = 83.1061  |  slow K 70 = 64.8148


20170707 11:31:00
Signal on stock SNCR --- ADX = 17.344387338270337  |  previous slow K 14 = 73.3333  |  slow K 14 = 100.0  |  slow K 70 = 100.0


20170707 11:31:00
Signal on stock COG --- ADX = 14.369225369079995  |  previous slow K 14 = 71.2963  |  slow K 14 = 81.0185  |  slow K 70 = 90.0


20170707 11:31:00
Signal on stock M --- ADX = 17.359053061525994  |  previous slow K 14 = 79.8653  |  slow K 14 = 81.2121  |  slow K 70 = 56.8627


20170707 11:34:00
Signal on stock JD --- ADX = 16.008087760147585  |  previous slow K 14 = 70.0  |  slow K 14 = 86.6667  |  slow K 70 = 61.9048


20170707 11:42:00
Signal on stock JD --- ADX = 18.775762162674074  |  previous slow K 14 = 70.8625  |  slow K 14 = 85.1075  |  slow K 70 = 75.4386


20170707 11:42:00
Signal on stock JDST --- ADX = 19.291328339623647  |  previous slow K 14 = 70.8436  |  slow K 14 = 87.3623  |  slow K 70 = 73.7374


20170707 11:43:00
Signal on stock BABA --- ADX = 18.18719836275739  |  previous slow K 14 = 71.061  |  slow K 14 = 83.2168  |  slow K 70 = 66.6667


20170707 11:54:00
Signal on stock LABD --- ADX = 17.69026632922486  |  previous slow K 14 = 73.8095  |  slow K 14 = 83.3333  |  slow K 70 = 57.1429


20170707 12:01:00
Signal on stock ERX --- ADX = 17.612285809718866  |  previous slow K 14 = 58.3333  |  slow K 14 = 83.3333  |  slow K 70 = 67.6471


20170707 12:02:00
Signal on stock XOP --- ADX = 17.572743857781255  |  previous slow K 14 = 66.6667  |  slow K 14 = 88.8889  |  slow K 70 = 76.7677


20170707 12:02:00
Signal on stock GUSH --- ADX = 19.683678167519474  |  previous slow K 14 = 64.9573  |  slow K 14 = 82.1795  |  slow K 70 = 78.5311


20170707 12:05:00
Signal on stock DVN --- ADX = 19.7180161518332  |  previous slow K 14 = 77.0468  |  slow K 14 = 88.1579  |  slow K 70 = 84.8932


20170707 12:06:00
Signal on stock COG --- ADX = 15.408547309526513  |  previous slow K 14 = 73.3333  |  slow K 14 = 81.1111  |  slow K 70 = 70.3704


20170707 12:16:00
Signal on stock NFLX --- ADX = 14.940375551641086  |  previous slow K 14 = 75.9813  |  slow K 14 = 82.4181  |  slow K 70 = 66.0256


20170707 12:18:00
Signal on stock OXY --- ADX = 17.19629435459482  |  previous slow K 14 = 77.7778  |  slow K 14 = 86.3248  |  slow K 70 = 77.7774


20170707 12:28:00
Signal on stock LABD --- ADX = 15.470918647221069  |  previous slow K 14 = 72.2222  |  slow K 14 = 88.8889  |  slow K 70 = 53.3333


20170707 12:33:00
Signal on stock LABU --- ADX = 17.830909463310356  |  previous slow K 14 = 73.2523  |  slow K 14 = 80.9524  |  slow K 70 = 77.7843


20170707 12:39:00
Signal on stock BABA --- ADX = 19.929062020527933  |  previous slow K 14 = 75.2437  |  slow K 14 = 85.77  |  slow K 70 = 83.6735


20170707 12:39:00
Signal on stock UVXY --- ADX = 14.684736534874215  |  previous slow K 14 = 78.7879  |  slow K 14 = 88.6869  |  slow K 70 = 55.0


20170707 12:39:00
Signal on stock LABU --- ADX = 19.268599193426663  |  previous slow K 14 = 74.8299  |  slow K 14 = 83.7823  |  slow K 70 = 79.4872


20170707 12:42:00
Signal on stock NFLX --- ADX = 16.106338122766008  |  previous slow K 14 = 62.6107  |  slow K 14 = 85.4312  |  slow K 70 = 79.7348


20170707 12:43:00
Signal on stock MT --- ADX = 15.25849520504902  |  previous slow K 14 = 75.0  |  slow K 14 = 83.3333  |  slow K 70 = 73.3333


20170707 12:45:00
Signal on stock JNUG --- ADX = 18.519659480104618  |  previous slow K 14 = 79.6296  |  slow K 14 = 89.6296  |  slow K 70 = 71.2418


20170707 12:51:00
Signal on stock UCO --- ADX = 12.964809535244084  |  previous slow K 14 = 78.5714  |  slow K 14 = 95.2381  |  slow K 70 = 86.0215


20170707 12:51:00
Signal on stock UWT --- ADX = 15.27359316118117  |  previous slow K 14 = 67.4603  |  slow K 14 = 84.9206  |  slow K 70 = 84.5528


20170707 12:58:00
Signal on stock UCO --- ADX = 10.431569623881485  |  previous slow K 14 = 77.7778  |  slow K 14 = 88.8889  |  slow K 70 = 89.6313


20170707 12:59:00
Signal on stock TVIX --- ADX = 14.070503363574351  |  previous slow K 14 = 76.6667  |  slow K 14 = 80.7937  |  slow K 70 = 75.5695


20170707 13:00:00
Signal on stock MT --- ADX = 14.934691279790256  |  previous slow K 14 = 60.0  |  slow K 14 = 80.0  |  slow K 70 = 65.0


20170707 13:11:00
Signal on stock MT --- ADX = 19.46281766016739  |  previous slow K 14 = 73.3333  |  slow K 14 = 81.1111  |  slow K 70 = 56.2771


20170707 13:20:00
Signal on stock ABX --- ADX = 19.103382133001052  |  previous slow K 14 = 78.3333  |  slow K 14 = 85.0  |  slow K 70 = 55.5556


20170707 13:22:00
Signal on stock TZA --- ADX = 19.12851282921373  |  previous slow K 14 = 72.2222  |  slow K 14 = 83.3333  |  slow K 70 = 88.8889


20170707 13:31:00
Signal on stock JNUG --- ADX = 17.794590611551133  |  previous slow K 14 = 71.7949  |  slow K 14 = 82.3932  |  slow K 70 = 56.4103


20170707 13:41:00
Signal on stock MU --- ADX = 18.977798212713804  |  previous slow K 14 = 76.1905  |  slow K 14 = 90.4762  |  slow K 70 = 71.1111


20170707 13:45:00
Signal on stock LABD --- ADX = 15.593141490254494  |  previous slow K 14 = 77.7778  |  slow K 14 = 80.5556  |  slow K 70 = 92.963


20170707 13:57:00
Signal on stock OXY --- ADX = 13.259321863299592  |  previous slow K 14 = 65.7937  |  slow K 14 = 80.4762  |  slow K 70 = 70.1754


20170707 14:01:00
Signal on stock ERX --- ADX = 14.766057663782972  |  previous slow K 14 = 67.5926  |  slow K 14 = 92.5926  |  slow K 70 = 66.6667


20170707 14:01:00
Signal on stock XOP --- ADX = 16.648277490714182  |  previous slow K 14 = 72.4868  |  slow K 14 = 92.963  |  slow K 70 = 56.8627


20170707 14:01:00
Signal on stock MT --- ADX = 13.593500376631543  |  previous slow K 14 = 72.2222  |  slow K 14 = 83.3333  |  slow K 70 = 93.3333


20170707 14:03:00
Signal on stock COG --- ADX = 19.90867157409947  |  previous slow K 14 = 78.5714  |  slow K 14 = 82.1429  |  slow K 70 = 66.6667


20170707 14:05:00
Signal on stock JDST --- ADX = 17.05705373415147  |  previous slow K 14 = 65.5172  |  slow K 14 = 83.908  |  slow K 70 = 59.5679


20170707 14:07:00
Signal on stock MT --- ADX = 17.51963088260946  |  previous slow K 14 = 63.3333  |  slow K 14 = 80.0  |  slow K 70 = 90.9091


20170707 14:12:00
Signal on stock WMB --- ADX = 12.362272562658088  |  previous slow K 14 = 77.7778  |  slow K 14 = 88.8889  |  slow K 70 = 94.4444


20170707 14:13:00
Signal on stock UCO --- ADX = 14.616490832107868  |  previous slow K 14 = 78.5714  |  slow K 14 = 84.127  |  slow K 70 = 93.4921


null
Signal on stock AMD --- ADX = 19.73767539621397  |  previous slow K 14 = 76.0943  |  slow K 14 = 81.4815  |  slow K 70 = 58.5859


null
Signal on stock AMD --- ADX = 13.139716605193899  |  previous slow K 14 = 68.8889  |  slow K 14 = 80.0  |  slow K 70 = 65.3968


null
Signal on stock AMD --- ADX = 15.088262822162047  |  previous slow K 14 = 73.6364  |  slow K 14 = 86.9697  |  slow K 70 = 52.8736


null
Signal on stock AMD --- ADX = 16.182987580196226  |  previous slow K 14 = 71.6667  |  slow K 14 = 80.8333  |  slow K 70 = 61.4035


null
Signal on stock AMD --- ADX = 19.035875260253725  |  previous slow K 14 = 73.3333  |  slow K 14 = 86.6667  |  slow K 70 = 94.8718


null
Signal on stock AMD --- ADX = 19.75943115188172  |  previous slow K 14 = 76.6667  |  slow K 14 = 85.0  |  slow K 70 = 95.2381


null
Signal on stock AMD --- ADX = 18.986000545616978  |  previous slow K 14 = 66.6667  |  slow K 14 = 88.8889  |  slow K 70 = 69.697


null
Signal on stock AMD --- ADX = 17.098908654119782  |  previous slow K 14 = 77.7778  |  slow K 14 = 88.8889  |  slow K 70 = 69.697


null
Signal on stock AMD --- ADX = 18.981409981676325  |  previous slow K 14 = 76.6667  |  slow K 14 = 80.0  |  slow K 70 = 76.6667


null
Signal on stock AMD --- ADX = 14.906212475024953  |  previous slow K 14 = 77.7778  |  slow K 14 = 87.7778  |  slow K 70 = 93.3333


null
Signal on stock AMD --- ADX = 13.336626582417674  |  previous slow K 14 = 66.6667  |  slow K 14 = 86.6667  |  slow K 70 = 93.3333


null
Signal on stock AMD --- ADX = 19.515131715357313  |  previous slow K 14 = 76.6667  |  slow K 14 = 93.3333  |  slow K 70 = 90.4762


null
Signal on stock AMD --- ADX = 13.801729800036389  |  previous slow K 14 = 76.4103  |  slow K 14 = 84.1026  |  slow K 70 = 80.226


null
Signal on stock AMD --- ADX = 19.043550845660427  |  previous slow K 14 = 75.7143  |  slow K 14 = 90.0  |  slow K 70 = 65.625


null
Signal on stock AMD --- ADX = 14.212729325162316  |  previous slow K 14 = 78.5714  |  slow K 14 = 90.4762  |  slow K 70 = 77.0833


null
Signal on stock AMD --- ADX = 10.190013328037747  |  previous slow K 14 = 78.5714  |  slow K 14 = 90.4762  |  slow K 70 = 55.0


null
Signal on stock AMD --- ADX = 15.901952925577689  |  previous slow K 14 = 66.6667  |  slow K 14 = 81.1111  |  slow K 70 = 90.5483


null
Signal on stock AMD --- ADX = 13.443642487966585  |  previous slow K 14 = 77.7778  |  slow K 14 = 94.4444  |  slow K 70 = 55.5556


null
Signal on stock AMD --- ADX = 16.715362056577668  |  previous slow K 14 = 75.1852  |  slow K 14 = 81.8519  |  slow K 70 = 71.4286


null
Signal on stock AMD --- ADX = 15.030956647992477  |  previous slow K 14 = 60.0  |  slow K 14 = 83.3333  |  slow K 70 = 83.3333


null
Signal on stock AMD --- ADX = 19.224364684042108  |  previous slow K 14 = 75.1852  |  slow K 14 = 81.4815  |  slow K 70 = 93.0556


null
Signal on stock AMD --- ADX = 16.464941937121853  |  previous slow K 14 = 58.3333  |  slow K 14 = 83.3333  |  slow K 70 = 87.5


null
Signal on stock AMD --- ADX = 12.358881541300903  |  previous slow K 14 = 75.5556  |  slow K 14 = 86.6667  |  slow K 70 = 57.5758


null
Signal on stock AMD --- ADX = 14.153890530986347  |  previous slow K 14 = 72.2222  |  slow K 14 = 80.5556  |  slow K 70 = 77.9762


null
Signal on stock AMD --- ADX = 15.594021095744093  |  previous slow K 14 = 77.3077  |  slow K 14 = 85.0  |  slow K 70 = 77.7778


null
Signal on stock AMD --- ADX = 13.822643719471415  |  previous slow K 14 = 66.6667  |  slow K 14 = 83.3333  |  slow K 70 = 53.7037


null
Signal on stock AMD --- ADX = 17.895820514735416  |  previous slow K 14 = 66.6667  |  slow K 14 = 81.5476  |  slow K 70 = 52.0697


null
Signal on stock AMD --- ADX = 10.049030821239386  |  previous slow K 14 = 75.0  |  slow K 14 = 91.6667  |  slow K 70 = 61.1111


null
Signal on stock AMD --- ADX = 10.751711055372088  |  previous slow K 14 = 66.1538  |  slow K 14 = 80.0  |  slow K 70 = 74.645


null
Signal on stock AMD --- ADX = 17.991082853889196  |  previous slow K 14 = 73.3333  |  slow K 14 = 86.6667  |  slow K 70 = 97.619


null
Signal on stock AMD --- ADX = 15.34459584560251  |  previous slow K 14 = 73.0159  |  slow K 14 = 84.9206  |  slow K 70 = 68.6275


null
Signal on stock AMD --- ADX = 14.384867903832943  |  previous slow K 14 = 73.2143  |  slow K 14 = 80.9524  |  slow K 70 = 51.2821


null
Signal on stock AMD --- ADX = 12.05812737301804  |  previous slow K 14 = 73.3333  |  slow K 14 = 80.0  |  slow K 70 = 56.8376


null
Signal on stock AMD --- ADX = 12.740652170684553  |  previous slow K 14 = 77.7778  |  slow K 14 = 88.8889  |  slow K 70 = 90.0


null
Signal on stock AMD --- ADX = 15.161217488263333  |  previous slow K 14 = 75.0  |  slow K 14 = 91.6667  |  slow K 70 = 56.4103


null
Signal on stock AMD --- ADX = 12.776010893935746  |  previous slow K 14 = 53.3333  |  slow K 14 = 80.0  |  slow K 70 = 61.5385


null
Signal on stock AMD --- ADX = 18.197572387235894  |  previous slow K 14 = 70.6349  |  slow K 14 = 80.1587  |  slow K 70 = 91.6667


null
Signal on stock AMD --- ADX = 15.597031086116534  |  previous slow K 14 = 66.6667  |  slow K 14 = 81.4815  |  slow K 70 = 92.7536


null
Signal on stock AMD --- ADX = 16.380905261148232  |  previous slow K 14 = 71.6667  |  slow K 14 = 80.463  |  slow K 70 = 63.7678


null
Signal on stock AMD --- ADX = 18.28239313023366  |  previous slow K 14 = 75.0  |  slow K 14 = 83.3333  |  slow K 70 = 53.3333


null
Signal on stock AMD --- ADX = 17.965150488354777  |  previous slow K 14 = 66.6667  |  slow K 14 = 91.6667  |  slow K 70 = 80.9524


null
Signal on stock AMD --- ADX = 14.11199445061723  |  previous slow K 14 = 75.0  |  slow K 14 = 83.3333  |  slow K 70 = 76.1905


null
Signal on stock AMD --- ADX = 18.337306186749384  |  previous slow K 14 = 77.7778  |  slow K 14 = 88.8889  |  slow K 70 = 59.2593


null
Signal on stock AMD --- ADX = 16.624070402866725  |  previous slow K 14 = 77.7778  |  slow K 14 = 88.8889  |  slow K 70 = 92.5926


null
Signal on stock AMD --- ADX = 9.90299560469857  |  previous slow K 14 = 77.7778  |  slow K 14 = 83.3333  |  slow K 70 = 66.6667


null
Signal on stock AMD --- ADX = 12.235944777236211  |  previous slow K 14 = 68.9744  |  slow K 14 = 80.5128  |  slow K 70 = 62.5


null
Signal on stock AMD --- ADX = 10.484900857192928  |  previous slow K 14 = 76.9231  |  slow K 14 = 81.5851  |  slow K 70 = 61.4583


null
Signal on stock JNUG --- ADX = 18.702605054078788  |  previous slow K 14 = 68.2984  |  slow K 14 = 91.1616  |  slow K 70 = 79.652


null
Signal on stock JNUG --- ADX = 10.450114218821046  |  previous slow K 14 = 76.3711  |  slow K 14 = 87.0192  |  slow K 70 = 58.9286


null
Signal on stock JNUG --- ADX = 19.52745981385554  |  previous slow K 14 = 76.7593  |  slow K 14 = 88.4259  |  slow K 70 = 66.6667


null
Signal on stock JNUG --- ADX = 19.95658601038181  |  previous slow K 14 = 78.3094  |  slow K 14 = 87.0415  |  slow K 70 = 79.7101


null
Signal on stock JNUG --- ADX = 19.535324819879687  |  previous slow K 14 = 74.4281  |  slow K 14 = 89.7059  |  slow K 70 = 93.8301


null
Signal on stock JNUG --- ADX = 17.700612285460156  |  previous slow K 14 = 77.619  |  slow K 14 = 86.0317  |  slow K 70 = 90.8046


null
Signal on stock JNUG --- ADX = 18.188897064005438  |  previous slow K 14 = 65.1515  |  slow K 14 = 84.6093  |  slow K 70 = 82.8571


null
Signal on stock JNUG --- ADX = 12.446700327763969  |  previous slow K 14 = 77.4411  |  slow K 14 = 87.6015  |  slow K 70 = 86.7181


null
Signal on stock JNUG --- ADX = 18.91656636101723  |  previous slow K 14 = 62.5  |  slow K 14 = 80.9524  |  slow K 70 = 51.1905


null
Signal on stock JNUG --- ADX = 15.483306124180706  |  previous slow K 14 = 73.6842  |  slow K 14 = 80.5068  |  slow K 70 = 55.9415


null
Signal on stock JNUG --- ADX = 15.46185801848601  |  previous slow K 14 = 77.6068  |  slow K 14 = 82.2222  |  slow K 70 = 57.478


null
Signal on stock JNUG --- ADX = 19.593392577703078  |  previous slow K 14 = 75.8929  |  slow K 14 = 86.5546  |  slow K 70 = 84.9802


null
Signal on stock JNUG --- ADX = 14.695454172952648  |  previous slow K 14 = 77.1429  |  slow K 14 = 87.9121  |  slow K 70 = 52.8736


null
Signal on stock JNUG --- ADX = 15.399986650721107  |  previous slow K 14 = 67.0635  |  slow K 14 = 86.1111  |  slow K 70 = 56.4103


null
Signal on stock JNUG --- ADX = 17.022331205667165  |  previous slow K 14 = 75.3968  |  slow K 14 = 84.2857  |  slow K 70 = 67.9487


null
Signal on stock JNUG --- ADX = 19.876494362006046  |  previous slow K 14 = 77.2727  |  slow K 14 = 84.5455  |  slow K 70 = 73.5849


null
Signal on stock JNUG --- ADX = 15.992428177710892  |  previous slow K 14 = 74.359  |  slow K 14 = 82.3932  |  slow K 70 = 56.4103


null
Signal on stock JNUG --- ADX = 12.32462049761969  |  previous slow K 14 = 71.5152  |  slow K 14 = 81.8182  |  slow K 70 = 92.3077


null
Signal on stock JNUG --- ADX = 14.792399043299648  |  previous slow K 14 = 67.3611  |  slow K 14 = 80.0748  |  slow K 70 = 74.3056


null
Signal on stock JNUG --- ADX = 14.513751662184193  |  previous slow K 14 = 79.4872  |  slow K 14 = 94.8718  |  slow K 70 = 61.4035


null
Signal on stock JNUG --- ADX = 18.001242946986746  |  previous slow K 14 = 67.8788  |  slow K 14 = 80.0  |  slow K 70 = 83.1978


null
Signal on stock JNUG --- ADX = 16.52734250747424  |  previous slow K 14 = 76.8087  |  slow K 14 = 88.5547  |  slow K 70 = 93.2179


null
Signal on stock JNUG --- ADX = 10.034349404685532  |  previous slow K 14 = 56.746  |  slow K 14 = 80.5556  |  slow K 70 = 55.5556


null
Signal on stock JNUG --- ADX = 17.188644785173175  |  previous slow K 14 = 76.5152  |  slow K 14 = 84.8485  |  slow K 70 = 84.8485


null
Signal on stock MU --- ADX = 19.50657159683242  |  previous slow K 14 = 77.7778  |  slow K 14 = 82.2222  |  slow K 70 = 58.7302


null
Signal on stock MU --- ADX = 15.930051979883336  |  previous slow K 14 = 66.6667  |  slow K 14 = 81.5476  |  slow K 70 = 53.9683


null
Signal on stock MU --- ADX = 14.818565467925433  |  previous slow K 14 = 75.8333  |  slow K 14 = 85.303  |  slow K 70 = 77.0343


null
Signal on stock MU --- ADX = 12.70333643273446  |  previous slow K 14 = 71.4286  |  slow K 14 = 88.254  |  slow K 70 = 78.9216


null
Signal on stock MU --- ADX = 15.908734657389301  |  previous slow K 14 = 73.8095  |  slow K 14 = 88.3929  |  slow K 70 = 84.3137


null
Signal on stock MU --- ADX = 17.58944458877852  |  previous slow K 14 = 60.0  |  slow K 14 = 83.9394  |  slow K 70 = 86.2745


null
Signal on stock MU --- ADX = 19.978892374462664  |  previous slow K 14 = 75.7576  |  slow K 14 = 84.8485  |  slow K 70 = 89.2157


null
Signal on stock MU --- ADX = 18.662781001885374  |  previous slow K 14 = 66.7096  |  slow K 14 = 87.6218  |  slow K 70 = 63.0631


null
Signal on stock MU --- ADX = 14.851933930475369  |  previous slow K 14 = 68.6813  |  slow K 14 = 93.0199  |  slow K 70 = 88.2353


null
Signal on stock MU --- ADX = 14.727012838507994  |  previous slow K 14 = 70.4147  |  slow K 14 = 80.1435  |  slow K 70 = 88.9474


null
Signal on stock MU --- ADX = 18.716437962489984  |  previous slow K 14 = 78.836  |  slow K 14 = 87.037  |  slow K 70 = 74.5558


null
Signal on stock MU --- ADX = 19.235302289532715  |  previous slow K 14 = 71.3528  |  slow K 14 = 87.1795  |  slow K 70 = 74.6237


null
Signal on stock MU --- ADX = 12.268019841291851  |  previous slow K 14 = 79.0936  |  slow K 14 = 91.3952  |  slow K 70 = 70.9496


null
Signal on stock MU --- ADX = 16.930068445942805  |  previous slow K 14 = 78.5714  |  slow K 14 = 88.0952  |  slow K 70 = 71.0145


null
Signal on stock MU --- ADX = 16.38606584304616  |  previous slow K 14 = 73.3333  |  slow K 14 = 83.3333  |  slow K 70 = 80.0


null
Signal on stock MU --- ADX = 17.011656841977914  |  previous slow K 14 = 73.3333  |  slow K 14 = 80.0  |  slow K 70 = 53.8208


null
Signal on stock MU --- ADX = 15.14555674067429  |  previous slow K 14 = 75.9259  |  slow K 14 = 88.8889  |  slow K 70 = 59.0909


null
Signal on stock MU --- ADX = 16.082603149351566  |  previous slow K 14 = 66.6667  |  slow K 14 = 80.9524  |  slow K 70 = 74.8148


null
Signal on stock MU --- ADX = 14.94556686691604  |  previous slow K 14 = 71.4286  |  slow K 14 = 86.3095  |  slow K 70 = 84.4444


null
Signal on stock MU --- ADX = 16.014412859298925  |  previous slow K 14 = 77.7778  |  slow K 14 = 83.3333  |  slow K 70 = 93.3333


null
Signal on stock MU --- ADX = 17.16411531927258  |  previous slow K 14 = 75.8333  |  slow K 14 = 92.5  |  slow K 70 = 55.5556


null
Signal on stock MU --- ADX = 17.386669913147234  |  previous slow K 14 = 77.7778  |  slow K 14 = 83.8384  |  slow K 70 = 57.5269


null
Signal on stock MU --- ADX = 15.969976281039362  |  previous slow K 14 = 68.1624  |  slow K 14 = 83.7302  |  slow K 70 = 51.4446


null
Signal on stock MU --- ADX = 11.768670160918774  |  previous slow K 14 = 60.6061  |  slow K 14 = 82.0707  |  slow K 70 = 55.5556


null
Signal on stock MU --- ADX = 11.969823925411049  |  previous slow K 14 = 76.7532  |  slow K 14 = 89.8214  |  slow K 70 = 92.4348


null
Signal on stock MU --- ADX = 15.293073483981445  |  previous slow K 14 = 74.1667  |  slow K 14 = 83.3333  |  slow K 70 = 57.4487


null
Signal on stock MU --- ADX = 17.928718012180525  |  previous slow K 14 = 73.6111  |  slow K 14 = 83.3333  |  slow K 70 = 56.25


null
Signal on stock MU --- ADX = 15.33321171063242  |  previous slow K 14 = 75.7576  |  slow K 14 = 81.8182  |  slow K 70 = 64.2857


null
Signal on stock MU --- ADX = 16.1212104795235  |  previous slow K 14 = 78.7879  |  slow K 14 = 87.8788  |  slow K 70 = 69.0476


null
Signal on stock MU --- ADX = 16.266095744854745  |  previous slow K 14 = 75.0  |  slow K 14 = 81.25  |  slow K 70 = 81.5789


null
Signal on stock MU --- ADX = 17.78038608125603  |  previous slow K 14 = 77.2331  |  slow K 14 = 90.1961  |  slow K 70 = 72.7273


null
Signal on stock MU --- ADX = 13.555416190871549  |  previous slow K 14 = 70.8333  |  slow K 14 = 83.3333  |  slow K 70 = 71.7172


null
Signal on stock MU --- ADX = 16.570122087285487  |  previous slow K 14 = 76.7677  |  slow K 14 = 87.8788  |  slow K 70 = 85.1852


null
Signal on stock MU --- ADX = 15.322916673926423  |  previous slow K 14 = 77.1429  |  slow K 14 = 85.7143  |  slow K 70 = 96.2963


null
Signal on stock MU --- ADX = 17.981913479956273  |  previous slow K 14 = 77.7778  |  slow K 14 = 100.0  |  slow K 70 = 53.3333


null
Signal on stock MU --- ADX = 15.057413469743702  |  previous slow K 14 = 66.6667  |  slow K 14 = 80.9524  |  slow K 70 = 64.4444


null
Signal on stock MU --- ADX = 18.74793827963071  |  previous slow K 14 = 71.8908  |  slow K 14 = 83.7037  |  slow K 70 = 78.6667


null
Signal on stock MU --- ADX = 19.366785598992323  |  previous slow K 14 = 66.6667  |  slow K 14 = 83.3333  |  slow K 70 = 88.4058


null
Signal on stock MU --- ADX = 14.337103768867118  |  previous slow K 14 = 73.3333  |  slow K 14 = 80.0  |  slow K 70 = 61.9048


null
Signal on stock MU --- ADX = 14.75753355975767  |  previous slow K 14 = 66.6667  |  slow K 14 = 86.6667  |  slow K 70 = 66.6667


null
Signal on stock MU --- ADX = 14.007140804039638  |  previous slow K 14 = 66.6667  |  slow K 14 = 83.3333  |  slow K 70 = 85.1852


null
Signal on stock MU --- ADX = 9.727450851872542  |  previous slow K 14 = 55.5556  |  slow K 14 = 88.8889  |  slow K 70 = 62.963


null
Signal on stock MU --- ADX = 16.03242322708777  |  previous slow K 14 = 76.1905  |  slow K 14 = 85.7143  |  slow K 70 = 79.3103


null
Signal on stock MU --- ADX = 14.934518822386973  |  previous slow K 14 = 76.4103  |  slow K 14 = 87.1795  |  slow K 70 = 88.5859


null
Signal on stock MU --- ADX = 13.578201529458152  |  previous slow K 14 = 78.1746  |  slow K 14 = 94.8413  |  slow K 70 = 63.8889


null
Signal on stock MU --- ADX = 11.780814802464912  |  previous slow K 14 = 76.6667  |  slow K 14 = 86.6667  |  slow K 70 = 66.6667


null
Signal on stock MU --- ADX = 14.560392446851083  |  previous slow K 14 = 65.0794  |  slow K 14 = 88.8889  |  slow K 70 = 87.1795


null
Signal on stock MU --- ADX = 16.615035324645646  |  previous slow K 14 = 79.4872  |  slow K 14 = 87.1795  |  slow K 70 = 90.6318


null
Signal on stock MU --- ADX = 16.27051591519948  |  previous slow K 14 = 77.7778  |  slow K 14 = 84.7222  |  slow K 70 = 51.5152


null
Signal on stock MU --- ADX = 18.966455103838207  |  previous slow K 14 = 67.7381  |  slow K 14 = 88.5714  |  slow K 70 = 93.9394


null
Signal on stock MU --- ADX = 16.417561762435444  |  previous slow K 14 = 46.6667  |  slow K 14 = 80.0  |  slow K 70 = 90.9091


null
Signal on stock BABA --- ADX = 13.213152092806878  |  previous slow K 14 = 75.9259  |  slow K 14 = 87.037  |  slow K 70 = 64.0523


null
Signal on stock BABA --- ADX = 18.566318422777467  |  previous slow K 14 = 79.4118  |  slow K 14 = 84.5201  |  slow K 70 = 87.303


null
Signal on stock BABA --- ADX = 19.70089444313777  |  previous slow K 14 = 59.8039  |  slow K 14 = 86.3305  |  slow K 70 = 93.928


null
Signal on stock BABA --- ADX = 12.973680935685437  |  previous slow K 14 = 76.6541  |  slow K 14 = 82.6759  |  slow K 70 = 52.6882


null
Signal on stock BABA --- ADX = 10.915710716313953  |  previous slow K 14 = 76.6667  |  slow K 14 = 92.7343  |  slow K 70 = 77.7403


null
Signal on stock BABA --- ADX = 17.73212543526576  |  previous slow K 14 = 62.92  |  slow K 14 = 82.2555  |  slow K 70 = 79.4038


null
Signal on stock BABA --- ADX = 18.2107655499989  |  previous slow K 14 = 78.0134  |  slow K 14 = 83.1831  |  slow K 70 = 89.5506


null
Signal on stock BABA --- ADX = 16.47160867799506  |  previous slow K 14 = 65.7029  |  slow K 14 = 81.982  |  slow K 70 = 55.6667


null
Signal on stock BABA --- ADX = 13.07805935851007  |  previous slow K 14 = 73.2184  |  slow K 14 = 80.8046  |  slow K 70 = 74.359


null
Signal on stock BABA --- ADX = 12.998876972673662  |  previous slow K 14 = 73.597  |  slow K 14 = 86.9168  |  slow K 70 = 79.1209


null
Signal on stock BABA --- ADX = 13.090036821052674  |  previous slow K 14 = 66.9386  |  slow K 14 = 84.8873  |  slow K 70 = 93.8465


null
Signal on stock BABA --- ADX = 12.83541087740379  |  previous slow K 14 = 71.0145  |  slow K 14 = 81.1594  |  slow K 70 = 75.435


null
Signal on stock BABA --- ADX = 9.992004890904582  |  previous slow K 14 = 69.8413  |  slow K 14 = 87.8968  |  slow K 70 = 51.3449


null
Signal on stock BABA --- ADX = 12.893446661960558  |  previous slow K 14 = 79.6296  |  slow K 14 = 87.037  |  slow K 70 = 75.5556


null
Signal on stock BABA --- ADX = 16.145056824853803  |  previous slow K 14 = 76.0707  |  slow K 14 = 82.2216  |  slow K 70 = 84.9257


null
Signal on stock BABA --- ADX = 17.212170240736953  |  previous slow K 14 = 75.4675  |  slow K 14 = 85.6699  |  slow K 70 = 61.039


null
Signal on stock BABA --- ADX = 17.039088690993193  |  previous slow K 14 = 74.8909  |  slow K 14 = 81.821  |  slow K 70 = 67.42


null
Signal on stock BABA --- ADX = 14.43886858420758  |  previous slow K 14 = 78.229  |  slow K 14 = 89.1553  |  slow K 70 = 78.5311


null
Signal on stock BABA --- ADX = 15.294759182998936  |  previous slow K 14 = 74.3779  |  slow K 14 = 83.5752  |  slow K 70 = 84.264


null
Signal on stock BABA --- ADX = 16.07466012971124  |  previous slow K 14 = 70.9084  |  slow K 14 = 80.5585  |  slow K 70 = 88.8235


null
Signal on stock BABA --- ADX = 13.647967635705305  |  previous slow K 14 = 72.6504  |  slow K 14 = 85.0575  |  slow K 70 = 85.8025


null
Signal on stock BABA --- ADX = 14.573280246117813  |  previous slow K 14 = 74.6715  |  slow K 14 = 83.8345  |  slow K 70 = 71.2821


null
Signal on stock BABA --- ADX = 18.424450414799132  |  previous slow K 14 = 74.4186  |  slow K 14 = 85.2713  |  slow K 70 = 91.5556


null
Signal on stock BABA --- ADX = 13.533114964455367  |  previous slow K 14 = 73.9309  |  slow K 14 = 89.8039  |  slow K 70 = 72.6496


null
Signal on stock BABA --- ADX = 17.583841392022823  |  previous slow K 14 = 60.8606  |  slow K 14 = 81.4427  |  slow K 70 = 64.1534


null
Signal on stock BABA --- ADX = 19.422854186191522  |  previous slow K 14 = 78.2684  |  slow K 14 = 91.9048  |  slow K 70 = 72.6496


null
Signal on stock BABA --- ADX = 17.491335006174722  |  previous slow K 14 = 74.1073  |  slow K 14 = 85.1034  |  slow K 70 = 70.6215


null
Signal on stock BABA --- ADX = 19.001266818116573  |  previous slow K 14 = 66.746  |  slow K 14 = 80.5141  |  slow K 70 = 75.4004


null
Signal on stock BABA --- ADX = 14.117592885082276  |  previous slow K 14 = 77.1094  |  slow K 14 = 81.0967  |  slow K 70 = 67.5926


null
Signal on stock BABA --- ADX = 13.40393730625418  |  previous slow K 14 = 60.1323  |  slow K 14 = 82.4518  |  slow K 70 = 56.6667


null
Signal on stock BABA --- ADX = 16.666183244224168  |  previous slow K 14 = 74.9413  |  slow K 14 = 86.4172  |  slow K 70 = 75.1111


null
Signal on stock BABA --- ADX = 16.645265081218533  |  previous slow K 14 = 76.2821  |  slow K 14 = 82.1715  |  slow K 70 = 85.7501


null
Signal on stock BABA --- ADX = 15.782488397359755  |  previous slow K 14 = 70.8081  |  slow K 14 = 82.785  |  slow K 70 = 91.7695


null
Signal on stock BABA --- ADX = 17.509522103634804  |  previous slow K 14 = 77.7778  |  slow K 14 = 81.1966  |  slow K 70 = 66.9088


null
Signal on stock BABA --- ADX = 18.140523389123288  |  previous slow K 14 = 79.6703  |  slow K 14 = 87.3626  |  slow K 70 = 64.2681


null
Signal on stock BABA --- ADX = 17.852271694135503  |  previous slow K 14 = 77.6688  |  slow K 14 = 84.3818  |  slow K 70 = 89.2157


null
Signal on stock BABA --- ADX = 13.468889596046035  |  previous slow K 14 = 77.2222  |  slow K 14 = 83.8889  |  slow K 70 = 94.0236


null
Signal on stock BABA --- ADX = 19.080588127887175  |  previous slow K 14 = 67.8016  |  slow K 14 = 80.303  |  slow K 70 = 62.7363


null
Signal on stock BABA --- ADX = 17.980172932523274  |  previous slow K 14 = 79.6402  |  slow K 14 = 85.5745  |  slow K 70 = 57.7587


null
Signal on stock BABA --- ADX = 15.320645332266002  |  previous slow K 14 = 78.4786  |  slow K 14 = 85.4231  |  slow K 70 = 59.8039


null
Signal on stock BABA --- ADX = 19.91001962203556  |  previous slow K 14 = 78.0749  |  slow K 14 = 89.4553  |  slow K 70 = 75.0


null
Signal on stock BABA --- ADX = 16.848344486122304  |  previous slow K 14 = 75.4762  |  slow K 14 = 82.1501  |  slow K 70 = 69.8582


null
Signal on stock BABA --- ADX = 10.258264480880728  |  previous slow K 14 = 73.0  |  slow K 14 = 81.3333  |  slow K 70 = 70.5628


null
Signal on stock BABA --- ADX = 18.143893133048927  |  previous slow K 14 = 64.3604  |  slow K 14 = 81.4042  |  slow K 70 = 92.3423


null
Signal on stock BABA --- ADX = 15.401604028136816  |  previous slow K 14 = 63.6218  |  slow K 14 = 83.9744  |  slow K 70 = 93.9663


null
Signal on stock FCX --- ADX = 16.057838157039512  |  previous slow K 14 = 73.3333  |  slow K 14 = 80.0  |  slow K 70 = 95.8333


null
Signal on stock FCX --- ADX = 19.890282696492346  |  previous slow K 14 = 77.7778  |  slow K 14 = 100.0  |  slow K 70 = 91.6667


null
Signal on stock FCX --- ADX = 17.180310245913212  |  previous slow K 14 = 77.7778  |  slow K 14 = 100.0  |  slow K 70 = 91.6667


null
Signal on stock FCX --- ADX = 17.37161531078916  |  previous slow K 14 = 66.6667  |  slow K 14 = 88.8889  |  slow K 70 = 51.8519


null
Signal on stock FCX --- ADX = 15.22481520356622  |  previous slow K 14 = 78.3452  |  slow K 14 = 85.348  |  slow K 70 = 61.4035


null
Signal on stock FCX --- ADX = 16.94216896354336  |  previous slow K 14 = 75.0  |  slow K 14 = 83.3333  |  slow K 70 = 66.6667


null
Signal on stock FCX --- ADX = 16.58248690495831  |  previous slow K 14 = 77.7778  |  slow K 14 = 88.8889  |  slow K 70 = 61.1111


null
Signal on stock FCX --- ADX = 15.292475087669857  |  previous slow K 14 = 76.1905  |  slow K 14 = 80.9524  |  slow K 70 = 71.7949


null
Signal on stock FCX --- ADX = 12.869119314055785  |  previous slow K 14 = 66.6667  |  slow K 14 = 83.3333  |  slow K 70 = 74.359


null
Signal on stock FCX --- ADX = 16.457278035187915  |  previous slow K 14 = 69.4444  |  slow K 14 = 81.9444  |  slow K 70 = 76.1905


null
Signal on stock FCX --- ADX = 9.953516699989127  |  previous slow K 14 = 66.6667  |  slow K 14 = 80.0  |  slow K 70 = 66.6667


null
Signal on stock FCX --- ADX = 18.58594113255182  |  previous slow K 14 = 67.6587  |  slow K 14 = 80.1587  |  slow K 70 = 53.6232


null
Signal on stock FCX --- ADX = 19.611791791946356  |  previous slow K 14 = 70.0  |  slow K 14 = 80.0  |  slow K 70 = 90.0


null
Signal on stock FCX --- ADX = 17.267072162598602  |  previous slow K 14 = 73.3333  |  slow K 14 = 86.6667  |  slow K 70 = 77.7778


null
Signal on stock FCX --- ADX = 13.91689011826036  |  previous slow K 14 = 66.6667  |  slow K 14 = 83.3333  |  slow K 70 = 75.5556


null
Signal on stock FCX --- ADX = 14.586846401517928  |  previous slow K 14 = 75.0  |  slow K 14 = 83.3333  |  slow K 70 = 88.8889


null
Signal on stock FCX --- ADX = 19.00048493529414  |  previous slow K 14 = 77.7778  |  slow K 14 = 88.8889  |  slow K 70 = 62.963


null
Signal on stock FCX --- ADX = 12.275313126473915  |  previous slow K 14 = 66.6667  |  slow K 14 = 83.3333  |  slow K 70 = 66.6667


null
Signal on stock FCX --- ADX = 17.969423522793196  |  previous slow K 14 = 61.1111  |  slow K 14 = 83.3333  |  slow K 70 = 96.047


null
Signal on stock FCX --- ADX = 13.754781600936951  |  previous slow K 14 = 72.2222  |  slow K 14 = 83.3333  |  slow K 70 = 94.7368


null
Signal on stock FCX --- ADX = 14.318576709416261  |  previous slow K 14 = 78.5714  |  slow K 14 = 80.1587  |  slow K 70 = 56.4103


null
Signal on stock FCX --- ADX = 17.18516444521412  |  previous slow K 14 = 66.6667  |  slow K 14 = 83.3333  |  slow K 70 = 72.7273


null
Signal on stock FCX --- ADX = 18.423619176507327  |  previous slow K 14 = 77.7778  |  slow K 14 = 88.8889  |  slow K 70 = 75.7576


null
Signal on stock FCX --- ADX = 11.005143163093424  |  previous slow K 14 = 79.3651  |  slow K 14 = 88.8889  |  slow K 70 = 83.3333


null
Signal on stock FCX --- ADX = 8.510304342717482  |  previous slow K 14 = 76.1905  |  slow K 14 = 85.7143  |  slow K 70 = 90.0


null
Signal on stock FCX --- ADX = 13.08006838402733  |  previous slow K 14 = 79.0476  |  slow K 14 = 80.9524  |  slow K 70 = 89.7436


null
Signal on stock FCX --- ADX = 17.974121549862154  |  previous slow K 14 = 66.6667  |  slow K 14 = 86.6667  |  slow K 70 = 95.5556


null
Signal on stock FCX --- ADX = 15.091427356914926  |  previous slow K 14 = 66.6667  |  slow K 14 = 81.4815  |  slow K 70 = 73.5043


null
Signal on stock FCX --- ADX = 12.79820174330834  |  previous slow K 14 = 66.6667  |  slow K 14 = 81.0185  |  slow K 70 = 84.9462


null
Signal on stock FCX --- ADX = 11.22545508487859  |  previous slow K 14 = 66.6667  |  slow K 14 = 83.3333  |  slow K 70 = 79.2967


null
Signal on stock FCX --- ADX = 16.299949267896995  |  previous slow K 14 = 79.1667  |  slow K 14 = 81.4394  |  slow K 70 = 52.381


null
Signal on stock FCX --- ADX = 18.088748673626704  |  previous slow K 14 = 75.0  |  slow K 14 = 91.6667  |  slow K 70 = 82.0513


null
Signal on stock FCX --- ADX = 19.11036389143523  |  previous slow K 14 = 75.0  |  slow K 14 = 93.3333  |  slow K 70 = 52.0833


null
Signal on stock FCX --- ADX = 17.333929393442887  |  previous slow K 14 = 66.6667  |  slow K 14 = 80.0  |  slow K 70 = 66.6667


null
Signal on stock FCX --- ADX = 15.75833343876448  |  previous slow K 14 = 75.0  |  slow K 14 = 83.3333  |  slow K 70 = 92.963


null
Signal on stock FCX --- ADX = 12.691882536832315  |  previous slow K 14 = 75.0  |  slow K 14 = 83.3333  |  slow K 70 = 90.4762


null
Signal on stock FCX --- ADX = 12.637594060912907  |  previous slow K 14 = 78.3333  |  slow K 14 = 91.6667  |  slow K 70 = 95.2381


null
Signal on stock VXX --- ADX = 16.5914649551048  |  previous slow K 14 = 77.7778  |  slow K 14 = 88.8889  |  slow K 70 = 56.6667


null
Signal on stock VXX --- ADX = 17.221666262880046  |  previous slow K 14 = 70.6818  |  slow K 14 = 82.5  |  slow K 70 = 78.141


null
Signal on stock VXX --- ADX = 18.80038569556021  |  previous slow K 14 = 74.5833  |  slow K 14 = 80.8333  |  slow K 70 = 91.1977


null
Signal on stock VXX --- ADX = 18.03060036364062  |  previous slow K 14 = 77.7001  |  slow K 14 = 82.0063  |  slow K 70 = 51.7413


null
Signal on stock VXX --- ADX = 14.48328722746738  |  previous slow K 14 = 71.4286  |  slow K 14 = 80.9524  |  slow K 70 = 61.9048


null
Signal on stock VXX --- ADX = 11.413682760908316  |  previous slow K 14 = 73.3333  |  slow K 14 = 86.6667  |  slow K 70 = 69.4444


null
Signal on stock VXX --- ADX = 9.296549661808328  |  previous slow K 14 = 77.7778  |  slow K 14 = 88.8889  |  slow K 70 = 72.2222


null
Signal on stock VXX --- ADX = 7.364706693925562  |  previous slow K 14 = 77.7778  |  slow K 14 = 88.8889  |  slow K 70 = 72.2222


null
Signal on stock VXX --- ADX = 11.242813662801579  |  previous slow K 14 = 66.6667  |  slow K 14 = 83.3333  |  slow K 70 = 72.2222


null
Signal on stock VXX --- ADX = 8.966195165706399  |  previous slow K 14 = 63.3333  |  slow K 14 = 83.3333  |  slow K 70 = 57.7778


null
Signal on stock VXX --- ADX = 14.946056106639105  |  previous slow K 14 = 76.1905  |  slow K 14 = 80.9524  |  slow K 70 = 52.381


null
Signal on stock VXX --- ADX = 11.752216064146365  |  previous slow K 14 = 72.2222  |  slow K 14 = 88.8889  |  slow K 70 = 57.4074


null
Signal on stock VXX --- ADX = 18.301790408339  |  previous slow K 14 = 75.7576  |  slow K 14 = 82.7506  |  slow K 70 = 83.8082


null
Signal on stock VXX --- ADX = 16.689579351125648  |  previous slow K 14 = 71.0438  |  slow K 14 = 83.5017  |  slow K 70 = 89.1813


null
Signal on stock VXX --- ADX = 14.355076267699218  |  previous slow K 14 = 70.8333  |  slow K 14 = 80.0926  |  slow K 70 = 50.8772


null
Signal on stock VXX --- ADX = 17.70507500997881  |  previous slow K 14 = 79.1667  |  slow K 14 = 88.6364  |  slow K 70 = 61.5385


null
Signal on stock VXX --- ADX = 12.044013892903687  |  previous slow K 14 = 70.0  |  slow K 14 = 83.3333  |  slow K 70 = 57.5758


null
Signal on stock VXX --- ADX = 17.158111240194035  |  previous slow K 14 = 73.3333  |  slow K 14 = 80.0  |  slow K 70 = 77.7778


null
Signal on stock VXX --- ADX = 19.394964097571414  |  previous slow K 14 = 76.1364  |  slow K 14 = 87.2475  |  slow K 70 = 51.7241


null
Signal on stock VXX --- ADX = 19.141245921532374  |  previous slow K 14 = 69.4444  |  slow K 14 = 83.3333  |  slow K 70 = 56.3218


null
Signal on stock VRX --- ADX = 11.944525006148647  |  previous slow K 14 = 68.254  |  slow K 14 = 80.1587  |  slow K 70 = 56.6667


null
Signal on stock VRX --- ADX = 17.301664235748383  |  previous slow K 14 = 79.3651  |  slow K 14 = 83.3333  |  slow K 70 = 81.8182


null
Signal on stock VRX --- ADX = 13.069173510472831  |  previous slow K 14 = 66.6667  |  slow K 14 = 83.3333  |  slow K 70 = 90.9091


null
Signal on stock VRX --- ADX = 16.418147564011942  |  previous slow K 14 = 78.5714  |  slow K 14 = 84.9206  |  slow K 70 = 92.094


null
Signal on stock VRX --- ADX = 17.6685110354443  |  previous slow K 14 = 71.4286  |  slow K 14 = 85.7143  |  slow K 70 = 92.3077


null
Signal on stock VRX --- ADX = 12.540648166246813  |  previous slow K 14 = 77.7778  |  slow K 14 = 80.5556  |  slow K 70 = 74.3791


null
Signal on stock VRX --- ADX = 17.045288456419463  |  previous slow K 14 = 76.6667  |  slow K 14 = 93.3333  |  slow K 70 = 92.674


null
Signal on stock VRX --- ADX = 19.996981923150038  |  previous slow K 14 = 67.6768  |  slow K 14 = 88.8889  |  slow K 70 = 71.0145


null
Signal on stock VRX --- ADX = 16.682709373851715  |  previous slow K 14 = 79.4872  |  slow K 14 = 84.6154  |  slow K 70 = 93.1034


null
Signal on stock VRX --- ADX = 12.685198258368997  |  previous slow K 14 = 71.4815  |  slow K 14 = 86.2963  |  slow K 70 = 72.3577


null
Signal on stock VRX --- ADX = 17.238280637395302  |  previous slow K 14 = 72.5  |  slow K 14 = 82.2222  |  slow K 70 = 82.906


null
Signal on stock VRX --- ADX = 17.28998729068031  |  previous slow K 14 = 62.5926  |  slow K 14 = 82.5926  |  slow K 70 = 68.254


null
Signal on stock VRX --- ADX = 19.33217080626031  |  previous slow K 14 = 78.4091  |  slow K 14 = 83.3333  |  slow K 70 = 90.2297


null
Signal on stock VRX --- ADX = 15.870406716260675  |  previous slow K 14 = 77.7778  |  slow K 14 = 84.9206  |  slow K 70 = 76.8116


null
Signal on stock VRX --- ADX = 13.489371660558058  |  previous slow K 14 = 72.5  |  slow K 14 = 82.5  |  slow K 70 = 80.7602


null
Signal on stock VRX --- ADX = 15.84584351251201  |  previous slow K 14 = 78.5185  |  slow K 14 = 80.0  |  slow K 70 = 79.1667


null
Signal on stock VRX --- ADX = 16.935487574067473  |  previous slow K 14 = 78.3333  |  slow K 14 = 91.6667  |  slow K 70 = 79.4872


null
Signal on stock VRX --- ADX = 17.16883181138578  |  previous slow K 14 = 69.2063  |  slow K 14 = 83.7897  |  slow K 70 = 90.1515


null
Signal on stock VRX --- ADX = 15.447535158626234  |  previous slow K 14 = 75.463  |  slow K 14 = 92.1296  |  slow K 70 = 69.9735


null
Signal on stock VRX --- ADX = 17.90747554940228  |  previous slow K 14 = 75.8333  |  slow K 14 = 82.5  |  slow K 70 = 85.5072


null
Signal on stock VRX --- ADX = 19.49566047766302  |  previous slow K 14 = 74.0741  |  slow K 14 = 81.4815  |  slow K 70 = 92.4242


null
Signal on stock VRX --- ADX = 17.712792230879682  |  previous slow K 14 = 70.0337  |  slow K 14 = 81.0185  |  slow K 70 = 61.3333


null
Signal on stock VRX --- ADX = 10.593204648297638  |  previous slow K 14 = 66.6667  |  slow K 14 = 81.1111  |  slow K 70 = 74.0741


null
Signal on stock VRX --- ADX = 10.342486001972912  |  previous slow K 14 = 77.7778  |  slow K 14 = 83.3333  |  slow K 70 = 77.7778


null
Signal on stock VRX --- ADX = 17.95262869642911  |  previous slow K 14 = 71.6667  |  slow K 14 = 82.5253  |  slow K 70 = 78.3333


null
Signal on stock VRX --- ADX = 19.97356621804263  |  previous slow K 14 = 72.2222  |  slow K 14 = 83.3333  |  slow K 70 = 73.8095


null
Signal on stock VRX --- ADX = 17.729370274589172  |  previous slow K 14 = 76.7857  |  slow K 14 = 95.8333  |  slow K 70 = 53.3333


null
Signal on stock VRX --- ADX = 19.95108725925001  |  previous slow K 14 = 73.3333  |  slow K 14 = 81.1111  |  slow K 70 = 60.0


null
Signal on stock VRX --- ADX = 18.214280496408367  |  previous slow K 14 = 72.0539  |  slow K 14 = 80.4714  |  slow K 70 = 63.4409


null
Signal on stock VRX --- ADX = 15.006058703827867  |  previous slow K 14 = 70.6349  |  slow K 14 = 84.9206  |  slow K 70 = 65.7609


null
Signal on stock VRX --- ADX = 15.733138621695739  |  previous slow K 14 = 71.4286  |  slow K 14 = 85.7143  |  slow K 70 = 57.1429


null
Signal on stock VRX --- ADX = 16.483308360255922  |  previous slow K 14 = 79.1667  |  slow K 14 = 84.2593  |  slow K 70 = 85.9259


null
Signal on stock VRX --- ADX = 15.688566948772324  |  previous slow K 14 = 66.6667  |  slow K 14 = 80.0  |  slow K 70 = 70.3704


null
Signal on stock VRX --- ADX = 19.274694951843447  |  previous slow K 14 = 79.4974  |  slow K 14 = 84.2593  |  slow K 70 = 51.6667


null
Signal on stock VRX --- ADX = 16.901055688155065  |  previous slow K 14 = 73.3333  |  slow K 14 = 83.8095  |  slow K 70 = 86.5385


null
Signal on stock VRX --- ADX = 15.53525848876556  |  previous slow K 14 = 47.2222  |  slow K 14 = 80.5556  |  slow K 70 = 64.2857


null
Signal on stock XOP --- ADX = 11.450465957285871  |  previous slow K 14 = 76.0684  |  slow K 14 = 86.6667  |  slow K 70 = 94.7469


null
Signal on stock XOP --- ADX = 10.450795455624851  |  previous slow K 14 = 79.5804  |  slow K 14 = 83.2168  |  slow K 70 = 96.5517


null
Signal on stock XOP --- ADX = 19.695577001744418  |  previous slow K 14 = 70.3704  |  slow K 14 = 81.4815  |  slow K 70 = 77.193


null
Signal on stock XOP --- ADX = 16.402142439645502  |  previous slow K 14 = 67.7778  |  slow K 14 = 83.3333  |  slow K 70 = 70.2381


null
Signal on stock XOP --- ADX = 13.363197625441328  |  previous slow K 14 = 78.5714  |  slow K 14 = 85.7143  |  slow K 70 = 67.0117


null
Signal on stock XOP --- ADX = 12.225349409995166  |  previous slow K 14 = 77.7778  |  slow K 14 = 94.4444  |  slow K 70 = 71.4286


null
Signal on stock XOP --- ADX = 18.270506071270894  |  previous slow K 14 = 73.3333  |  slow K 14 = 86.6667  |  slow K 70 = 80.0


null
Signal on stock XOP --- ADX = 16.000518108319604  |  previous slow K 14 = 79.4949  |  slow K 14 = 90.6061  |  slow K 70 = 75.0


null
Signal on stock XOP --- ADX = 18.512278266488035  |  previous slow K 14 = 78.7157  |  slow K 14 = 89.8268  |  slow K 70 = 74.1935


null
Signal on stock XOP --- ADX = 17.30459566316207  |  previous slow K 14 = 75.0583  |  slow K 14 = 81.8182  |  slow K 70 = 52.4492


null
Signal on stock XOP --- ADX = 18.25842542037857  |  previous slow K 14 = 74.1026  |  slow K 14 = 85.641  |  slow K 70 = 87.9825


null
Signal on stock XOP --- ADX = 19.040799900738886  |  previous slow K 14 = 76.1905  |  slow K 14 = 90.4762  |  slow K 70 = 91.9192


null
Signal on stock XOP --- ADX = 18.23574753161744  |  previous slow K 14 = 75.3968  |  slow K 14 = 84.9206  |  slow K 70 = 77.305


null
Signal on stock XOP --- ADX = 17.05759167086327  |  previous slow K 14 = 74.6032  |  slow K 14 = 85.1852  |  slow K 70 = 82.2695


null
Signal on stock XOP --- ADX = 19.091053228000103  |  previous slow K 14 = 74.8485  |  slow K 14 = 80.2357  |  slow K 70 = 79.5978


null
Signal on stock XOP --- ADX = 15.924794923009495  |  previous slow K 14 = 78.9899  |  slow K 14 = 81.9964  |  slow K 70 = 87.6344


null
Signal on stock XOP --- ADX = 19.598564955280633  |  previous slow K 14 = 69.9495  |  slow K 14 = 87.5253  |  slow K 70 = 97.6378


null
Signal on stock XOP --- ADX = 13.962464767332028  |  previous slow K 14 = 76.1111  |  slow K 14 = 87.2222  |  slow K 70 = 96.7593


null
Signal on stock XOP --- ADX = 18.408148933657458  |  previous slow K 14 = 66.6667  |  slow K 14 = 82.7657  |  slow K 70 = 89.5767


null
Signal on stock XOP --- ADX = 17.171793978915865  |  previous slow K 14 = 67.0588  |  slow K 14 = 86.6667  |  slow K 70 = 77.0


null
Signal on stock XOP --- ADX = 15.68474504011522  |  previous slow K 14 = 62.963  |  slow K 14 = 80.4714  |  slow K 70 = 72.4638


null
Signal on stock XOP --- ADX = 17.871079171097318  |  previous slow K 14 = 65.3846  |  slow K 14 = 80.5556  |  slow K 70 = 88.0952


null
Signal on stock XOP --- ADX = 18.474796937482022  |  previous slow K 14 = 74.8039  |  slow K 14 = 83.7675  |  slow K 70 = 67.9012


null
Signal on stock XOP --- ADX = 15.13420243981516  |  previous slow K 14 = 59.7222  |  slow K 14 = 88.8889  |  slow K 70 = 59.6491


null
Signal on stock XOP --- ADX = 16.546529525044466  |  previous slow K 14 = 71.6667  |  slow K 14 = 92.5  |  slow K 70 = 79.4118


null
Signal on stock XOP --- ADX = 15.818341583511264  |  previous slow K 14 = 74.4444  |  slow K 14 = 96.6667  |  slow K 70 = 55.5556


null
Signal on stock XOP --- ADX = 19.907294851949107  |  previous slow K 14 = 77.7778  |  slow K 14 = 88.8889  |  slow K 70 = 84.6154


null
Signal on stock XOP --- ADX = 13.7534414124384  |  previous slow K 14 = 66.6667  |  slow K 14 = 86.6667  |  slow K 70 = 92.3077


null
Signal on stock XOP --- ADX = 10.939145482736118  |  previous slow K 14 = 77.7778  |  slow K 14 = 80.1587  |  slow K 70 = 91.6667


null
Signal on stock XOP --- ADX = 19.345921739295324  |  previous slow K 14 = 79.3447  |  slow K 14 = 85.3704  |  slow K 70 = 62.5


null
Signal on stock XOP --- ADX = 13.367954574204804  |  previous slow K 14 = 77.5253  |  slow K 14 = 91.4141  |  slow K 70 = 53.3333


null
Signal on stock XOP --- ADX = 17.570982631392116  |  previous slow K 14 = 75.0583  |  slow K 14 = 87.8788  |  slow K 70 = 66.6667


null
Signal on stock XOP --- ADX = 16.09207836433921  |  previous slow K 14 = 64.0152  |  slow K 14 = 80.6818  |  slow K 70 = 62.963


null
Signal on stock XOP --- ADX = 15.069742062778364  |  previous slow K 14 = 74.7475  |  slow K 14 = 90.4882  |  slow K 70 = 62.8788


null
Signal on stock XOP --- ADX = 16.463423717609707  |  previous slow K 14 = 60.4762  |  slow K 14 = 80.9524  |  slow K 70 = 68.6275


null
Signal on stock XOP --- ADX = 19.288384947442868  |  previous slow K 14 = 78.7302  |  slow K 14 = 86.3492  |  slow K 70 = 95.0249


