<?xml version="1.0" standalone="no"?>
<!DOCTYPE svg PUBLIC "-//W3C//DTD SVG 20010904//EN"
 "http://www.w3.org/TR/2001/REC-SVG-20010904/DTD/svg10.dtd">
<svg version="1.0" xmlns="http://www.w3.org/2000/svg"
 width="700.000000pt" height="700.000000pt" viewBox="0 0 700.000000 700.000000"
 preserveAspectRatio="xMidYMid meet">
<metadata>
Created by potrace 1.11, written by Peter Selinger 2001-2013
</metadata>
<g transform="translate(0.000000,700.000000) scale(0.100000,-0.100000)"
fill="#000000" stroke="none">
<path d="M3188 6415 c-2 -1 -32 -5 -68 -9 -240 -23 -480 -119 -686 -272 -39
-29 -188 -169 -331 -311 -931 -919 -1513 -1499 -1513 -1505 0 -10 394 -408
403 -408 4 0 94 87 200 194 1380 1393 1527 1540 1592 1585 171 118 329 167
531 164 141 -3 326 -62 446 -144 61 -42 999 -992 1050 -1064 109 -153 165
-328 166 -511 0 -144 -38 -304 -95 -396 -13 -21 -23 -40 -23 -43 0 -24 -139
-172 -536 -573 -330 -334 -472 -471 -506 -488 -191 -97 -419 50 -419 270 0
102 26 138 292 408 258 261 309 320 357 413 78 151 102 243 107 400 4 136 -10
216 -57 338 -152 395 -643 637 -1063 523 -28 -7 -62 -19 -75 -26 -14 -7 -27
-13 -30 -13 -13 0 -81 -36 -131 -70 -77 -51 -1003 -988 -1085 -1097 -155 -206
-261 -489 -280 -751 -11 -136 -6 -295 10 -370 3 -13 8 -40 11 -59 3 -19 10
-53 15 -75 6 -22 12 -48 15 -58 42 -178 203 -465 349 -622 176 -188 918 -922
978 -967 260 -194 548 -290 868 -291 147 0 176 2 291 23 242 44 480 152 670
306 43 34 270 256 506 494 827 833 1263 1275 1263 1280 0 3 -90 97 -201 209
l-201 204 -41 -39 c-23 -22 -44 -42 -47 -45 -49 -61 -1674 -1685 -1720 -1720
-223 -168 -522 -219 -780 -133 -73 25 -138 57 -213 105 -21 13 -256 244 -522
513 -513 516 -562 573 -623 722 -16 38 -35 94 -42 124 -7 30 -16 70 -21 87
-15 64 -3 273 21 353 29 101 79 203 134 275 25 33 251 267 503 521 508 511
504 508 623 507 209 0 352 -224 265 -412 -20 -42 -76 -105 -265 -295 -273
-275 -315 -326 -376 -451 -60 -123 -85 -225 -89 -360 -5 -166 21 -278 97 -425
45 -86 93 -147 179 -225 98 -89 234 -165 369 -205 241 -73 511 -35 707 98 47
32 563 541 930 917 210 216 329 419 397 685 118 454 21 940 -260 1316 -68 91
-86 110 -601 628 -238 239 -463 457 -499 484 -248 186 -514 278 -827 286 -64
2 -118 2 -119 1z"/>
</g>
</svg>
