68799,D289E46A7DCD0CFFE50B5186D419FBAF9D3B9C5CF49B92DBE6AFBA10D13214B6
68599,12819210AAB018BEDE4A01B1D7FB1DB5AB10318DD8292FCF113D184D5E8F40AD
68399,DDD088A03A7457EA1F259229B13ADE2AA945AB4EB0FFE9A3B9BF38BCCA248014
68199,D0FA124834CEAA21A46403C807780EA86676E6A9C73760725BA2AC7733F55A20
67999,595F0C3DB1CB4B9D94AA0F35A470C0D7EE4741480C4A42320AC94212044B585A
67799,7CFC49F995E6599D1AC99800C8FEDFE49890662E7E2F2B399D57079A0CA6F192
67599,0DD060D315DDBA627DD4A84A2DA7FECA2F0B8657CEAFE184AEE30254DEE405CB
67399,7F12DD28FB505D11CC8E7623875C538A6F32F03F99960D4DBECC1436D3716C57
67199,3EADE96674C032920A3982764DF1B3128BCDD8D0008B0C900752E153E6CEEBDC
66999,816DDFAC9E8D906EA0A35623F6B5B4322F981D46E9693C5E2E251E41ABE76FCD
66799,3E66066B5FC53347973F7C584F328FC936073061EF1AD0E4290933F650C0D7A8
66599,8A55AB3E3EB1017239B3E8DA2C94BADE41AD86D56A31D81A6A141314DBA9F681
66399,3DDEDBA76DF13F1F07A3D6CA98EADF88408EEDCC28A86FE881ADECD7AE68B554
66199,136087D64A97B1549303C9EE88F31B08BF93F159109E7FC4F3456F98B8873F2F
65999,FF9C928F8580BDB4B98974932FAFFCCC7584561426B4AF8E2BF35378D4361C66
65799,DD5B423D2930C718B5B19F71A93BF08DEF006E612843FF904E77EFF89EF24CDD
65599,5962EAE9B47FD236D8E050CCFE6AF9D043FE1A6EF931CAF4F2D3D97988CC7F05
65399,D341FE5F4FD82EC53E6DBCB6EE9DFE7A24C90A6430DAD5A24734B35DD7F5A8D1
65199,159631AD06826629CA2CCD89221B5A571C13CCFE17298CF2BA01B40C52C7867A
64999,8DFDAAAE0A78CA57FDBED52542F286567A0FF5B04058AFE2354A3F8C145D5374
64799,9FCF433272CE1C9B0A59591725FFE8BD9433A6C637A2F76B379EF6FC425BBDCB
64599,79DE0DBC353AEF4218B7E895516482695221813BA3F637C9FB507440858B9C3E
64399,BEC9D4902035FB0F34966F3ACDEC3BE3EF02A3E09A88568FDB1B83B190AD882C
64199,75DD5B58DE0A659AA3BC470EB9B65EA16C193CBAFAAE21400549490505C3C017
63999,58EBDF30BA1580DA356E805BDE59803D12E1D9CC91FE61948F0853D39F41BA17
63799,9B211BB354954CC51E4FD6960050C04CE9A04454449D580FA0C7A07E2A81F901
63599,CA3BA1F62935C3D98523FA20304FF0F2CD4A41F07988F34F272E58854D652410
63399,9AEDCBADF3D79420A67EF4FC319C65966E1CD37581B4313029CDE5FE9B9083DF
63199,2D8E8CB8EFB0B3997B2BA67B2A37D1B16BF7E6510A6B8D8B9C6D8806538D64A8
62999,809FB303A2B327262573D915B171074B6A898FDAB72BAD040C62951B6C416EA7
62799,5588C56077DAF4B4582475D5D9511A2E76205B8A807AD58DFEC68326345E471F
62599,1BB6BC57EB07B7927C24630B49C90ED80A451F6BD46B997C1DDD52FEBE7781AA
62399,2110E06B10EF4E0168655F487A5E9F4E11D1E13917313A20AE7B19773AD85F38
62199,3E4947F620636EFA487A42A0D23484211BBAA3F423A411B540D34BA995C14F4B
61999,F01A171212DFB2A660F122C15BBCAA57A699C66AC2D6C30AB6654EC079A79355
61799,34AFCB2DA1C5FCE90C7476A53968C2A990A9FA5D138A47F50874837C05BCE98F
61599,71CC6E9D9C8DBA3B2ED009F78AB46F920D26A516BEA735A97C595E6D90F4ABF9
61399,00245EC0372995C51DDD998E538A707FEEC948521A6A43CB101A5DE02DCA108E
61199,2BFAB6A4F718A9914C2F045CDE6065192FE65F6FD9533FCF20067CC780D54702
60999,FD717BE3D75FB333971F21DFAF7F758013F8836B03BDBC4921D3897F80358447
60799,564B60D2A42DE9C682CA057EA4D5F85FE7DDA14228BCA0AC458D595E2DC8B14E
60599,D0576E9B97CB24E264E069F0E026600329B3E64E70723E20165538578670BEE8
60399,A3F99620D9FBD340CB9BFD24F50B1FEF2194FFEC2F5BFEDFB8D2030B7A38B5B8
60199,7C5EEF026BEFF050D21335FC95A100A500375A7FC88B3B8DF73AA66CFD71A319
59999,D36D0D88E6E1FF9ABA00CD879A6FB14D9B80895D99C12EB44C89C278B031E5AD
59799,978C122F4AB8742D762DC410FEF28E6E6975B8E42E82050479772B345BA07160
59599,688AD606916ACEA80D36548EA1970A24265C0B17E80A407B37E54ACB19AE9FC7
59399,7360A2904F2040C181DF2578E1315FED7DE2F50DC0D71585F3723E8E955B45A7
59199,0E04BD1BBA3AC15D12FB124298DB57E17E60E05215F93DCCDB72250C37DE6786
58999,B61BF5BEF845FDD14A6A4907621DB085A2C6FEF5562B9C11655AADE3AA81FE57
58799,F20ACA96F540F38962131707062532A36EC9D649E10B32E99B03E8096F89129A
58599,DA8E536582A05D6090CF9167C3FC6755228E5E73A2C26F48DA759931D02957C0
58399,06C782827C36EFDFD764034205FC63CD5BD2B58D10E1D2E0B2B12963FD71B6F4
58199,8DF1913225C4FEB406C3486A1E908BFFCD42108E47644DFB266DDDC221751DD1
57999,1634D41CD3D4267984F3E01D00F74732EA1497C84FCBEB4C4125B1D6C44FA431
57799,E7EA0A722C9CEC4502D01246AF427EEA0C604472940103041E29760D2A59B84A
57599,B5EED7AC686109AE2CF481B5CA94FE1DA83DA5C4298B39D4A4DF3C9DC0311FED
57399,7B5D2DD873A678F81FF0A84DBB95E94AECE54A38CAF6C7D6D031A849B8C8D877
57199,BCB56F18ECC5B34DE98F856ED71D1D5C2EAF5FF03E22C42D426BA6785CEECD55
56999,07FED48EBD2630CC441CC9C5DE7708A3163095080109EB8532FD6CFC28947EB5
56799,8446DE7A67680EA6852C203F09338CAB13897FA69FCBEEC49A431EEFCD369A74
56599,BE9D916C185CE6552F0BC8B4677A313CA10B91135202B290D6C15E97A7357DAC
56399,C3EF1437F8BE001AD6EF43A6678642B72A244112C872568BE524CA3505FEDC19
56199,8381A1B57F4B1150C7DB2B9DA563E6272C95C224B6FBD5AC335E544148477926
55999,83AF19CEB8AE862401CADE494D9317ED1267047C0BC18843E4EE12C55BC0448E
55799,A71CB12A167FFD0F68C233CE48E8B7790982DC3B08956EE84B0AC250D018A796
55599,1DE7DA8B113C09C0BEE1AC1E18EA07F09242B05FF7D61A27BC8C8C4E702FDE13
55399,1D975BEE71FF4FF7D464FD5A6AD958F7961C3BFF8A4ECBD3F71A07E2EEDFABE6
55199,6C443872A6D4257ADBBC1E3F803A009BBE1C1191E40B1E9B9C743D68D9B6872B
54999,233593C5AAF89A541C53E109029B33CFB48A7550EC15B3E41356A615F83C35CF
54799,F191F6F61EFAB3C02DD0D815B476A1B1BA1A21F1388ED8CC35FA61E4D0B22D00
54599,4834D86E35B7073C84015D9AB5944424AD32DA7AD85EA2D82BF82E9C383CE263
54399,21A9AE3A46DB05BFBA2B4B532352306E94F5985D273EE84804CAEDD515A069E4
54199,2E1E045EDB52EE7DD7CC13EAA4BDB6442F1B5725361DDF0DEC4BD47923496B03
53999,165C1096158CE93BB4B6A9F442BBDE1F5354A816C38B9C7A3B7CA6982B334CA9
53799,D9FA569B861D7A1B7CC5DB1403ABB5D33F746770405C26FD9630F8CA6EA9807F
53599,BB0780C8ED9BFF8BAC39C700097F0F65A93FC0BDCCC043B6CEA02E59A5EFFFF3
53399,87648018B540FB2E8AA0D1AE670CFF3DB9672D4DDD868F6411077AB9EDB8F301
53199,DD8340D05F97D5E4B53A27A9821AA880C0542CB97E138BB26DBC985B3D9D3916
52999,ED36ADF7F6A4DBD129BCBA7B61E210DEF0AE90F135F11D94987876A485B899F8
52799,6EEB621BC34AB92C261B610FCB835E5BD930E56CD243CDE46D2CDEE7D55382AE
52599,4350E411453D8E41A49955CB3D6D7275055D83E56258D0964540AC09C79EA705
52399,9D5BEA51E85721F35387B481D985B3AF41284E6C9663F06C28E760C17C996651
52199,1E3195BD6617DFB3792F72E8F3089CB27C9CFBECEDD35ED94BC9F0DA3BF988FA
51999,4E839F6F5DB7376BA0058A8B4FD91DC64F0AA0138019D7D07F3C3ABDDFF9064D
51799,51843F7F7881DFD51BC0C589C718A40E35F38E8C1F901CD0F74380EA0E62566A
51599,E838EDD0566DD85A930682EC39CCB4BDF7DE0E5ECFC533F827AB9B3A848C930E
51399,1F3D64EB7D9D0211BCF85BCF7C5CA2D7EB946B5DA25818652B9BC691CEE53B84
51199,5C7DC15166D845CC6634AEADECB8BCBF34EE0A3D19250993E0B217EAF04ED3F8
50999,A2336949D5A885F2765662465FD2BAD7007958E4D1A0B8AFB799A948A4E106A3
50799,360E18D3D2CD458B9820AAE4A389EE9C1C7084FA6040EE785B262B1E7D0CE960
50599,3C6109FDAFA618AE2B26027F4CE1B373AA48AF5F000643E5E61481B122A0F4A1
50399,D9A562B94555CA8F25EA74B19559D2C927C470E623B9F68B0B55362389936105
50199,978F97A090514D828B69CD84293725671C4F0CD91709B5B79B57795CA095D0C3
49999,69556101FADF87C8F6ACE7B55F1B7C59FED60126B113B5ED1733CA1B132E3BBC
49799,88060F82503E78E35EB75320EDA16754B3FCF8B260B24C3A7EB7A41A99114A08
49599,7622FCE65CD019E68981677920EFA356151E6F4CF7D92C097D69B5CA880ED94C
49399,58EE13C242B7FA09C0875F15D91B5B5E74860411D92BC8BBC7DA577D82015F1F
49199,360ABC3C1DC5476FDE9790443868809932F96EF8A44993BD0A9857B650E8B497
48999,F006A31FC7771951A08E541341B7162A770CCFFBA63127839367A2AE045DCF8D
48799,562CED257FB4146E59472D51BF6073F0614C4CB920AF8B21D188901563A9185F
48599,C5D462668B1988506CCA41F9A4FEAA00EA8BB5A8F1279ABD66B08A13BB2D276F
48399,9E2838EF12429DA05AD361CDF1488D924B8A5C04BC1A8D6094F0A29D87B1349D
48199,3066C6336296E9657577DCC2888D6888D13749352B0D792AAFD0100DD5E9329A
47999,73203A772F3E843CA757C77615A5D0934D93EB8C1F997032C7304B1E270EFA37
47799,90AC0AB62D8B2BDC4B4779279B7BE20E3A26B580074F01077A2A2F42D5175E55
47599,BFCE1AE358566C264C3D0CFE8F5652A7543F89021A0B8C05D8C6D3B79C151063
47399,091E402EB5D6D50E6844438EB2A90F0E4C075A993E4ABC50BD328F4C20743F03
47199,F0FB10E904B2D61295493B586463C0F992B6CEB59161793A6C541F82993C07BC
46999,DF2BED7D091F0C83099F48BE3F931D003387CA42197E9FF7314F79CB02505A3A
46799,824D453BD61245A34E00FB4BDC25FF7E27A181A651EBFD47DAE48805D30A3CCA
46599,1B4F552A3657BC23C76C70FE2F85435EC7FED5E79FF2DA514B1F955490137B59
46399,581392C7B635EB13B4ECE58D0D292783234810A42FD280DAA153882800C5DB7B
46199,78B60FE95D389B4C22805928511E892B3C423DBA0AC5BDA3BC6DEF3B8659480E
45999,84B59D5C45F6A47F74376F076ED68F6CD23BC13A18BDD07B030687DD656E0D32
45799,B671D3D77BCBC904B148EF8885E4FC709E94A56440E7FDBE01EA3EB2A80156DA
45599,45542C2470E7002557D45F30CF350FC6009E4D1EE3463BC76414199B20AB10CC
45399,4C232E336E08AAC3F4CBADC324E6CED6B3C43C05F95B4DB1D220AB81AD63EFA3
45199,ED1EC003B81EB5E27C89276B47BCE725EDC224431AF849414B5AABE692150697
44999,147789D3FBE3BB671EA5FE6C607CCFDAFD4245181899F63D3B371B892E4B9225
44799,A3D8032537FA22EF78E946599108973F6E1C9BBC24F233BCC519495D9AFFDA20
44599,E23EF70D2C4CC97338A1524D7A99A75CE9D05E1C7C2CA72F04BD5D2CAFCAF681
44399,435B13BB090063AA8CCFBD80318A33862EF0164EDF07E0865515930D5B085756
44199,94A97633F4664E6B72ABBEF6D59F47BF94448E92984D1637AF6A2E965C1744F0
43999,33600ED1CDD9EFB2EEDCCCDDC3CF85B18635478C865A80B5ACE07C7D0FE9A52F
43799,1A449F6B5C16A6AFA5999B585065686A73E9046EDBA9D850EA333EAFA45F0B45
43599,EF79E433268B782BF037F65EDB0954B7BF9983330754C4D1CE4C008BEF08A52D
43399,4794F7828B76626329ECE60CD2F6B26AD7728864624E757138BFDDFAB94EC2FE
43199,053795A6EE314C3F8EE6D3D18FEB24A18AD76D69C8C5586834678750DA5422A1
42999,E86BB9F264C332220F5B67C8A746B1B2392A620406111F6FA71160FD027E0BB9
42799,69EA33691DA274ECC7FC1D8F9FD356211258B5DB9CCD2E011965DA772D5C41B4
42599,0D3970C4A0A71A7596D81B04BCE60FF06C427DBCFEFC5ED1B1285E18E1C4D955
42399,4AE9E0253D42C5DA59009864CC53ED7900C177333300B82C3DE9E8B62D98E908
42199,C5719319949B2AF431A5F444FEF384075112182FC16FE1B5F2FF0EDD5C70FE49
41999,D4D8BE2461FD47121164A84702FE6678ADB81455216C2D679339E49C3E18C5D6
41799,4F1950119E336DBAFBB7F09FE0CE74F2094125B3D5A9221FD3AB24CB9ED2FA04
41599,4413FF7FD344DFBA7E8B12327075B70F0EDB88764550C31C1BF50A0E4D2CDCEC
41399,E1D004CB69BF8D5E44ACE8C045B487C381C09DB17E2E25C7EA66A49EFB17696B
41199,179B118DB3E66A326E230AF386528047FC98FAF447F726B4E0640D497E9D8479
40999,4B944262C6B64FD71F91D64EC06577D56ACFBC977A2C84C3144FE61D22DDD45D
40799,32B1F0C625715B3A3CC3E3B21A7F757B906FFC92C057B5412635E79646C738FB
40599,C70EE0346245801AE2AE78C5A27C47C933E6F7D0D19EC251F47B8CDC387504AA
40399,714DBB13FEEB7BDE48E6C2D0E4B37EF77883A497045F05A74EC4D2AA3647D2EB
40199,B5ECFD42C2C5B006A341906925C4A7BB53BEBEA291DBBD7D4F1FA3E519A93C5E
39999,E3C8C57392EBFA3CBB722B175C416CADABEF97BBAF17B36B0F98296F7B0200D9
39799,3984D954409809899CCC0B3ABFD5B99785CE32648D13DDFAFCD9AE9881B5A56C
39599,6128AE682C6C99E95F6B1ED9F9E6CC703193CBFCA9A8ADDBFAE17A7E08A07F6B
39399,5D79EC70D5EC64F9DA71E1316CFF7F87AA43125B6098138622D1E1DA3398733E
39199,51C01EF3C3BA45F971E15F55CE6A0E9D4D9160B872B0E6CC6FCB02108C4F2168
38999,F24B6F9CEA454611EC0018EB0D386D6B5183BB9209A57195AD165D162550E888
38799,6AC5C031997731935B35F972709588030228BEB7690E6528D0BE80ADA30F14A3
38599,CCB43A19EC8EF63271D5C7BC595A49476FEB56989771DA0A11EB9BDDEBFAD931
38399,16343C2351F13C4B9AE3FFFC873D32F6F9E1A2E805FF5A7808ED25E2A23526BA
38199,1C38530EEE347F7F6DBBF3C4A5741FFE98A37D23719337A67D46DA8FFB94B866
37999,572811EFC4064B2E409115655B3D282BF53F52DE665E62FAFECAF4F7EC02DFE7
37799,E1D645B56E9A47CEBAC7B78ADC530F0AD911A1CEDFB99046AA01F11F34FA61EA
37599,7A6A8D1A785B59CCBFB6CBED3C3BD7C23F84C4785375B17EE148320676E5157A
37399,2CDE7AF1400186EA954BCB3B852C27B5134056854A7056F3157A29CAF2A414D5
37199,0A4F79E90D5AE462997FC2D06067B900F1A0A59EF168EFC323B3DE64ECD84106
36999,42B54D5B509BEA2FDFE5B333DC546723A67E1BD9EDCC8A3F0DA756B4B7D7049D
36799,F56005CB638F3D94105550D7A2B68580CE813B62171AE5573E335A8D7004CDD5
36599,8ECA1DE90FDEFEDA4B25D0F1A07E35DB3FB9D9EE12C5EC6A1294DFCACE83BE39
36399,3A6D450F475D6C1242BB1AAA8EE72F1290C97ABA0126DE58E66E38EF564D8622
36199,0BC2EFD6EBCC0BEEDFA89A9C41BA005119E9DBC3C73B7E6A45E7E68EED0F0C8C
35999,C7EC240988B4305F9802821FB38853D3E03F0D7B8A35B2317DDDD04F12F4CF8E
35799,2AE47DB2E18F1261BE6E99F0A5D3D9DA33638912B05E6147EF3B198AE159119B
35599,0865E606D0897732516E96C1E3AB1C228AFDD230C29442EBBA9C6FF10BB32CA3
35399,BCFB0DEE808B438D0E6767D92828156D208BC07333C3B43B8AFCDDDEB80A77F9
35199,8190BEA07A748D8663FE62FE633E7A84BF94AA6D3C2AF7FB2A62B2FFF1AECA76
34999,3CD2BCDC6105AD542B23F1CAB503669FF0BF6950C8DDE64711FEF9E65C0C6095
34799,32343E8169010790DFB69660C7F7345A3EDDE9275204E45CF5568B08FDB28244
34599,91C928019B190CF1BEA6036FEA32FB9FE0CC6997F68B9B4259C98BC159044DE9
34399,3310AD9DFA865426221C84BE3FA0BE22BF5F594393217C5EBAD48CB716413847
34199,95342E0E492CE5F301309D5FDAE77BDD1CC24E257F3AE9111637266B060EA3F2
33999,ABCB18C63CAC227E3EAD60C3BBFB1AC392C2514D3439EEFAEF9BEF99BA216F0B
33799,B851F332248E08AEDCDE3E44BE3AEF01B7E87EBC876FE808686BC8F7FA617AE7
33599,1267F9D637FB06AB3031B9136B5C7B7BB2785A3B047E3842E50BF6CB8A2C8B72
33399,215091F473AB24DA7BD91A2DF65B85C0CD999A3BC5F04283CD32976E433F6D8B
33199,0AD232D6AD13DA20CF3D4BA443AEAB9E2BB9B443DA2156AE7DEB89B7B512EA77
32999,C5E5191328CA24C2B2B1F02EEF20CBC01086608AB9B2848BD164DD3F3AB61679
32799,A4BA86B4B4B9FD574A200D38A4728A491DB8AD65EDAC13F98AFCD576AF317441
32599,712852794D0CC24ACDC995C7ACC8C0A646E003D6C5CB53656D31B00C7ADE22DC
32399,DBBFFD2BEC03E53CED9772B3B9DDC6827117DA23867CED45E8ECEB7867AAE3CC
32199,56F18B78DC2A3841255F1F6CEB96B755FDEDC9B674C9FB74EBD55630D2648FB4
31999,06C9AD9EFBD38CCCA9C8FE4682BB5D7864E127EF4ED97DF001CECE4F500CCA8D
31799,912E9BBAE3BCA41C300D9AE50699B81D12E40D92F92FD4B5EF0C06AFA67068DA
31599,1F1A06F680950689D7F4A1057D058848EC5B83C1A01C41E95D6A5908484FBA5F
31399,4106F70A1AD833375C8D5E9E7D575FB1EFC82698AE79C21D6756840E111BB019
31199,B9625586997B1B2BBB39D03B40603C516748C933747FEE61828043FD479AF8E7
30999,189F21E1E1541325CA6005A6D3565C00CD9A57C83179FF4C710DBEE6D9B36412
30799,F84A182F9880C0C168E14CBD4CF60F7D32FAB9BCB7F155D6FE3EB5527B4BF600
30599,2D644F28823F38B3B557E670601BC38115AC2A32B1736CBA67D821B27B987FFE
30399,C13B2BECD43A755F014A2FD784AB240E2329BC5E38F321596C87BB26B3538614
30199,F2D1827D0508AF7FDD2225A60DF4DBEA236AFD7D3EE163D84A311EFB16A77C82
29999,C38C66CE3C5E430453A857EFD1B4FDEF7380375B2CB58087E662319674710A6C
29799,283D999D334E445434048724918FC201B10B2B358F402A8CE8670E70DB05CA9F
29599,87D90C212B45BA88381ACE092E4CEE1FEDF4F1A35DFF2F7AB7FA0AC658437F9A
29399,83925408553380C02A2D6CB4D48CCC51F6E34B04137909450FDEAA86BB804753
29199,4A5F9562F207E6ABBCA76CDD2A3CB4EEBA44344CCB44F6B73EB5BE8FB2F11728
28999,3C0A9B76DB8BA9053EC4B60208EA92AF82EE5408C4C3D705F75154ED0AD99804
28799,E4198C09B451DE97A52E3B2248FD8780B01A06F5345405977C8442A5AC61EB36
28599,0B8E19FBAD522034F95DB68144C531B8378C055E14F848353453661731C8EA06
28399,BA1C0C4C437EC80BD661CAAFCE41B2BF507F5A80C1358803B665808D8A6468BD
28199,8069E40B13836830E444FF943EC6A1D7FB654D403F465C6DBDDB1198DD77A62F
27999,92B7CC0B5C4E1B4562E1143984A400930AF04792F54C355AF12DF5523BE76C42
27799,1C91F5DCAE1DA6420B70D758EE7C925A1C425C6D0A1D57D0AA0F78A87EFE6746
27599,56162C3920B5384DCCD94E1C6AE9DEA369112565AB1C8988000E2B50B5C95E87
27399,28AD4EA09341763465BC67A3495EE97F6FB67AD9BB50E2DE7BC5206E1C3A6CFD
27199,886AD6692AB4DAA937B4D57AA1140D19C390C136390A714B556C291AE9C33CBD
26999,DAD969320A09BF26B420A6838E2407F01D21450E0CE6F60A0AE7FFAD38059002
26799,14D3412D65C9C1948EFDA8AF81B02A28A3CE75E777F07FE892C3B6FCBE88E2CD
26599,A22B9D501B62ABD9323984A71D8EB9E1B83A1B4DD8B3A96A1FAE74F21CE3B9A6
26399,4B6187C599FF988B469701CCFE3388FB9653EAEB86127F1C3BCE72015EF0714A
26199,3C907B3D4DFC040F471F6C3459AC9334C4099D3A837C22ADD9AF2903E895A3A6
25999,33901B6BF94D50CC02D6D9A3ACD2E12F5D7065E5F623DD3F16D19444C6C96D16
25799,C72404C552C4136CCD51192DBEDBA51E6CD54543B0276D31819279B2B5B95C23
25599,8BA1D859718CCB194010BCF063D3D23F56CAD11FDE8A4E83F0C067645782AB4E
25399,7FDF6FCCFDFFB7E0FD7CEDBC3E0FF763A491F1A9AE48648D316C2DCFD970524E
25199,49827397F07B08D585C8906D20C053E7F9755318EEA9F07EDD7E605F780B82E6
24999,E955ADBC580455A6157BA75D6A91D626E33CFD4878990819149018F5B0584382
24799,6D498D0BDB59C20A51B4AE0F8143F86493568C3E8658FB3AA4B077F65617429B
24599,E94A58757B629CB3AA7832C2483B318250271BDAF25734596BF0CCBF0AEA052B
24399,D3402DE056D3E9C7D54A538B4660712F6627A1438538A740BB72F72859C322A2
24199,AC02A3138F6E0955E562DE2A9120285F6E8BBEB810C6BF9D016CB86EB076EB88
23999,F3D72AE5E7172C5013A0EE1280C3E27E8E4DB4BFDDF3C750C33D3A3FCF3B2F1C
23799,F619F787B8C1C298F8749BB605948FDEDB75D9EF06A7BC3B2E3286FE9B233AA8
23599,4DBB295D2A8528CF831B3DA4DB265C725CFEB5D11930E2141E71D80AC8B176C6
23399,36E998D84A188CDAA6968BA1BA573F68C10766BE8C61A8A98B86C9E058E6D0BD
23199,06FF57F8E8E5DC796E694E424F3CB826932B67ADD129D1B32F267781B7560CAD
22999,A2364615BA177E19088F389439CFD75A5A42854C449FBF3BC1C1B8E371B03471
22799,4D336E41B7AD9283DB42EF8E544EB93A8541A8FED4361940E83C314F2B8995B2
22599,96CD13B5A649F0DFF2E88C83C99F5C3E5DED73B6B126675E9E3F0B87C8D8ADCE
22399,35211349DE4E8EEC5E72EA38C33B4AD465207FFE4B71C3E2FC0A588F745E5B21
22199,0278D795182162EA1246D2F1D7A5AB0792EE3A784D37A4D9576E00E9DB698AC5
21999,585BD0838AC55D4E9647D92632E8BEF85A128252DE3476EBFE1476931C9B381B
21799,42287A23C632CF9CED70F817525EBB7EFA4A64356638E19F0A7F40D51D42F0A8
21599,FC3D710E66CA7D7FF66FD9605A45F6A6373EB21D51F8631FB53FB85B3D26A443
21399,174EC896327CFB4666FCFDF5FBEDD7DCF5F43753C9299C6F808B6C81722724CA
21199,00AAFAED3DF75F4F95A808DA15D3D8F64103F0E3D6C039DA75F4EE1BDA94B029
20999,BB3B01FD35A5528D18F2E5FBA6FA5A0385CACAF5CF2716A16287AB8A3E9834AD
20799,6C98A66EE34EA547EBCF785B25812D4507373F9AB1E87CE9C6DF076B2E6F9C8D
20599,0831C94464E058227BA77619C8D3BB1C6234D61552C61AC217DEED4CF851632A
20399,234BAF53AB51966A7E5947CE0CECDE329A7BC34F640F454907D19E23CB66C103
20199,6FCBB0A66A2EB158488B24A3F08CF59D9BE3FF85A40B7DA938198ABFE1A3EBA0
19999,508F820C2C6590EEE85A2CC489A0255730397101A22D940581B9B0BDE87978FA
19799,6FBDA22E419D376A74F12FBF255B1D924A7ECAE6759206CCF1594F7F0A49AA79
19599,B6005AF771260D7F20CF20B695ED7C08811A32F836B77CD023A4DD2D1EBB5278
19399,37F17ED612F1407EFD087144DC995BB13F0756165CDB647069E8061AF71CAB45
19199,B8BC1146CFFF5945CDD3A9C8CA45688134754FFB0B2B89A6B35B4D2E9DFD66F3
18999,160A46351C5C586F304EC26168E9431397EE0962D256B0CE639C26C5EEC63F12
18799,E62F57FE69E23A944693D67278484DAC7F913C96FFD938EBEA6FE7333BD9D728
18599,2F66D8A26EA562D5D8591D7C1F8884DB829053BF9B6D604D0818E34FC773959E
18399,996EF5A3195C0DE837E09BB3C81E8296033F0600B191C412055BA66FF89B504F
18199,06472333ED879AD8D29E2C2D11CC064BA948A3F808A06811964AAF1506B1F898
17999,D91F08F6391D73E52D1B76FAD08D30E339C28D6FC449FA148777E1D70110E09D
17799,2F2534316FF1737426175252E3489AA26E54B378E6C957C2E8799C387F66ED4B
17599,83F6493B9BB103FB560D68891B013D6804D22E0A85BBC99F2431C610E1A7613A
17399,4586F9B3C663540C17AF683D08C460E73CA4459C032A386901B3843ECD602228
17199,DDFCAF7E51C20EACE4DBD29F15AECB5840AAA63E6632B0250BE1A4ACD614E30B
16999,63F90AD32F8C4EB1B03D6923EA8002B042AF14EFF0B7284FB653EE3D9B36E023
16799,3D51B8D341DF636E19912D6EB1F103EDC3AA1D16456DCC5479D0E3C48851E730
16599,96D4AAB84188531B566F030D42FF662A1EF6C6AB223407C02878A3301E929148
16399,C53EFCA2EE158879D4F987636D1DE3AE91474519B0AF1AC4626CCA0CE7FDCAC9
16199,EDAB9DB3A6B894E7D130221673197DAEDCEADF45D112BCDCF6EFB75CDF1BE9E4
15999,DD3F7436C97CBFAEB41760B4DB7771C6F2B300BCE650E76D109559AA8C91110C
15799,790ADAF069B063366D587D6C558BD1B93C19AE455BCCE41DEDFAB8443E3BA936
15599,67C7F3F65B6F3444B1E34FD08B8151005B2FB53D5B0B829C1AB73A76A04EBAD3
15399,F18C353308A9E50CCBD3E954F9065D3E1F5FDD06A4BAA76933CBFC78E959B4C5
15199,48747317A001F40E997DE55DFC86706822FD789D99BBB00CB1638C8FF60ABA68
14999,660A8C19D8EC796C7BF31284F7658B61349434FF82DE022AF5271EE0ACDE35EC
14799,2E67D3CAA82A52E72085079180D25A0BD0F85DB7D92B244B08C81FC6038EB7FF
14599,4DFEA6727A4CB2B97141B62BD38C1170995D634483FFC16729B5DF504B5963B7
14399,09F01F48895EDE1272FEDE6AC4C808FC01F08975178511E9BA1584C559758221
14199,E2CD3572E40BA0C8CFAD6FDC823D58CC27F628B693655976F2BD2091F98CEE62
13999,8ABA34A8088F1ACDFCCFD145A2F032A01AA70AF41A45FD9D7307C0EBAE86C66B
13799,6E2423BE06A4661323E1C0BC5F747E6868E448F525932582480194B7F7D96AC1
13599,88AE45FAB72FB4FA2B05FA00218CEAA9940173A85CD54E00CF332D1D30F64AA0
13399,35C434FB04BF7DBDA15BFC8C350ACA605886B8B97090A4ECB78591815EE43544
13199,6F808E3188A54802402E6589C6AABB6E178CCF05EB32C1ABE9BC10AC56EBA3A4
12999,A267BD12CD8DCB1E565F183431D14C209F934204BF514A74B1294A47DC2438EB
12799,F2D13887125B7B919D066F1C3FDD7088FAFA4592966F2E231B90457D70C913B7
12599,99C3EDC713A9E3907C6EB0AF15E589842C254B12035D8348F8722B4981AEEBFA
12399,D482DFDD68B5A128957FECAFD23141FDD6139CF37E690DE8110C426ED4B8F322
12199,DD89A71533AF2DA9E6D0A579CC37930874CA940017E86FEF53AAA4E8D70BA28C
11999,55718AFD707EBE70D91144390816597887AD35F807E3326F1DF21BE4AB97E65D
11799,A7C6B552A02EA0CC3ADD7C9763FEE3B60E648E4529B1B2584ED38C6A0A55A562
11599,EF395EDE56EFD7455156EA17613C52386753B78F83A45F0F7ADC52604206ADC8
11399,6B0E5215707332E0252E58227B1E36F51C5F19DD20C514406F3065C3F62D48A6
11199,1AFEF72DB8A0E128E9D21BEA8F25BA6AA72E9049BBD4F38660CCD58A437E604E
10999,74417BCECA257D488EC4C69F3580AE3415B270A1F7D832F2247EF73EC16775A1
10799,1CD6E11A1730C41C0826856A7CD94F63EF6A78263560C80A43863EC45483044F
10599,5C6D8767329E1835E545DD608094E6C3FE555439D045B97CBF3534FC8985401E
10399,E15EBA1C1214379D5930BD71F3EFF16DAF71E1245279FA881CC3F3E6D305B703
10199,589C107EF0012272D2DF4B24EE3EE380BDD7DD33A55DA32C78A26AC1527F12FB
9999,75BAB9AC5AEDE1E8C6DD5179C676F053D942AB7376810A1C85C8C1FEDE7ECC86
9799,12EDAEC00ECD2F3A83C32AD817D577376E356F748A1F48B9371CF1CE4152CAB4
9599,199A1F8BFC8C6D3F956409AA37EF5AA74A3E187B85EFF01C8FA05EFD0BC8B2F8
9399,1B42B3A5AC2870D18282CE90670C116E4F420A37C5A02274F2257887EE7456B8
9199,8C9A94CE1A9FD52A272BB5C3FB9FAC1C0B2D01EB51DE9798328C9E78D645D647
8999,02AD0FBEF13E90BD19585B6317C029A7CD6E3A6405A830DA92B98BE78F1EBE9F
8799,1B18286013E6A5732CCBEE4F0D0D07FA23765C9E6A8D6079DD6580B463381114
8599,AEB54F750F3F0441A8A571D5F8F8B7E0E1482905973D02D05268C999156CA404
8399,1E287D8478AFAC4C8AEF8624E320F09CEE523B774DCB23CA232DD46FC095B628
8199,2D12EA0B7B6CC5398EE2DF3FCDFA6A1EEF1F8B3167B09071A1D5F50880E3E053
7999,54AF029D32FC937FCA0E18EE442E83DC834B7CD9E5A9DCEC7D103F70DA81C9E7
7799,877F24C5929D27ECD5B537075B038276BFB74531B5D4E4E457466E682F207E4D
7599,A86FAC09084CB92F8EE8C78B26EE77043CB4A42F85D15BEDE9C886B28CB11BE8
7399,A0A347EED988A01BBEDD831006463E4A4B57FFF973C2341D1BD2986948EC829B
7199,773E4AEB913A34AF879C8BFABBE192E6B5977C04DCAE42BBACC29BEFF1898DA0
6999,5C5EE87010A04D99B311067059AB0C3115280B0BE45D8CF79290F21A3AD4811C
6799,227D95E17645766853DE66AF22AC52FA0F69F71F45167ECDA60732B3159642BF
6599,299F4FF01173C4F1DA1E9AD4B9624F9F317B68DAC2FDD80F35CCB41850F57BD0
6399,B008C86F87319EB7EA0D5F9C71EEDC20479D221EAE69E832A0F539BBA288EDB5
6199,A9907FA680F07EAF91A71CD5180A5B73B08A6E6A38006238D2B8582AAB5EC191
5999,5D0C0A433624EEE4789E1784F131DFD6FBBF7F3DF9105E503C152DF4D57E5FF8
5799,128C3883BF2535C0034DF9280E4E84312621111A5A0667090F97190D0E495DAB
5599,50D10C50172A91882C555D4D62D174C9566C0E577A716DE0758A5F9D49643AAE
5399,50801DD89A068EF9B7622A0ABA42C254089CDEA32E32ED5B410EFAFE5D090E53
5199,AE743587848C9DB6CB1BBE9456197DE3C90A349AF00455908B5A1FBE6D1D2C78
