﻿{
  "environments": [
    {
      "namespace": "development",
      "CMakeArguments": "-DXI_BUILD_TESTSUITE=ON -DXI_PARALLEL_BUILD=ON"
    }
  ],
  "configurations": [
    {
      "name": "VS2017 x64 Debug (Default)",
      "generator": "Visual Studio 15 2017 Win64",
      "configurationType": "Debug",
      "inheritEnvironments": [ "msvc_x64_x64" ],
      "buildRoot": "${workspaceRoot}\\.build\\${name}",
      "installRoot": "${workspaceRoot}\\.install\\${name}",
      "cmakeCommandArgs": "${development.CMakeArguments} -DCMAKE_BUILD_TYPE=Debug",
      "buildCommandArgs": "",
      "ctestCommandArgs": ""
    },
    {
      "name": "VS2017 x64 Release (Default)",
      "generator": "Visual Studio 15 2017 Win64",
      "configurationType": "RelWithDebInfo",
      "inheritEnvironments": [ "msvc_x64_x64" ],
      "buildRoot": "${workspaceRoot}\\.build\\${name}",
      "installRoot": "${workspaceRoot}\\.install\\${name}",
      "cmakeCommandArgs": "${development.CMakeArguments} -DCMAKE_BUILD_TYPE=RelWithDebInfo",
      "buildCommandArgs": "",
      "ctestCommandArgs": ""
    }
  ]
}
