<?xml version="1.0" ?>
<!-- =================================================================================== -->
<!-- |    This document was autogenerated by xacro from luisa_robot.urdf.xacro         | -->
<!-- |    EDITING THIS FILE BY HAND IS NOT RECOMMENDED                                 | -->
<!-- =================================================================================== -->
<robot name="luisa_robot">
  <material name="green">
    <color rgba="0 0.5 0 1"/>
  </material>
  <material name="blue">
    <color rgba="0 0 0.5 1"/>
  </material>
  <material name="grey">
    <color rgba="0 0 0 1"/>
  </material>
  <link name="base_footprint"/>
  <link name="neck_main">
    <visual>
      <geometry>
        <mesh filename="package://luisa_description/meshes/head/neck/head_neck_main_v1.stl" scale="0.002 0.002 0.002"/>
      </geometry>
      <origin rpy="2.9845130209103035 0 0" xyz="-0.059 0.05 0.18"/>
      <material name="green"/>
    </visual>
  </link>
  <link name="neck_joint_lower">
    <visual>
      <geometry>
        <mesh filename="package://luisa_description/meshes/head/neck/head_neck_joint_lower_v1.stl" scale="0.002 0.002 0.002"/>
      </geometry>
      <origin rpy="-0.12566370614359174 0 0" xyz="-0.042 -0.06 0"/>
      <material name="blue"/>
    </visual>
  </link>
  <link name="neck_plate_high">
    <visual>
      <geometry>
        <mesh filename="package://luisa_description/meshes/head/neck/head_neck_plate_high_v1.stl" scale="0.002 0.002 0.002"/>
      </geometry>
      <origin rpy="3.141592653589793 0 3.141592653589793" xyz="0.105 -0.05 0.05"/>
      <material name="green"/>
    </visual>
  </link>
  <link name="neck_piston_base_front">
    <visual>
      <geometry>
        <mesh filename="package://luisa_description/meshes/head/neck/head_neck_piston_base_front_v1.stl" scale="0.002 0.002 0.002"/>
      </geometry>
      <origin rpy="0 0 0" xyz="-0.035 -0.035 0"/>
      <material name="blue"/>
    </visual>
  </link>
  <link name="neck_piston_front">
    <visual>
      <geometry>
        <mesh filename="package://luisa_description/meshes/head/neck/head_neck_piston_front_v1.stl" scale="0.002 0.002 0.002"/>
      </geometry>
      <origin rpy="0 0 0" xyz="-0.028 -0.028 0"/>
      <material name="blue"/>
    </visual>
  </link>
  <link name="neck_piston_base_side_left">
    <visual>
      <geometry>
        <mesh filename="package://luisa_description/meshes/head/neck/head_neck_piston_base_side_v1.stl" scale="0.002 0.002 0.002"/>
      </geometry>
      <origin rpy="0 0 0" xyz="-0.028 -0.028 0"/>
      <material name="blue"/>
    </visual>
  </link>
  <link name="neck_piston_side_left">
    <visual>
      <geometry>
        <mesh filename="package://luisa_description/meshes/head/neck/head_neck_piston_side_v1.stl" scale="0.002 0.002 0.002"/>
      </geometry>
      <origin rpy="0 0 0" xyz="-0.028 -0.028 0"/>
      <material name="blue"/>
    </visual>
  </link>
  <link name="neck_piston_base_side_right">
    <visual>
      <geometry>
        <mesh filename="package://luisa_description/meshes/head/neck/head_neck_piston_base_side_v1.stl" scale="0.002 0.002 0.002"/>
      </geometry>
      <origin rpy="0 0 0" xyz="-0.028 -0.028 0"/>
      <material name="blue"/>
    </visual>
  </link>
  <link name="neck_piston_side_right">
    <visual>
      <geometry>
        <mesh filename="package://luisa_description/meshes/head/neck/head_neck_piston_side_v1.stl" scale="0.002 0.002 0.002"/>
      </geometry>
      <origin rpy="0 0 0" xyz="-0.028 -0.028 0"/>
      <material name="blue"/>
    </visual>
  </link>
  <joint name="base_footprint_neck_main_joint" type="fixed">
    <parent link="base_footprint"/>
    <child link="neck_main"/>
    <origin rpy="0 0 0" xyz="0 0 0.1"/>
  </joint>
  <joint name="neck_main_neck_joint_lower_joint" type="fixed">
    <parent link="neck_main"/>
    <child link="neck_joint_lower"/>
    <origin rpy="0 0 0" xyz="0 0 0.14"/>
    link_b
    
  </joint>
  <!--
        Parameters:
        - parent_link: Name of the parent link.
        - child_link: Name of the child link.
        - xyz: x y z values separated by spaces (e.g., "1.0 2.0 3.0")
        - rpy: roll pitch yaw values separated by spaces (e.g., "0.1 0.2 0.3")
        -->
  <link name="neck_joint_lower_neck_plate_high_xy_placeholder"/>
  <link name="neck_joint_lower_neck_plate_high_yz_placeholder"/>
  <joint name="neck_joint_lower_neck_plate_high_x" type="revolute">
    <parent link="neck_joint_lower"/>
    <child link="neck_joint_lower_neck_plate_high_xy_placeholder"/>
    <origin rpy="0 0 0" xyz="0 0 0.08"/>
    <axis xyz="1 0 0"/>
    <limit effort="100" lower="-0.7853981633974483" upper="0.7853981633974483" velocity="100"/>
  </joint>
  <joint name="neck_joint_lower_neck_plate_high_y" type="revolute">
    <parent link="neck_joint_lower_neck_plate_high_xy_placeholder"/>
    <child link="neck_joint_lower_neck_plate_high_yz_placeholder"/>
    <origin rpy="0 0 0" xyz="0 0 0"/>
    <axis xyz="0 1 0"/>
    <limit effort="100" lower="-0.7853981633974483" upper="0.7853981633974483" velocity="100"/>
  </joint>
  <joint name="neck_joint_lower_neck_plate_high_z" type="revolute">
    <parent link="neck_joint_lower_neck_plate_high_yz_placeholder"/>
    <child link="neck_plate_high"/>
    <origin rpy="0 0 0" xyz="0 0 0"/>
    <axis xyz="0 0 1"/>
    <limit effort="100" lower="-0.7853981633974483" upper="0.7853981633974483" velocity="100"/>
  </joint>
  <joint name="base_footprint_neck_piston_base_front_joint" type="revolute">
    <parent link="base_footprint"/>
    <child link="neck_piston_base_front"/>
    <origin rpy="0.39269908169872414 0 0" xyz="0 0.2 0.1"/>
    <axis xyz="0 0 1"/>
    <limit effort="100" lower="-1.5707963267948966" upper="1.5707963267948966" velocity="100"/>
  </joint>
  <!--
        Parameters:
        - parent_link: Name of the parent link.
        - child_link: Name of the child link.
        - xyz: x y z values separated by spaces (e.g., "1.0 2.0 3.0")
        - rpy: roll pitch yaw values separated by spaces (e.g., "0.1 0.2 0.3")
        -->
  <joint name="neck_piston_base_front_neck_piston_front_r" type="prismatic">
    <parent link="neck_piston_base_front"/>
    <child link="neck_piston_front"/>
    <origin rpy="0 0 0" xyz="0 0 0.02"/>
    <axis xyz="0 0 1"/>
    <limit effort="100" lower="-1" upper="1" velocity="100"/>
    <mimic joint="base_footprint_neck_piston_base_front_joint" multiplier="0.1" offset="0"/>
  </joint>
  <joint name="base_footprint_neck_piston_base_side_left_joint" type="revolute">
    <parent link="base_footprint"/>
    <child link="neck_piston_base_side_left"/>
    <origin rpy="0 -0.6283185307179586 0" xyz="0.2 0 0.13999999999999999"/>
    <axis xyz="0 0 1"/>
    <limit effort="100" lower="-1.5707963267948966" upper="1.5707963267948966" velocity="100"/>
  </joint>
  <!--
        Parameters:
        - parent_link: Name of the parent link.
        - child_link: Name of the child link.
        - xyz: x y z values separated by spaces (e.g., "1.0 2.0 3.0")
        - rpy: roll pitch yaw values separated by spaces (e.g., "0.1 0.2 0.3")
        -->
  <joint name="neck_piston_base_side_left_neck_piston_side_left_r" type="prismatic">
    <parent link="neck_piston_base_side_left"/>
    <child link="neck_piston_side_left"/>
    <origin rpy="0 0 0" xyz="0 0 0.03"/>
    <axis xyz="0 0 1"/>
    <limit effort="100" lower="-1" upper="1" velocity="100"/>
    <mimic joint="base_footprint_neck_piston_base_side_left_joint" multiplier="0.1" offset="0"/>
  </joint>
  <joint name="base_footprint_neck_piston_base_side_right_joint" type="revolute">
    <parent link="base_footprint"/>
    <child link="neck_piston_base_side_right"/>
    <origin rpy="0 0.6283185307179586 0" xyz="-0.2 0 0.13999999999999999"/>
    <axis xyz="0 0 1"/>
    <limit effort="100" lower="-1.5707963267948966" upper="1.5707963267948966" velocity="100"/>
  </joint>
  <!--
        Parameters:
        - parent_link: Name of the parent link.
        - child_link: Name of the child link.
        - xyz: x y z values separated by spaces (e.g., "1.0 2.0 3.0")
        - rpy: roll pitch yaw values separated by spaces (e.g., "0.1 0.2 0.3")
        -->
  <joint name="neck_piston_base_side_right_neck_piston_side_right_r" type="prismatic">
    <parent link="neck_piston_base_side_right"/>
    <child link="neck_piston_side_right"/>
    <origin rpy="0 0 0" xyz="0 0 0.03"/>
    <axis xyz="0 0 1"/>
    <limit effort="100" lower="-1" upper="1" velocity="100"/>
    <mimic joint="base_footprint_neck_piston_base_side_right_joint" multiplier="0.1" offset="0"/>
  </joint>
</robot>
