,train_loss,test_loss,train_score,test_score
0,3203.3128967285156,229.42098999023438,0.11536556482315063,0.12922391295433044
1,191.76497395833334,107.1683578491211,0.13289460043112436,0.1420949250459671
2,95.36437225341797,51.49544143676758,0.14488700528939566,0.15597496926784515
3,54.92861811319987,41.04652404785156,0.15595318377017975,0.16104908287525177
4,39.64663823445638,29.1376895904541,0.16317915419737497,0.17198647558689117
5,36.912726720174156,24.500822067260742,0.1671391079823176,0.1766953319311142
6,26.43592898050944,32.45595932006836,0.17377609014511108,0.16923774778842926
7,43.51558049519857,85.3802261352539,0.16286409894625345,0.14732994139194489
8,69.44302749633789,95.66210174560547,0.1528415580590566,0.1451462358236313
9,72.4125207265218,74.48025512695312,0.15434436996777853,0.1499517261981964
10,52.5521551767985,48.77824020385742,0.16135082145531973,0.1600889265537262
11,36.321044921875,39.51177215576172,0.1684234937032064,0.1646154224872589
12,38.73301569620768,22.099390029907227,0.16600607335567474,0.18017646670341492
13,35.45447031656901,48.2044792175293,0.1692123661438624,0.16116878390312195
14,43.783873875935875,62.94285202026367,0.16593995690345764,0.1542152464389801
15,60.744324366251625,82.22748565673828,0.15808973213036856,0.1485782265663147
16,53.919809341430664,43.144508361816406,0.1616534690062205,0.16290663182735443
17,35.40029780069987,33.12413787841797,0.16888144612312317,0.1700451523065567
18,21.575616200764973,33.402557373046875,0.18506163855393729,0.17018753290176392
19,24.031992594401043,25.860172271728516,0.18030433853467306,0.17643842101097107
20,19.068191528320312,18.193740844726562,0.18663499255975088,0.18777376413345337
21,54.38541348775228,115.68880462646484,0.17015430827935538,0.14165419340133667
22,76.53053855895996,108.6797103881836,0.15561905006567636,0.14274297654628754
23,113.81202443440755,34.770015716552734,0.1420515477657318,0.16845475137233734
24,95.64142990112305,31.784440994262695,0.14886745313803354,0.1716022789478302
25,105.08551661173503,148.27151489257812,0.14876976609230042,0.13678258657455444
26,145.6021982828776,35.95487976074219,0.13747750222682953,0.16474027931690216
27,111.33085505167644,27.374347686767578,0.14525309205055237,0.1718982309103012
28,71.15143966674805,71.62759399414062,0.15402313570181528,0.15146766602993011
29,62.65861129760742,49.02408981323242,0.16043772300084433,0.16039332747459412
30,78.03606923421223,91.6343994140625,0.15054655571778616,0.14617253839969635
31,66.15900484720866,77.66082000732422,0.1569573034842809,0.14925234019756317
32,59.787488301595054,59.19227981567383,0.15585013727347055,0.15533974766731262
33,52.511514027913414,22.277273178100586,0.15861574312051138,0.17851057648658752
34,68.63712628682454,89.236083984375,0.16102380553881326,0.1468399316072464
35,64.06684684753418,49.62471389770508,0.158388023575147,0.15953995287418365
36,40.70275370279948,30.071367263793945,0.16789414485295615,0.17307081818580627
37,23.22649574279785,33.915077209472656,0.1803081432978312,0.17000249028205872
38,27.91841920216878,27.58292579650879,0.1753635654846827,0.17458228766918182
39,26.275955200195312,32.64753723144531,0.1759824405113856,0.17031635344028473
40,30.228012084960938,22.543453216552734,0.1727067083120346,0.18093419075012207
41,31.946788787841797,16.12006950378418,0.17175328731536865,0.19058768451213837
42,42.20852597554525,22.467031478881836,0.16892537474632263,0.1810740977525711
43,23.00724220275879,29.79859733581543,0.1817400356133779,0.17374707758426666
44,22.16575336456299,13.90625286102295,0.18287178874015808,0.19621071219444275
45,18.683699289957683,19.504743576049805,0.18899965286254883,0.18517087399959564
46,16.75864855448405,20.787050247192383,0.19043335815270743,0.1835823506116867
47,16.85581175486247,16.42687225341797,0.19026391704877219,0.1905335783958435
48,15.82918643951416,15.053215980529785,0.19163177410761514,0.1930750161409378
49,15.749170939127604,16.615161895751953,0.19216827054818472,0.1900835931301117
50,16.184526443481445,19.848468780517578,0.1913803666830063,0.18494777381420135
51,15.242047309875488,16.39432144165039,0.19330985844135284,0.19060289859771729
52,59.68957773844401,66.82470703125,0.1626984179019928,0.1535026729106903
53,47.30587609608968,75.575439453125,0.16799567639827728,0.15054304897785187
54,74.6611696879069,13.581992149353027,0.15120822687943777,0.19675612449645996
55,53.80981763203939,32.60940170288086,0.16683843731880188,0.17169199883937836
56,54.56251525878906,78.83206176757812,0.15985269844532013,0.14962877333164215
57,64.45009803771973,50.62981414794922,0.15656888981660208,0.15988890826702118
58,58.456556955973305,28.76582145690918,0.15696162978808084,0.17344930768013
59,37.38164774576823,17.742767333984375,0.1673124134540558,0.1880272775888443
60,19.57168706258138,29.917827606201172,0.18719937900702158,0.17317374050617218
61,26.29538631439209,26.018430709838867,0.17766266564528146,0.17649877071380615
62,20.650253295898438,17.07600975036621,0.1828068494796753,0.1896510273218155
63,13.829874356587728,16.13958740234375,0.19464658200740814,0.19188238680362701
64,13.003805796305338,15.568965911865234,0.19644386072953543,0.19314469397068024
65,13.440780639648438,14.441158294677734,0.19581971069176993,0.19537760317325592
66,13.396238327026367,13.974021911621094,0.19603163997332254,0.19579878449440002
67,12.09709644317627,14.16655445098877,0.19901665051778158,0.19493505358695984
68,13.259786287943522,13.287550926208496,0.1962240586678187,0.1976974904537201
69,17.81556447347005,16.771100997924805,0.1897702763477961,0.19041752815246582
70,13.213712692260742,15.963939666748047,0.1961811681588491,0.1927492767572403
71,13.952979723612467,15.250149726867676,0.19499127566814423,0.19379261136054993
72,27.178967475891113,40.685203552246094,0.1830210785071055,0.16476240754127502
73,37.38698228200277,24.411853790283203,0.1714127113421758,0.17897546291351318
74,44.1506716410319,49.130027770996094,0.16511838138103485,0.16012471914291382
75,44.757167180379234,81.16543579101562,0.16645715634028116,0.14910437166690826
76,54.09747060139974,50.505184173583984,0.16122306883335114,0.15951436758041382
77,45.058977127075195,42.145633697509766,0.16427911321322122,0.16450057923793793
78,39.2585506439209,93.1975326538086,0.16804300248622894,0.1459120362997055
79,80.72176615397136,30.07205581665039,0.149993767340978,0.17285975813865662
80,39.39335505167643,27.995141983032227,0.16646692156791687,0.17566253244876862
81,40.27994473775228,48.17372131347656,0.1664931078751882,0.16063328087329865
82,44.44862492879232,66.39002990722656,0.16495603819688162,0.1535990685224533
83,45.69971529642741,50.17890930175781,0.16428646445274353,0.15968281030654907
84,43.25313822428385,43.935726165771484,0.16597911218802133,0.16368314623832703
85,42.97832997639974,82.36073303222656,0.16542777915795645,0.14864809811115265
86,77.14572016398112,33.06636047363281,0.15063714484373728,0.17040899395942688
87,33.548746744791664,20.74956512451172,0.17086617648601532,0.18463675677776337
88,36.60041809082031,42.53251647949219,0.17031070590019226,0.16379386186599731
89,38.54210376739502,69.16549682617188,0.17052234212557474,0.15272340178489685
90,46.72598139444987,46.120941162109375,0.16449250280857086,0.1617615818977356
91,39.49590810139974,43.34563446044922,0.1685230185588201,0.1640930473804474
92,42.337035497029625,31.89845848083496,0.1656437615553538,0.17141109704971313
93,43.403273264567055,18.079309463500977,0.16382775704065958,0.18749800324440002
94,44.39974021911621,43.35023498535156,0.1667708953221639,0.16408401727676392
95,35.42618052164713,34.31163024902344,0.1700491557518641,0.16942571103572845
96,21.888516426086426,13.561817169189453,0.18597010771433511,0.19663111865520477
97,11.623769124348959,13.758501052856445,0.19978490471839905,0.19604814052581787
98,12.010764439900717,13.503793716430664,0.19888333479563394,0.19670113921165466
99,12.46782112121582,13.578376770019531,0.19784996410210928,0.19651107490062714
100,13.011209805806478,14.642992973327637,0.19694408774375916,0.19389858841896057
101,13.567899386088053,16.444612503051758,0.19583046436309814,0.190360426902771
102,13.649537086486816,15.971871376037598,0.19564532736937204,0.1912829577922821
103,13.54586092631022,15.298478126525879,0.1956631193558375,0.19256164133548737
104,13.289900143941244,14.785235404968262,0.19610900183518729,0.19352936744689941
105,12.731131553649902,16.605653762817383,0.19727182885011038,0.1900690644979477
106,13.657938003540039,14.210094451904297,0.19579007228215536,0.19478647410869598
107,12.722856203715006,14.136069297790527,0.19738485912481943,0.1948290318250656
108,12.922307332356771,14.601394653320312,0.19699560602506003,0.1938035935163498
109,13.140657107035318,15.069357872009277,0.19658129910628,0.192860409617424
110,13.118549982706705,15.194161415100098,0.19664795200030008,0.19255252182483673
111,13.024146715799967,15.223283767700195,0.19685439268747965,0.19247882068157196
112,12.94910717010498,15.076621055603027,0.19700743754704794,0.1927730143070221
113,12.84212589263916,14.901596069335938,0.19722295800844827,0.19308942556381226
114,12.80078919728597,14.716127395629883,0.19730320572853088,0.19342482089996338
115,12.826497395833334,14.547927856445312,0.19722170134385428,0.1937708556652069
116,12.87521998087565,14.51419734954834,0.1971085419257482,0.19380158185958862
117,12.962820370992025,14.734516143798828,0.19693346818288168,0.19330723583698273
118,13.060210863749186,16.105955123901367,0.19674254953861237,0.1906103938817978
