,train_loss,test_loss,train_score,test_score
0,249.90504455566406,230.62062072753906,0.1279383252064387,0.12914450466632843
1,248.33568318684897,230.12930297851562,0.1280396729707718,0.12917929887771606
2,247.30670674641928,227.7848358154297,0.1281081090370814,0.12934693694114685
3,245.16510518391928,226.1654052734375,0.12824841837088266,0.12946411967277527
4,243.4903310139974,223.76902770996094,0.12835997839768729,0.12963944673538208
5,241.07393900553384,222.31114196777344,0.12852229674657187,0.1297471523284912
6,239.6696980794271,220.56361389160156,0.12861756483713785,0.12987752258777618
7,238.0423380533854,217.90658569335938,0.1287289708852768,0.13007807731628418
8,236.54611206054688,217.0057373046875,0.12882883350054422,0.13014686107635498
9,233.98267110188803,214.0909881591797,0.1290114770332972,0.13037170469760895
10,232.52608744303384,214.0657958984375,0.12911060949166617,0.13037368655204773
11,231.15308125813803,211.1049346923828,0.12921132147312164,0.13060608506202698
12,228.88103739420572,210.12721252441406,0.12937224904696146,0.13068373501300812
13,227.3191121419271,207.55796813964844,0.12948724627494812,0.1308899074792862
14,224.61548868815103,204.77859497070312,0.12968585391839346,0.13111655414104462
15,222.2314910888672,201.47523498535156,0.1298615684111913,0.1313910037279129
16,217.86815897623697,199.3925018310547,0.13019529978434244,0.13156698644161224
17,217.168701171875,194.58737182617188,0.1302452782789866,0.1319819539785385
18,212.91192118326822,192.9195098876953,0.1305769830942154,0.1321290284395218
19,211.13267517089844,194.7358856201172,0.13071643312772116,0.1319686323404312
20,211.94791666666666,191.65065002441406,0.13065602878729501,0.13224193453788757
21,209.85486348470053,190.65428161621094,0.13082032899061838,0.1323312520980835
22,207.77129618326822,187.44546508789062,0.13099180161952972,0.13262298703193665
23,205.452392578125,185.65933227539062,0.1311782052119573,0.13278807699680328
24,202.7815195719401,182.92970275878906,0.13140444457530975,0.13304434716701508
25,201.3947296142578,180.5509033203125,0.13151771326859793,0.13327161967754364
26,197.69703165690103,176.80947875976562,0.1318382869164149,0.1336367428302765
27,192.61268107096353,172.15089416503906,0.13229102889696756,0.13410530984401703
28,190.3603515625,169.3624267578125,0.1324895570675532,0.13439345359802246
29,187.26724751790366,167.91265869140625,0.1327698975801468,0.1345457285642624
30,186.29254150390625,166.22979736328125,0.1328623096148173,0.13472437858581543
31,182.07343037923178,161.49102783203125,0.1332699954509735,0.13524006307125092
32,178.34296162923178,158.32455444335938,0.13362963000933328,0.13559554517269135
33,175.07357788085938,158.45867919921875,0.13395684957504272,0.13558030128479004
34,174.0066680908203,153.19345092773438,0.13407045602798462,0.1361912041902542
35,172.2964324951172,153.47703552246094,0.13423137863477072,0.13615739345550537
36,170.59686279296875,149.4374237060547,0.1344153881072998,0.13664300739765167
37,166.20935567220053,145.77691650390625,0.134883850812912,0.13709759712219238
38,162.85076904296875,143.80479431152344,0.1352488100528717,0.13734851777553558
39,160.89808654785156,141.45181274414062,0.13546516001224518,0.13765361905097961
40,158.04535929361978,137.97532653808594,0.13579386472702026,0.13811634480953217
41,155.0326690673828,133.9150390625,0.13614246249198914,0.13867589831352234
42,150.9697469075521,131.10745239257812,0.1366298794746399,0.13907551765441895
43,148.14730326334634,128.2630615234375,0.13697846233844757,0.13949161767959595
44,147.65531412760416,128.30361938476562,0.13702907164891562,0.1394856572151184
45,145.65557352701822,126.42869567871094,0.13729014992713928,0.1397663801908493
46,143.50286865234375,123.68513488769531,0.1375705897808075,0.14018674194812775
47,141.72050984700522,122.4043197631836,0.1377982795238495,0.14038698375225067
48,139.4710489908854,119.65203094482422,0.13810495535532633,0.14082656800746918
49,136.64572397867838,113.03933715820312,0.13849211732546488,0.14193744957447052
50,130.16216786702475,110.47352600097656,0.1394173006216685,0.14239096641540527
51,126.74727884928386,105.40779876708984,0.13994275033473969,0.14332684874534607
52,124.46415201822917,108.6926040649414,0.1402588834365209,0.14271345734596252
53,125.81718444824219,106.14427185058594,0.14007173975308737,0.14318710565567017
54,123.24523162841797,103.54290771484375,0.14047331114610037,0.14368578791618347
55,120.62940979003906,100.90675354003906,0.14089280863602957,0.14420770108699799
56,117.9814682006836,98.36199188232422,0.14132949709892273,0.1447274535894394
57,115.34105936686198,95.58563995361328,0.1417779972155889,0.14531606435775757
58,113.57391611735027,92.92253112792969,0.1420694241921107,0.14590077102184296
59,112.82071685791016,94.56494140625,0.14218972126642862,0.14553764462471008
60,111.65727996826172,91.98336791992188,0.1424249211947123,0.14611214399337769
61,109.06534322102864,89.37969970703125,0.14289750158786774,0.14671286940574646
62,106.45248413085938,86.76480865478516,0.1433888574441274,0.14733918011188507
63,101.06292724609375,80.04093933105469,0.1444973200559616,0.14906731247901917
64,97.12262471516927,72.94488525390625,0.14527884622414908,0.15110555291175842
65,90.05661010742188,70.46541595458984,0.14687426884969076,0.15187837183475494
66,87.54897562662761,67.97732543945312,0.1474809298912684,0.1526898294687271
67,85.03955078125,65.44038391113281,0.1481113483508428,0.15355731546878815
68,82.48496754964192,62.873756408691406,0.14877846837043762,0.15447989106178284
69,79.90659840901692,60.29191207885742,0.14947971204916635,0.15545785427093506
70,77.31319936116536,57.707271575927734,0.15021583437919617,0.15649177134037018
71,74.71956125895183,55.11919403076172,0.15098519126574197,0.15758799016475677
72,72.12648264567058,52.54297637939453,0.15179021656513214,0.1587459295988083
73,69.54396565755208,50.18112564086914,0.15263107419013977,0.15987247228622437
74,67.18672434488933,47.6657829284668,0.15343504150708517,0.16114751994609833
75,64.66642506917317,45.16548156738281,0.1543375700712204,0.16250133514404297
76,62.737300872802734,44.463294982910156,0.15501866241296133,0.1628984957933426
77,61.49279912312826,42.10748291015625,0.15554070472717285,0.16428831219673157
78,59.11448542277018,45.05173873901367,0.15650045375029245,0.16256509721279144
79,62.189659118652344,42.69913101196289,0.15526792407035828,0.16393038630485535
80,59.67991511027018,40.225772857666016,0.15626966953277588,0.16546817123889923
81,57.24809900919596,37.72407150268555,0.15729262928167978,0.16714458167552948
82,54.66555531819662,35.215206146240234,0.15844512482484183,0.16896484792232513
83,52.08062871297201,32.71675109863281,0.15967374543348947,0.1709384322166443
84,48.66203053792318,29.084199905395508,0.16149531801541647,0.17413872480392456
85,45.76127370198568,26.817880630493164,0.16304870446523032,0.17637361586093903
86,43.31123733520508,24.64423942565918,0.16452904045581818,0.17871083319187164
87,40.86509641011556,22.602554321289062,0.16612042983373007,0.18108542263507843
88,38.43805376688639,20.734153747558594,0.16782532135645548,0.1834125965833664
89,36.04840660095215,19.085033416748047,0.16964283088843027,0.1855953186750412
90,33.72407913208008,17.710193634033203,0.17156163354714712,0.18752756714820862
91,31.50061289469401,16.6554012298584,0.17355235914389291,0.1891094148159027
92,29.41541035970052,15.93786907196045,0.17556182046731314,0.19026049971580505
93,25.801296869913738,15.686506271362305,0.1796487420797348,0.1905282735824585
94,23.168833414713543,15.979025840759277,0.18207858006159464,0.19004635512828827
95,21.990214029947918,16.36404800415039,0.1834398259719213,0.1894736886024475
96,21.01119836171468,16.792217254638672,0.1846411476532618,0.18889757990837097
97,20.21123282114665,17.21956443786621,0.1856900155544281,0.1883719563484192
98,19.570930163065594,17.179466247558594,0.18658516307671866,0.18856504559516907
99,19.283016204833984,15.680610656738281,0.18709567189216614,0.19116109609603882
100,21.450006167093914,15.853179931640625,0.18467948834101358,0.19094793498516083
101,20.99584674835205,16.080955505371094,0.18526612718900046,0.19063250720500946
102,20.549383481343586,16.34391212463379,0.18582906325658163,0.1902529001235962
103,20.133042971293133,16.62312126159668,0.18634777267773947,0.18984468281269073
104,19.759512583414715,16.901531219482422,0.18681349356969199,0.18943777680397034
105,20.861980438232422,15.175704002380371,0.18522211412588754,0.19242346286773682
106,20.755427360534668,15.74248218536377,0.18602006137371063,0.19137965142726898
107,22.81879488627116,15.972735404968262,0.18274790545304617,0.1909940093755722
108,20.5407657623291,16.315183639526367,0.18594269454479218,0.1904192566871643
109,20.078500111897785,16.64674949645996,0.186475137869517,0.18988677859306335
110,19.534948984781902,17.321300506591797,0.1871562252442042,0.18884755671024323
111,18.994113286336262,16.121232986450195,0.18778067330519357,0.1907506287097931
112,19.73108196258545,17.834606170654297,0.18705893556276956,0.18809489905834198
113,18.563764572143555,18.011362075805664,0.18832452595233917,0.18784202635288239
114,18.42939345041911,16.453420639038086,0.1884978711605072,0.19020019471645355
115,19.953044255574543,16.555713653564453,0.18661538263161978,0.19003425538539886
116,19.82151699066162,15.040632247924805,0.18677312632401785,0.19305163621902466
117,27.353195190429688,14.931052207946777,0.1784163365761439,0.19322434067726135
118,26.770325978597004,14.796249389648438,0.1790862778822581,0.19342321157455444
119,25.917347590128582,15.291950225830078,0.18004513283570608,0.19221831858158112
120,21.755818684895832,15.678051948547363,0.18459871908028921,0.19150257110595703
121,20.98922856648763,16.112529754638672,0.1854431132475535,0.19074897468090057
122,20.92230765024821,16.594594955444336,0.18543104827404022,0.1899576038122177
123,19.672750155131023,18.506305694580078,0.18696468075116476,0.1871398240327835
124,18.06961441040039,17.102161407470703,0.18897469838460287,0.18916766345500946
125,20.608554204305012,17.408519744873047,0.18555887043476105,0.1887045055627823
126,18.942068417867024,17.76415252685547,0.18783752620220184,0.18818527460098267
127,18.609912872314453,18.05735206604004,0.18826800088087717,0.18776486814022064
128,18.387508710225422,18.274524688720703,0.1885543962319692,0.18745948374271393
129,18.230904897054035,14.914957046508789,0.18875897427399954,0.1931152492761612
130,21.396915753682453,18.47745704650879,0.18571234742800394,0.18717965483665466
131,18.085497856140137,18.556663513183594,0.18895317117373148,0.1870708465576172
132,18.046462376912434,18.553943634033203,0.18899928033351898,0.18707457184791565
133,18.049104690551758,17.781003952026367,0.18899865945180258,0.18816028535366058
134,18.190293947855633,17.6678466796875,0.18888540069262186,0.188325434923172
135,18.730721473693848,17.18890953063965,0.1881060153245926,0.18903787434101105
136,19.168543179829914,17.12752914428711,0.18755830824375153,0.1891327053308487
137,19.21970844268799,17.120807647705078,0.18749711414178213,0.18914422392845154
138,19.21919822692871,17.153663635253906,0.18749962747097015,0.18909545242786407
139,19.180997530619305,17.214191436767578,0.18754834433396658,0.1890048086643219
140,19.118242581685383,17.233596801757812,0.18762677907943726,0.18897408246994019
141,19.060280799865723,17.39220428466797,0.18770113587379456,0.18873198330402374
142,18.658265749613445,18.85664176940918,0.18833073476950327,0.18667051196098328
143,17.855486551920574,16.060832977294922,0.1892612228790919,0.19084393978118896
144,20.515628496805828,16.074867248535156,0.1859599898258845,0.1908199042081833
145,20.472030639648438,16.161846160888672,0.1860137383143107,0.19067373871803284
146,20.331451733907063,15.199506759643555,0.18617822229862213,0.1927945464849472
147,27.746245702107746,14.91674518585205,0.17806698878606161,0.19324654340744019
148,26.684820810953777,14.715325355529785,0.1791847844918569,0.19350303709506989
149,24.648023923238117,14.899762153625488,0.18152950207392374,0.1930115818977356
150,22.48723538716634,17.3177490234375,0.1838727742433548,0.18884798884391785
151,18.968996047973633,17.832271575927734,0.1878214826186498,0.18809112906455994
152,18.54699643452962,18.241703033447266,0.1883524109919866,0.18751004338264465
153,18.24985631306966,18.537628173828125,0.18873548010985056,0.1871006041765213
154,18.05268383026123,18.724925994873047,0.18899406989415488,0.1868455708026886
155,17.934879620869953,18.81715202331543,0.18915016949176788,0.18672068417072296
156,17.87924321492513,18.832441329956055,0.18922409415245056,0.18669921159744263
157,17.871559143066406,18.790300369262695,0.18923373520374298,0.18675458431243896
158,17.899709065755207,18.708349227905273,0.1891950418551763,0.1868637353181839
159,17.953306833902996,18.605772018432617,0.18912219007809958,0.1870015412569046
160,18.021746317545574,18.492929458618164,0.18902992208798727,0.18715450167655945
161,18.099066734313965,18.380887985229492,0.18892616033554077,0.18730777502059937
162,18.177656491597492,18.27667808532715,0.18882143994172415,0.18745176494121552
163,18.345494588216145,18.200162887573242,0.18858491877714792,0.18755841255187988
164,18.30500857035319,18.153600692749023,0.1886550337076187,0.18762066960334778
165,18.33561611175537,18.120515823364258,0.18861525257428488,0.18767106533050537
166,18.364265124003094,18.05512809753418,0.18857568502426147,0.18776671588420868
167,18.4003168741862,18.054401397705078,0.1885316769282023,0.1877659112215042
168,18.412469546000164,18.032018661499023,0.1885155290365219,0.18779368698596954
169,18.958794593811035,22.907175064086914,0.18780427177747092,0.18178647756576538
170,16.340726852416992,22.432374954223633,0.19139128923416138,0.18231870234012604
171,16.402455647786457,21.758941650390625,0.19130497177441916,0.18308474123477936
172,16.558069229125977,17.621660232543945,0.19107968111832938,0.18838921189308167
173,18.82300059000651,17.169221878051758,0.18797404070695242,0.18906286358833313
174,19.229790687561035,16.897951126098633,0.18747138480345407,0.18948017060756683
175,19.490397135416668,16.7619571685791,0.18715740740299225,0.189694344997406
176,19.62099774678548,16.725780487060547,0.18700465063254038,0.18975317478179932
177,19.645368258158367,16.763023376464844,0.18697901566823324,0.1896963268518448
178,19.59065341949463,16.852890014648438,0.1870475858449936,0.18955722451210022
179,19.483616828918457,16.978145599365234,0.1871785670518875,0.18936428427696228
180,19.335867563883465,17.12401008605957,0.1873633712530136,0.1891416758298874
181,19.18635622660319,17.27775001525879,0.18754718204339346,0.1889096200466156
182,19.03793780008952,17.42889404296875,0.18773092329502106,0.18868400156497955
183,18.899766604105633,17.569334030151367,0.18790329496065775,0.1884765625
184,18.779199600219727,17.693296432495117,0.18805462618668875,0.1882951557636261
185,18.675859133402508,17.816131591796875,0.18818535407384238,0.1881180703639984
186,18.592344601949055,17.89849853515625,0.18829157451788583,0.18799911439418793
187,18.53384304046631,17.941221237182617,0.1883644312620163,0.18793614208698273
188,18.509238243103027,17.296024322509766,0.1883906970421473,0.18887856602668762
189,19.049257278442383,17.356735229492188,0.18770843744277954,0.18878686428070068
190,18.99163023630778,14.86076831817627,0.18777964015801749,0.1931021809577942
191,23.36152998606364,14.91199016571045,0.18281002342700958,0.1929892897605896
192,23.05076249440511,15.034932136535645,0.18316644430160522,0.19272969663143158
193,22.539558092753094,15.23888874053955,0.18373403449853262,0.1923227459192276
194,21.927899996439617,15.523691177368164,0.18440654377142587,0.1917874664068222
195,21.289409319559734,15.873823165893555,0.18511080741882324,0.19116507470607758
196,20.677087783813477,16.26302146911621,0.1857959677775701,0.1905071884393692
197,20.12397066752116,16.661151885986328,0.18642873068650564,0.1898629516363144
198,19.648078600565594,17.040191650390625,0.1869868040084839,0.18927153944969177
