{
  "data": {
    "date": "2024-10-21",
    "kpis": [
      {
        "name": "Trust Framework",
        "mergeRequests": {
          "02/2022": {
            "created": 3,
            "merged": 2,
            "closed": 1,
            "open": 0
          },
          "03/2022": {
            "created": 9,
            "merged": 4,
            "closed": 3,
            "open": 2
          },
          "04/2022": {
            "created": 14,
            "merged": 7,
            "closed": 4,
            "open": 5
          },
          "05/2022": {
            "created": 6,
            "merged": 1,
            "closed": 1,
            "open": 9
          },
          "06/2022": {
            "created": 15,
            "merged": 13,
            "closed": 4,
            "open": 7
          },
          "07/2022": {
            "created": 5,
            "merged": 0,
            "closed": 0,
            "open": 12
          },
          "08/2022": {
            "created": 4,
            "merged": 3,
            "closed": 2,
            "open": 11
          },
          "09/2022": {
            "created": 4,
            "merged": 2,
            "closed": 4,
            "open": 9
          },
          "10/2022": {
            "created": 32,
            "merged": 30,
            "closed": 5,
            "open": 6
          },
          "11/2022": {
            "created": 16,
            "merged": 10,
            "closed": 2,
            "open": 10
          },
          "12/2022": {
            "created": 0,
            "merged": 0,
            "closed": 0,
            "open": 10
          },
          "01/2023": {
            "created": 0,
            "merged": 5,
            "closed": 0,
            "open": 5
          },
          "02/2023": {
            "created": 1,
            "merged": 0,
            "closed": 0,
            "open": 6
          },
          "03/2023": {
            "created": 1,
            "merged": 0,
            "closed": 0,
            "open": 7
          },
          "04/2023": {
            "created": 7,
            "merged": 2,
            "closed": 1,
            "open": 11
          },
          "05/2023": {
            "created": 5,
            "merged": 1,
            "closed": 2,
            "open": 13
          },
          "06/2023": {
            "created": 0,
            "merged": 0,
            "closed": 4,
            "open": 9
          },
          "07/2023": {
            "created": 2,
            "merged": 2,
            "closed": 0,
            "open": 9
          },
          "08/2023": {
            "created": 0,
            "merged": 0,
            "closed": 0,
            "open": 9
          },
          "09/2023": {
            "created": 1,
            "merged": 0,
            "closed": 0,
            "open": 10
          },
          "10/2023": {
            "created": 0,
            "merged": 0,
            "closed": 0,
            "open": 10
          },
          "11/2023": {
            "created": 0,
            "merged": 0,
            "closed": 1,
            "open": 9
          }
        },
        "issues": {
          "02/2022": {
            "created": 2,
            "merged": 0,
            "closed": 1,
            "open": 0
          },
          "03/2022": {
            "created": 15,
            "merged": 0,
            "closed": 8,
            "open": 7
          },
          "04/2022": {
            "created": 5,
            "merged": 0,
            "closed": 5,
            "open": 7
          },
          "05/2022": {
            "created": 2,
            "merged": 0,
            "closed": 2,
            "open": 7
          },
          "06/2022": {
            "created": 6,
            "merged": 0,
            "closed": 8,
            "open": 5
          },
          "07/2022": {
            "created": 24,
            "merged": 0,
            "closed": 3,
            "open": 26
          },
          "08/2022": {
            "created": 2,
            "merged": 0,
            "closed": 0,
            "open": 28
          },
          "09/2022": {
            "created": 5,
            "merged": 0,
            "closed": 3,
            "open": 30
          },
          "10/2022": {
            "created": 6,
            "merged": 0,
            "closed": 7,
            "open": 29
          },
          "11/2022": {
            "created": 5,
            "merged": 0,
            "closed": 27,
            "open": 7
          },
          "12/2022": {
            "created": 1,
            "merged": 0,
            "closed": 0,
            "open": 8
          },
          "01/2023": {
            "created": 1,
            "merged": 0,
            "closed": 3,
            "open": 6
          },
          "02/2023": {
            "created": 2,
            "merged": 0,
            "closed": 0,
            "open": 8
          },
          "03/2023": {
            "created": 1,
            "merged": 0,
            "closed": 1,
            "open": 8
          },
          "04/2023": {
            "created": 3,
            "merged": 0,
            "closed": 0,
            "open": 11
          },
          "05/2023": {
            "created": 2,
            "merged": 0,
            "closed": 2,
            "open": 11
          },
          "06/2023": {
            "created": 1,
            "merged": 0,
            "closed": 1,
            "open": 11
          },
          "07/2023": {
            "created": 0,
            "merged": 0,
            "closed": 1,
            "open": 10
          },
          "08/2023": {
            "created": 0,
            "merged": 0,
            "closed": 1,
            "open": 9
          },
          "09/2023": {
            "created": 2,
            "merged": 0,
            "closed": 1,
            "open": 10
          },
          "10/2023": {
            "created": 3,
            "merged": 0,
            "closed": 0,
            "open": 13
          },
          "11/2023": {
            "created": 0,
            "merged": 0,
            "closed": 1,
            "open": 12
          }
        }
      },
      {
        "name": "Architecture Document",
        "mergeRequests": {
          "02/2020": {
            "created": 7,
            "merged": 3,
            "closed": 2,
            "open": 0
          },
          "03/2020": {
            "created": 4,
            "merged": 5,
            "closed": 1,
            "open": 0
          },
          "04/2020": {
            "created": 3,
            "merged": 0,
            "closed": 0,
            "open": 3
          },
          "05/2020": {
            "created": 0,
            "merged": 0,
            "closed": 0,
            "open": 3
          },
          "06/2020": {
            "created": 0,
            "merged": 0,
            "closed": 0,
            "open": 3
          },
          "07/2020": {
            "created": 5,
            "merged": 3,
            "closed": 0,
            "open": 5
          },
          "08/2020": {
            "created": 8,
            "merged": 6,
            "closed": 3,
            "open": 4
          },
          "09/2020": {
            "created": 12,
            "merged": 0,
            "closed": 4,
            "open": 12
          },
          "10/2020": {
            "created": 7,
            "merged": 1,
            "closed": 3,
            "open": 15
          },
          "11/2020": {
            "created": 1,
            "merged": 1,
            "closed": 0,
            "open": 15
          },
          "12/2020": {
            "created": 17,
            "merged": 1,
            "closed": 8,
            "open": 23
          },
          "01/2021": {
            "created": 5,
            "merged": 2,
            "closed": 2,
            "open": 24
          },
          "02/2021": {
            "created": 15,
            "merged": 2,
            "closed": 2,
            "open": 35
          },
          "03/2021": {
            "created": 14,
            "merged": 16,
            "closed": 9,
            "open": 24
          },
          "04/2021": {
            "created": 25,
            "merged": 14,
            "closed": 8,
            "open": 27
          },
          "05/2021": {
            "created": 37,
            "merged": 33,
            "closed": 11,
            "open": 20
          },
          "06/2021": {
            "created": 131,
            "merged": 111,
            "closed": 24,
            "open": 16
          },
          "07/2021": {
            "created": 3,
            "merged": 3,
            "closed": 6,
            "open": 10
          },
          "08/2021": {
            "created": 10,
            "merged": 4,
            "closed": 2,
            "open": 14
          },
          "09/2021": {
            "created": 48,
            "merged": 45,
            "closed": 9,
            "open": 8
          },
          "10/2021": {
            "created": 13,
            "merged": 5,
            "closed": 0,
            "open": 16
          },
          "11/2021": {
            "created": 7,
            "merged": 9,
            "closed": 0,
            "open": 14
          },
          "12/2021": {
            "created": 10,
            "merged": 15,
            "closed": 2,
            "open": 7
          },
          "01/2022": {
            "created": 6,
            "merged": 0,
            "closed": 1,
            "open": 12
          },
          "02/2022": {
            "created": 4,
            "merged": 6,
            "closed": 1,
            "open": 9
          },
          "03/2022": {
            "created": 10,
            "merged": 12,
            "closed": 5,
            "open": 2
          },
          "04/2022": {
            "created": 26,
            "merged": 5,
            "closed": 0,
            "open": 23
          },
          "05/2022": {
            "created": 2,
            "merged": 15,
            "closed": 2,
            "open": 8
          },
          "06/2022": {
            "created": 7,
            "merged": 2,
            "closed": 3,
            "open": 10
          },
          "07/2022": {
            "created": 8,
            "merged": 7,
            "closed": 3,
            "open": 8
          },
          "08/2022": {
            "created": 4,
            "merged": 5,
            "closed": 0,
            "open": 7
          },
          "09/2022": {
            "created": 6,
            "merged": 5,
            "closed": 0,
            "open": 8
          },
          "10/2022": {
            "created": 12,
            "merged": 9,
            "closed": 4,
            "open": 7
          },
          "11/2022": {
            "created": 5,
            "merged": 8,
            "closed": 2,
            "open": 2
          },
          "12/2022": {
            "created": 0,
            "merged": 0,
            "closed": 0,
            "open": 2
          },
          "01/2023": {
            "created": 0,
            "merged": 0,
            "closed": 0,
            "open": 2
          },
          "02/2023": {
            "created": 3,
            "merged": 0,
            "closed": 0,
            "open": 5
          },
          "03/2023": {
            "created": 1,
            "merged": 4,
            "closed": 1,
            "open": 1
          },
          "04/2023": {
            "created": 8,
            "merged": 2,
            "closed": 1,
            "open": 6
          },
          "05/2023": {
            "created": 4,
            "merged": 6,
            "closed": 0,
            "open": 4
          },
          "06/2023": {
            "created": 11,
            "merged": 10,
            "closed": 1,
            "open": 4
          },
          "07/2023": {
            "created": 9,
            "merged": 5,
            "closed": 1,
            "open": 7
          },
          "08/2023": {
            "created": 5,
            "merged": 2,
            "closed": 0,
            "open": 10
          },
          "09/2023": {
            "created": 7,
            "merged": 4,
            "closed": 0,
            "open": 13
          },
          "10/2023": {
            "created": 21,
            "merged": 24,
            "closed": 9,
            "open": 1
          },
          "11/2023": {
            "created": 2,
            "merged": 1,
            "closed": 1,
            "open": 1
          },
          "12/2023": {
            "created": 1,
            "merged": 0,
            "closed": 0,
            "open": 2
          },
          "01/2024": {
            "created": 0,
            "merged": 1,
            "closed": 0,
            "open": 1
          },
          "02/2024": {
            "created": 0,
            "merged": 0,
            "closed": 0,
            "open": 1
          },
          "03/2024": {
            "created": 1,
            "merged": 0,
            "closed": 0,
            "open": 2
          },
          "04/2024": {
            "created": 12,
            "merged": 12,
            "closed": 0,
            "open": 2
          },
          "05/2024": {
            "created": 15,
            "merged": 15,
            "closed": 1,
            "open": 1
          },
          "06/2024": {
            "created": 1,
            "merged": 0,
            "closed": 0,
            "open": 2
          },
          "07/2024": {
            "created": 0,
            "merged": 1,
            "closed": 0,
            "open": 1
          },
          "08/2024": {
            "created": 2,
            "merged": 0,
            "closed": 0,
            "open": 3
          },
          "09/2024": {
            "created": 0,
            "merged": 1,
            "closed": 0,
            "open": 2
          },
          "10/2024": {
            "created": 2,
            "merged": 1,
            "closed": 0,
            "open": 3
          }
        },
        "issues": {
          "02/2020": {
            "created": 10,
            "merged": 0,
            "closed": 2,
            "open": 0
          },
          "03/2020": {
            "created": 10,
            "merged": 0,
            "closed": 2,
            "open": 8
          },
          "04/2020": {
            "created": 3,
            "merged": 0,
            "closed": 0,
            "open": 11
          },
          "05/2020": {
            "created": 0,
            "merged": 0,
            "closed": 0,
            "open": 11
          },
          "06/2020": {
            "created": 0,
            "merged": 0,
            "closed": 0,
            "open": 11
          },
          "07/2020": {
            "created": 0,
            "merged": 0,
            "closed": 0,
            "open": 11
          },
          "08/2020": {
            "created": 0,
            "merged": 0,
            "closed": 3,
            "open": 8
          },
          "09/2020": {
            "created": 3,
            "merged": 0,
            "closed": 2,
            "open": 9
          },
          "10/2020": {
            "created": 3,
            "merged": 0,
            "closed": 2,
            "open": 10
          },
          "11/2020": {
            "created": 0,
            "merged": 0,
            "closed": 0,
            "open": 10
          },
          "12/2020": {
            "created": 3,
            "merged": 0,
            "closed": 13,
            "open": 0
          },
          "01/2021": {
            "created": 7,
            "merged": 0,
            "closed": 3,
            "open": 4
          },
          "02/2021": {
            "created": 14,
            "merged": 0,
            "closed": 5,
            "open": 13
          },
          "03/2021": {
            "created": 5,
            "merged": 0,
            "closed": 14,
            "open": 4
          },
          "04/2021": {
            "created": 77,
            "merged": 0,
            "closed": 7,
            "open": 74
          },
          "05/2021": {
            "created": 8,
            "merged": 0,
            "closed": 41,
            "open": 41
          },
          "06/2021": {
            "created": 13,
            "merged": 0,
            "closed": 40,
            "open": 14
          },
          "07/2021": {
            "created": 8,
            "merged": 0,
            "closed": 8,
            "open": 14
          },
          "08/2021": {
            "created": 4,
            "merged": 0,
            "closed": 10,
            "open": 8
          },
          "09/2021": {
            "created": 13,
            "merged": 0,
            "closed": 11,
            "open": 10
          },
          "10/2021": {
            "created": 5,
            "merged": 0,
            "closed": 5,
            "open": 10
          },
          "11/2021": {
            "created": 5,
            "merged": 0,
            "closed": 2,
            "open": 13
          },
          "12/2021": {
            "created": 0,
            "merged": 0,
            "closed": 10,
            "open": 3
          },
          "01/2022": {
            "created": 1,
            "merged": 0,
            "closed": 1,
            "open": 3
          },
          "02/2022": {
            "created": 8,
            "merged": 0,
            "closed": 6,
            "open": 5
          },
          "03/2022": {
            "created": 4,
            "merged": 0,
            "closed": 3,
            "open": 6
          },
          "04/2022": {
            "created": 7,
            "merged": 0,
            "closed": 5,
            "open": 8
          },
          "05/2022": {
            "created": 1,
            "merged": 0,
            "closed": 4,
            "open": 5
          },
          "06/2022": {
            "created": 8,
            "merged": 0,
            "closed": 6,
            "open": 7
          },
          "07/2022": {
            "created": 1,
            "merged": 0,
            "closed": 5,
            "open": 3
          },
          "08/2022": {
            "created": 2,
            "merged": 0,
            "closed": 3,
            "open": 2
          },
          "09/2022": {
            "created": 5,
            "merged": 0,
            "closed": 4,
            "open": 3
          },
          "10/2022": {
            "created": 1,
            "merged": 0,
            "closed": 7,
            "open": 0
          },
          "11/2022": {
            "created": 2,
            "merged": 0,
            "closed": 1,
            "open": 1
          },
          "12/2022": {
            "created": 1,
            "merged": 0,
            "closed": 0,
            "open": 2
          },
          "01/2023": {
            "created": 0,
            "merged": 0,
            "closed": 0,
            "open": 2
          },
          "02/2023": {
            "created": 11,
            "merged": 0,
            "closed": 0,
            "open": 13
          },
          "03/2023": {
            "created": 6,
            "merged": 0,
            "closed": 2,
            "open": 17
          },
          "04/2023": {
            "created": 4,
            "merged": 0,
            "closed": 1,
            "open": 20
          },
          "05/2023": {
            "created": 2,
            "merged": 0,
            "closed": 4,
            "open": 18
          },
          "06/2023": {
            "created": 3,
            "merged": 0,
            "closed": 4,
            "open": 17
          },
          "07/2023": {
            "created": 1,
            "merged": 0,
            "closed": 9,
            "open": 9
          },
          "08/2023": {
            "created": 5,
            "merged": 0,
            "closed": 1,
            "open": 13
          },
          "09/2023": {
            "created": 1,
            "merged": 0,
            "closed": 1,
            "open": 13
          },
          "10/2023": {
            "created": 3,
            "merged": 0,
            "closed": 19,
            "open": 0
          },
          "11/2023": {
            "created": 3,
            "merged": 0,
            "closed": 1,
            "open": 2
          },
          "12/2023": {
            "created": 1,
            "merged": 0,
            "closed": 0,
            "open": 3
          },
          "01/2024": {
            "created": 0,
            "merged": 0,
            "closed": 0,
            "open": 3
          },
          "02/2024": {
            "created": 0,
            "merged": 0,
            "closed": 0,
            "open": 3
          },
          "03/2024": {
            "created": 0,
            "merged": 0,
            "closed": 0,
            "open": 3
          },
          "04/2024": {
            "created": 4,
            "merged": 0,
            "closed": 3,
            "open": 4
          },
          "05/2024": {
            "created": 18,
            "merged": 0,
            "closed": 22,
            "open": 0
          },
          "06/2024": {
            "created": 0,
            "merged": 0,
            "closed": 0,
            "open": 0
          },
          "07/2024": {
            "created": 1,
            "merged": 0,
            "closed": 1,
            "open": 0
          },
          "08/2024": {
            "created": 1,
            "merged": 0,
            "closed": 0,
            "open": 1
          },
          "09/2024": {
            "created": 1,
            "merged": 0,
            "closed": 0,
            "open": 2
          },
          "10/2024": {
            "created": 0,
            "merged": 0,
            "closed": 2,
            "open": 0
          }
        }
      },
      {
        "name": "Identity and Access Management",
        "mergeRequests": {
          "03/2022": {
            "created": 2,
            "merged": 0,
            "closed": 0,
            "open": 0
          },
          "04/2022": {
            "created": 0,
            "merged": 1,
            "closed": 0,
            "open": 0
          },
          "05/2022": {
            "created": 5,
            "merged": 1,
            "closed": 3,
            "open": 1
          },
          "06/2022": {
            "created": 1,
            "merged": 0,
            "closed": 0,
            "open": 2
          },
          "07/2022": {
            "created": 0,
            "merged": 1,
            "closed": 0,
            "open": 1
          },
          "08/2022": {
            "created": 2,
            "merged": 1,
            "closed": 0,
            "open": 2
          },
          "09/2022": {
            "created": 0,
            "merged": 2,
            "closed": 0,
            "open": 0
          },
          "10/2022": {
            "created": 9,
            "merged": 4,
            "closed": 4,
            "open": 1
          },
          "11/2022": {
            "created": 2,
            "merged": 0,
            "closed": 0,
            "open": 3
          },
          "12/2022": {
            "created": 5,
            "merged": 4,
            "closed": 2,
            "open": 2
          },
          "01/2023": {
            "created": 0,
            "merged": 1,
            "closed": 0,
            "open": 1
          },
          "02/2023": {
            "created": 2,
            "merged": 0,
            "closed": 0,
            "open": 3
          },
          "03/2023": {
            "created": 0,
            "merged": 1,
            "closed": 0,
            "open": 2
          },
          "04/2023": {
            "created": 0,
            "merged": 1,
            "closed": 0,
            "open": 1
          },
          "05/2023": {
            "created": 0,
            "merged": 0,
            "closed": 0,
            "open": 1
          },
          "06/2023": {
            "created": 1,
            "merged": 0,
            "closed": 0,
            "open": 2
          },
          "07/2023": {
            "created": 1,
            "merged": 0,
            "closed": 0,
            "open": 3
          },
          "08/2023": {
            "created": 0,
            "merged": 0,
            "closed": 0,
            "open": 3
          },
          "09/2023": {
            "created": 2,
            "merged": 1,
            "closed": 0,
            "open": 4
          },
          "10/2023": {
            "created": 0,
            "merged": 0,
            "closed": 0,
            "open": 4
          },
          "11/2023": {
            "created": 0,
            "merged": 1,
            "closed": 0,
            "open": 3
          },
          "12/2023": {
            "created": 1,
            "merged": 0,
            "closed": 3,
            "open": 1
          },
          "01/2024": {
            "created": 0,
            "merged": 0,
            "closed": 0,
            "open": 1
          },
          "02/2024": {
            "created": 1,
            "merged": 2,
            "closed": 0,
            "open": 0
          },
          "03/2024": {
            "created": 0,
            "merged": 0,
            "closed": 0,
            "open": 0
          },
          "04/2024": {
            "created": 6,
            "merged": 1,
            "closed": 0,
            "open": 5
          },
          "05/2024": {
            "created": 0,
            "merged": 2,
            "closed": 0,
            "open": 3
          },
          "06/2024": {
            "created": 4,
            "merged": 0,
            "closed": 1,
            "open": 6
          },
          "07/2024": {
            "created": 1,
            "merged": 3,
            "closed": 3,
            "open": 1
          },
          "08/2024": {
            "created": 1,
            "merged": 1,
            "closed": 0,
            "open": 1
          },
          "09/2024": {
            "created": 4,
            "merged": 0,
            "closed": 4,
            "open": 1
          }
        },
        "issues": {
          "03/2022": {
            "created": 6,
            "merged": 0,
            "closed": 0,
            "open": 0
          },
          "04/2022": {
            "created": 3,
            "merged": 0,
            "closed": 1,
            "open": 2
          },
          "05/2022": {
            "created": 5,
            "merged": 0,
            "closed": 7,
            "open": 0
          },
          "06/2022": {
            "created": 2,
            "merged": 0,
            "closed": 0,
            "open": 2
          },
          "07/2022": {
            "created": 3,
            "merged": 0,
            "closed": 5,
            "open": 0
          },
          "08/2022": {
            "created": 2,
            "merged": 0,
            "closed": 1,
            "open": 1
          },
          "09/2022": {
            "created": 5,
            "merged": 0,
            "closed": 5,
            "open": 1
          },
          "10/2022": {
            "created": 16,
            "merged": 0,
            "closed": 1,
            "open": 16
          },
          "11/2022": {
            "created": 4,
            "merged": 0,
            "closed": 0,
            "open": 20
          },
          "12/2022": {
            "created": 1,
            "merged": 0,
            "closed": 0,
            "open": 21
          },
          "01/2023": {
            "created": 6,
            "merged": 0,
            "closed": 0,
            "open": 27
          },
          "02/2023": {
            "created": 9,
            "merged": 0,
            "closed": 4,
            "open": 32
          },
          "03/2023": {
            "created": 1,
            "merged": 0,
            "closed": 2,
            "open": 31
          },
          "04/2023": {
            "created": 0,
            "merged": 0,
            "closed": 3,
            "open": 28
          },
          "05/2023": {
            "created": 0,
            "merged": 0,
            "closed": 0,
            "open": 28
          },
          "06/2023": {
            "created": 2,
            "merged": 0,
            "closed": 0,
            "open": 30
          },
          "07/2023": {
            "created": 5,
            "merged": 0,
            "closed": 6,
            "open": 29
          },
          "08/2023": {
            "created": 1,
            "merged": 0,
            "closed": 1,
            "open": 29
          },
          "09/2023": {
            "created": 1,
            "merged": 0,
            "closed": 0,
            "open": 30
          },
          "10/2023": {
            "created": 2,
            "merged": 0,
            "closed": 4,
            "open": 28
          },
          "11/2023": {
            "created": 1,
            "merged": 0,
            "closed": 11,
            "open": 18
          },
          "12/2023": {
            "created": 2,
            "merged": 0,
            "closed": 0,
            "open": 20
          },
          "01/2024": {
            "created": 0,
            "merged": 0,
            "closed": 10,
            "open": 10
          },
          "02/2024": {
            "created": 0,
            "merged": 0,
            "closed": 0,
            "open": 10
          },
          "03/2024": {
            "created": 2,
            "merged": 0,
            "closed": 0,
            "open": 12
          },
          "04/2024": {
            "created": 1,
            "merged": 0,
            "closed": 0,
            "open": 13
          },
          "05/2024": {
            "created": 2,
            "merged": 0,
            "closed": 0,
            "open": 15
          },
          "06/2024": {
            "created": 1,
            "merged": 0,
            "closed": 1,
            "open": 15
          },
          "07/2024": {
            "created": 1,
            "merged": 0,
            "closed": 1,
            "open": 15
          },
          "08/2024": {
            "created": 1,
            "merged": 0,
            "closed": 0,
            "open": 16
          },
          "09/2024": {
            "created": 0,
            "merged": 0,
            "closed": 16,
            "open": 0
          }
        }
      },
      {
        "name": "Policy Rules and Label",
        "mergeRequests": {
          "07/2021": {
            "created": 6,
            "merged": 0,
            "closed": 0,
            "open": 0
          },
          "08/2021": {
            "created": 8,
            "merged": 5,
            "closed": 1,
            "open": 2
          },
          "09/2021": {
            "created": 0,
            "merged": 1,
            "closed": 1,
            "open": 0
          },
          "10/2021": {
            "created": 0,
            "merged": 0,
            "closed": 0,
            "open": 0
          },
          "11/2021": {
            "created": 0,
            "merged": 0,
            "closed": 0,
            "open": 0
          },
          "12/2021": {
            "created": 0,
            "merged": 0,
            "closed": 0,
            "open": 0
          },
          "01/2022": {
            "created": 0,
            "merged": 0,
            "closed": 0,
            "open": 0
          },
          "02/2022": {
            "created": 0,
            "merged": 0,
            "closed": 0,
            "open": 0
          },
          "03/2022": {
            "created": 0,
            "merged": 0,
            "closed": 0,
            "open": 0
          },
          "04/2022": {
            "created": 0,
            "merged": 0,
            "closed": 0,
            "open": 0
          },
          "05/2022": {
            "created": 9,
            "merged": 3,
            "closed": 8,
            "open": 0
          },
          "06/2022": {
            "created": 14,
            "merged": 10,
            "closed": 1,
            "open": 3
          },
          "07/2022": {
            "created": 9,
            "merged": 8,
            "closed": 3,
            "open": 1
          },
          "08/2022": {
            "created": 1,
            "merged": 0,
            "closed": 0,
            "open": 2
          },
          "09/2022": {
            "created": 18,
            "merged": 6,
            "closed": 7,
            "open": 7
          },
          "10/2022": {
            "created": 28,
            "merged": 20,
            "closed": 5,
            "open": 10
          },
          "11/2022": {
            "created": 8,
            "merged": 10,
            "closed": 5,
            "open": 3
          },
          "12/2022": {
            "created": 1,
            "merged": 0,
            "closed": 0,
            "open": 4
          },
          "01/2023": {
            "created": 0,
            "merged": 0,
            "closed": 0,
            "open": 4
          },
          "02/2023": {
            "created": 0,
            "merged": 0,
            "closed": 0,
            "open": 4
          },
          "03/2023": {
            "created": 2,
            "merged": 1,
            "closed": 0,
            "open": 5
          },
          "04/2023": {
            "created": 2,
            "merged": 0,
            "closed": 0,
            "open": 7
          },
          "05/2023": {
            "created": 8,
            "merged": 1,
            "closed": 2,
            "open": 12
          },
          "06/2023": {
            "created": 5,
            "merged": 3,
            "closed": 3,
            "open": 11
          },
          "07/2023": {
            "created": 6,
            "merged": 1,
            "closed": 1,
            "open": 15
          },
          "08/2023": {
            "created": 25,
            "merged": 0,
            "closed": 0,
            "open": 40
          },
          "09/2023": {
            "created": 21,
            "merged": 9,
            "closed": 26,
            "open": 26
          },
          "10/2023": {
            "created": 1,
            "merged": 1,
            "closed": 0,
            "open": 26
          },
          "11/2023": {
            "created": 1,
            "merged": 0,
            "closed": 0,
            "open": 27
          },
          "12/2023": {
            "created": 0,
            "merged": 0,
            "closed": 0,
            "open": 27
          },
          "01/2024": {
            "created": 0,
            "merged": 0,
            "closed": 0,
            "open": 27
          },
          "02/2024": {
            "created": 4,
            "merged": 1,
            "closed": 1,
            "open": 29
          },
          "03/2024": {
            "created": 1,
            "merged": 2,
            "closed": 0,
            "open": 28
          },
          "04/2024": {
            "created": 71,
            "merged": 60,
            "closed": 33,
            "open": 6
          },
          "05/2024": {
            "created": 2,
            "merged": 1,
            "closed": 0,
            "open": 7
          },
          "06/2024": {
            "created": 15,
            "merged": 15,
            "closed": 3,
            "open": 4
          },
          "07/2024": {
            "created": 12,
            "merged": 4,
            "closed": 2,
            "open": 10
          },
          "08/2024": {
            "created": 17,
            "merged": 7,
            "closed": 9,
            "open": 11
          },
          "09/2024": {
            "created": 10,
            "merged": 9,
            "closed": 1,
            "open": 11
          },
          "10/2024": {
            "created": 3,
            "merged": 2,
            "closed": 0,
            "open": 12
          }
        },
        "issues": {
          "05/2022": {
            "created": 3,
            "merged": 0,
            "closed": 0,
            "open": 0
          },
          "06/2022": {
            "created": 6,
            "merged": 0,
            "closed": 0,
            "open": 6
          },
          "07/2022": {
            "created": 5,
            "merged": 0,
            "closed": 1,
            "open": 10
          },
          "08/2022": {
            "created": 0,
            "merged": 0,
            "closed": 0,
            "open": 10
          },
          "09/2022": {
            "created": 16,
            "merged": 0,
            "closed": 2,
            "open": 24
          },
          "10/2022": {
            "created": 3,
            "merged": 0,
            "closed": 0,
            "open": 27
          },
          "11/2022": {
            "created": 4,
            "merged": 0,
            "closed": 3,
            "open": 28
          },
          "12/2022": {
            "created": 0,
            "merged": 0,
            "closed": 0,
            "open": 28
          },
          "01/2023": {
            "created": 0,
            "merged": 0,
            "closed": 0,
            "open": 28
          },
          "02/2023": {
            "created": 2,
            "merged": 0,
            "closed": 0,
            "open": 30
          },
          "03/2023": {
            "created": 0,
            "merged": 0,
            "closed": 0,
            "open": 30
          },
          "04/2023": {
            "created": 2,
            "merged": 0,
            "closed": 0,
            "open": 32
          },
          "05/2023": {
            "created": 1,
            "merged": 0,
            "closed": 0,
            "open": 33
          },
          "06/2023": {
            "created": 0,
            "merged": 0,
            "closed": 0,
            "open": 33
          },
          "07/2023": {
            "created": 3,
            "merged": 0,
            "closed": 1,
            "open": 35
          },
          "08/2023": {
            "created": 13,
            "merged": 0,
            "closed": 0,
            "open": 48
          },
          "09/2023": {
            "created": 4,
            "merged": 0,
            "closed": 2,
            "open": 50
          },
          "10/2023": {
            "created": 0,
            "merged": 0,
            "closed": 0,
            "open": 50
          },
          "11/2023": {
            "created": 0,
            "merged": 0,
            "closed": 0,
            "open": 50
          },
          "12/2023": {
            "created": 0,
            "merged": 0,
            "closed": 0,
            "open": 50
          },
          "01/2024": {
            "created": 0,
            "merged": 0,
            "closed": 0,
            "open": 50
          },
          "02/2024": {
            "created": 0,
            "merged": 0,
            "closed": 0,
            "open": 50
          },
          "03/2024": {
            "created": 0,
            "merged": 0,
            "closed": 0,
            "open": 50
          },
          "04/2024": {
            "created": 19,
            "merged": 0,
            "closed": 6,
            "open": 63
          },
          "05/2024": {
            "created": 6,
            "merged": 0,
            "closed": 1,
            "open": 68
          },
          "06/2024": {
            "created": 3,
            "merged": 0,
            "closed": 2,
            "open": 69
          },
          "07/2024": {
            "created": 8,
            "merged": 0,
            "closed": 0,
            "open": 77
          },
          "08/2024": {
            "created": 154,
            "merged": 0,
            "closed": 88,
            "open": 143
          }
        }
      },
      {
        "name": "Data Exchange",
        "mergeRequests": {
          "05/2022": {
            "created": 1,
            "merged": 0,
            "closed": 0,
            "open": 0
          },
          "06/2022": {
            "created": 2,
            "merged": 2,
            "closed": 0,
            "open": 0
          },
          "07/2022": {
            "created": 2,
            "merged": 1,
            "closed": 0,
            "open": 1
          },
          "08/2022": {
            "created": 0,
            "merged": 0,
            "closed": 0,
            "open": 1
          },
          "09/2022": {
            "created": 8,
            "merged": 7,
            "closed": 2,
            "open": 0
          },
          "10/2022": {
            "created": 2,
            "merged": 3,
            "closed": 0,
            "open": 0
          },
          "11/2022": {
            "created": 3,
            "merged": 2,
            "closed": 0,
            "open": 1
          },
          "12/2022": {
            "created": 0,
            "merged": 1,
            "closed": 0,
            "open": 0
          },
          "01/2023": {
            "created": 0,
            "merged": 0,
            "closed": 0,
            "open": 0
          },
          "02/2023": {
            "created": 1,
            "merged": 0,
            "closed": 0,
            "open": 1
          },
          "03/2023": {
            "created": 1,
            "merged": 0,
            "closed": 0,
            "open": 2
          },
          "04/2023": {
            "created": 0,
            "merged": 0,
            "closed": 0,
            "open": 2
          },
          "05/2023": {
            "created": 1,
            "merged": 1,
            "closed": 0,
            "open": 2
          },
          "06/2023": {
            "created": 2,
            "merged": 1,
            "closed": 1,
            "open": 2
          },
          "07/2023": {
            "created": 3,
            "merged": 1,
            "closed": 2,
            "open": 2
          },
          "08/2023": {
            "created": 0,
            "merged": 0,
            "closed": 0,
            "open": 2
          },
          "09/2023": {
            "created": 4,
            "merged": 4,
            "closed": 1,
            "open": 1
          },
          "10/2023": {
            "created": 1,
            "merged": 0,
            "closed": 0,
            "open": 2
          },
          "11/2023": {
            "created": 0,
            "merged": 1,
            "closed": 0,
            "open": 1
          },
          "12/2023": {
            "created": 2,
            "merged": 2,
            "closed": 0,
            "open": 1
          },
          "01/2024": {
            "created": 1,
            "merged": 1,
            "closed": 0,
            "open": 1
          },
          "02/2024": {
            "created": 0,
            "merged": 0,
            "closed": 0,
            "open": 1
          },
          "03/2024": {
            "created": 1,
            "merged": 0,
            "closed": 0,
            "open": 2
          },
          "04/2024": {
            "created": 2,
            "merged": 3,
            "closed": 0,
            "open": 1
          },
          "05/2024": {
            "created": 2,
            "merged": 2,
            "closed": 0,
            "open": 1
          }
        },
        "issues": {
          "06/2022": {
            "created": 13,
            "merged": 0,
            "closed": 0,
            "open": 0
          },
          "07/2022": {
            "created": 1,
            "merged": 0,
            "closed": 0,
            "open": 1
          },
          "08/2022": {
            "created": 0,
            "merged": 0,
            "closed": 0,
            "open": 1
          },
          "09/2022": {
            "created": 4,
            "merged": 0,
            "closed": 11,
            "open": 0
          },
          "10/2022": {
            "created": 1,
            "merged": 0,
            "closed": 2,
            "open": 0
          },
          "11/2022": {
            "created": 1,
            "merged": 0,
            "closed": 0,
            "open": 1
          },
          "12/2022": {
            "created": 6,
            "merged": 0,
            "closed": 0,
            "open": 7
          },
          "01/2023": {
            "created": 1,
            "merged": 0,
            "closed": 0,
            "open": 8
          },
          "02/2023": {
            "created": 2,
            "merged": 0,
            "closed": 0,
            "open": 10
          },
          "03/2023": {
            "created": 3,
            "merged": 0,
            "closed": 0,
            "open": 13
          },
          "04/2023": {
            "created": 2,
            "merged": 0,
            "closed": 0,
            "open": 15
          },
          "05/2023": {
            "created": 3,
            "merged": 0,
            "closed": 1,
            "open": 17
          },
          "06/2023": {
            "created": 1,
            "merged": 0,
            "closed": 8,
            "open": 10
          },
          "07/2023": {
            "created": 2,
            "merged": 0,
            "closed": 7,
            "open": 5
          },
          "08/2023": {
            "created": 0,
            "merged": 0,
            "closed": 0,
            "open": 5
          },
          "09/2023": {
            "created": 6,
            "merged": 0,
            "closed": 12,
            "open": 0
          },
          "10/2023": {
            "created": 3,
            "merged": 0,
            "closed": 1,
            "open": 2
          },
          "11/2023": {
            "created": 3,
            "merged": 0,
            "closed": 0,
            "open": 5
          },
          "12/2023": {
            "created": 0,
            "merged": 0,
            "closed": 1,
            "open": 4
          },
          "01/2024": {
            "created": 1,
            "merged": 0,
            "closed": 0,
            "open": 5
          },
          "02/2024": {
            "created": 3,
            "merged": 0,
            "closed": 0,
            "open": 8
          },
          "03/2024": {
            "created": 1,
            "merged": 0,
            "closed": 0,
            "open": 9
          },
          "04/2024": {
            "created": 1,
            "merged": 0,
            "closed": 7,
            "open": 3
          },
          "05/2024": {
            "created": 3,
            "merged": 0,
            "closed": 1,
            "open": 5
          },
          "06/2024": {
            "created": 2,
            "merged": 0,
            "closed": 0,
            "open": 7
          },
          "07/2024": {
            "created": 3,
            "merged": 0,
            "closed": 0,
            "open": 10
          },
          "08/2024": {
            "created": 1,
            "merged": 0,
            "closed": 0,
            "open": 11
          },
          "09/2024": {
            "created": 1,
            "merged": 0,
            "closed": 7,
            "open": 5
          },
          "10/2024": {
            "created": 3,
            "merged": 0,
            "closed": 10,
            "open": 0
          }
        }
      },
      {
        "name": "Compliance (Software)",
        "mergeRequests": {
          "05/2022": {
            "created": 9,
            "merged": 7,
            "closed": 0,
            "open": 0
          },
          "06/2022": {
            "created": 54,
            "merged": 42,
            "closed": 13,
            "open": 0
          },
          "07/2022": {
            "created": 12,
            "merged": 10,
            "closed": 1,
            "open": 1
          },
          "08/2022": {
            "created": 3,
            "merged": 2,
            "closed": 1,
            "open": 1
          },
          "09/2022": {
            "created": 25,
            "merged": 20,
            "closed": 3,
            "open": 3
          },
          "10/2022": {
            "created": 2,
            "merged": 2,
            "closed": 1,
            "open": 2
          },
          "11/2022": {
            "created": 5,
            "merged": 7,
            "closed": 0,
            "open": 0
          },
          "12/2022": {
            "created": 1,
            "merged": 0,
            "closed": 0,
            "open": 1
          },
          "01/2023": {
            "created": 10,
            "merged": 4,
            "closed": 6,
            "open": 1
          },
          "02/2023": {
            "created": 12,
            "merged": 11,
            "closed": 2,
            "open": 0
          },
          "03/2023": {
            "created": 24,
            "merged": 16,
            "closed": 5,
            "open": 3
          },
          "04/2023": {
            "created": 13,
            "merged": 13,
            "closed": 2,
            "open": 1
          },
          "05/2023": {
            "created": 2,
            "merged": 2,
            "closed": 1,
            "open": 0
          },
          "06/2023": {
            "created": 7,
            "merged": 5,
            "closed": 1,
            "open": 1
          },
          "07/2023": {
            "created": 10,
            "merged": 9,
            "closed": 1,
            "open": 1
          },
          "08/2023": {
            "created": 6,
            "merged": 6,
            "closed": 0,
            "open": 1
          },
          "09/2023": {
            "created": 9,
            "merged": 9,
            "closed": 1,
            "open": 0
          },
          "10/2023": {
            "created": 4,
            "merged": 4,
            "closed": 0,
            "open": 0
          },
          "11/2023": {
            "created": 5,
            "merged": 5,
            "closed": 0,
            "open": 0
          },
          "12/2023": {
            "created": 0,
            "merged": 1,
            "closed": 0,
            "open": 0
          },
          "01/2024": {
            "created": 4,
            "merged": 3,
            "closed": 1,
            "open": 0
          },
          "02/2024": {
            "created": 8,
            "merged": 6,
            "closed": 2,
            "open": 0
          },
          "03/2024": {
            "created": 4,
            "merged": 3,
            "closed": 0,
            "open": 1
          },
          "04/2024": {
            "created": 3,
            "merged": 3,
            "closed": 0,
            "open": 1
          },
          "05/2024": {
            "created": 7,
            "merged": 7,
            "closed": 0,
            "open": 1
          },
          "06/2024": {
            "created": 6,
            "merged": 3,
            "closed": 1,
            "open": 3
          },
          "07/2024": {
            "created": 5,
            "merged": 4,
            "closed": 2,
            "open": 2
          },
          "08/2024": {
            "created": 51,
            "merged": 47,
            "closed": 2,
            "open": 4
          },
          "09/2024": {
            "created": 13,
            "merged": 14,
            "closed": 1,
            "open": 2
          },
          "10/2024": {
            "created": 2,
            "merged": 3,
            "closed": 0,
            "open": 1
          }
        },
        "issues": {
          "05/2022": {
            "created": 9,
            "merged": 0,
            "closed": 5,
            "open": 0
          },
          "06/2022": {
            "created": 3,
            "merged": 0,
            "closed": 5,
            "open": 0
          },
          "07/2022": {
            "created": 7,
            "merged": 0,
            "closed": 4,
            "open": 3
          },
          "08/2022": {
            "created": 4,
            "merged": 0,
            "closed": 0,
            "open": 7
          },
          "09/2022": {
            "created": 2,
            "merged": 0,
            "closed": 3,
            "open": 6
          },
          "10/2022": {
            "created": 3,
            "merged": 0,
            "closed": 2,
            "open": 7
          },
          "11/2022": {
            "created": 0,
            "merged": 0,
            "closed": 3,
            "open": 4
          },
          "12/2022": {
            "created": 1,
            "merged": 0,
            "closed": 0,
            "open": 5
          },
          "01/2023": {
            "created": 2,
            "merged": 0,
            "closed": 2,
            "open": 5
          },
          "02/2023": {
            "created": 0,
            "merged": 0,
            "closed": 0,
            "open": 5
          },
          "03/2023": {
            "created": 13,
            "merged": 0,
            "closed": 6,
            "open": 12
          },
          "04/2023": {
            "created": 2,
            "merged": 0,
            "closed": 5,
            "open": 9
          },
          "05/2023": {
            "created": 1,
            "merged": 0,
            "closed": 0,
            "open": 10
          },
          "06/2023": {
            "created": 4,
            "merged": 0,
            "closed": 1,
            "open": 13
          },
          "07/2023": {
            "created": 2,
            "merged": 0,
            "closed": 6,
            "open": 9
          },
          "08/2023": {
            "created": 0,
            "merged": 0,
            "closed": 0,
            "open": 9
          },
          "09/2023": {
            "created": 3,
            "merged": 0,
            "closed": 8,
            "open": 4
          },
          "10/2023": {
            "created": 3,
            "merged": 0,
            "closed": 4,
            "open": 3
          },
          "11/2023": {
            "created": 2,
            "merged": 0,
            "closed": 3,
            "open": 2
          },
          "12/2023": {
            "created": 0,
            "merged": 0,
            "closed": 0,
            "open": 2
          },
          "01/2024": {
            "created": 1,
            "merged": 0,
            "closed": 1,
            "open": 2
          },
          "02/2024": {
            "created": 0,
            "merged": 0,
            "closed": 1,
            "open": 1
          },
          "03/2024": {
            "created": 1,
            "merged": 0,
            "closed": 0,
            "open": 2
          },
          "04/2024": {
            "created": 0,
            "merged": 0,
            "closed": 0,
            "open": 2
          },
          "05/2024": {
            "created": 3,
            "merged": 0,
            "closed": 2,
            "open": 3
          },
          "06/2024": {
            "created": 4,
            "merged": 0,
            "closed": 4,
            "open": 3
          },
          "07/2024": {
            "created": 3,
            "merged": 0,
            "closed": 3,
            "open": 3
          },
          "08/2024": {
            "created": 6,
            "merged": 0,
            "closed": 3,
            "open": 6
          },
          "09/2024": {
            "created": 1,
            "merged": 0,
            "closed": 4,
            "open": 3
          }
        }
      },
      {
        "name": "Registry (Software)",
        "mergeRequests": {
          "02/2022": {
            "created": 3,
            "merged": 1,
            "closed": 0,
            "open": 0
          },
          "03/2022": {
            "created": 15,
            "merged": 14,
            "closed": 3,
            "open": 0
          },
          "04/2022": {
            "created": 2,
            "merged": 2,
            "closed": 0,
            "open": 0
          },
          "05/2022": {
            "created": 3,
            "merged": 3,
            "closed": 0,
            "open": 0
          },
          "06/2022": {
            "created": 7,
            "merged": 6,
            "closed": 0,
            "open": 1
          },
          "07/2022": {
            "created": 14,
            "merged": 12,
            "closed": 2,
            "open": 1
          },
          "08/2022": {
            "created": 1,
            "merged": 1,
            "closed": 0,
            "open": 1
          },
          "09/2022": {
            "created": 6,
            "merged": 6,
            "closed": 1,
            "open": 0
          },
          "10/2022": {
            "created": 1,
            "merged": 0,
            "closed": 1,
            "open": 0
          },
          "11/2022": {
            "created": 1,
            "merged": 0,
            "closed": 0,
            "open": 1
          },
          "12/2022": {
            "created": 1,
            "merged": 0,
            "closed": 0,
            "open": 2
          },
          "01/2023": {
            "created": 8,
            "merged": 8,
            "closed": 0,
            "open": 2
          },
          "02/2023": {
            "created": 11,
            "merged": 8,
            "closed": 1,
            "open": 4
          },
          "03/2023": {
            "created": 10,
            "merged": 12,
            "closed": 0,
            "open": 2
          },
          "04/2023": {
            "created": 5,
            "merged": 6,
            "closed": 0,
            "open": 1
          },
          "05/2023": {
            "created": 4,
            "merged": 4,
            "closed": 0,
            "open": 1
          },
          "06/2023": {
            "created": 10,
            "merged": 10,
            "closed": 0,
            "open": 1
          },
          "07/2023": {
            "created": 7,
            "merged": 4,
            "closed": 2,
            "open": 2
          },
          "08/2023": {
            "created": 2,
            "merged": 3,
            "closed": 0,
            "open": 1
          },
          "09/2023": {
            "created": 6,
            "merged": 3,
            "closed": 1,
            "open": 3
          },
          "10/2023": {
            "created": 4,
            "merged": 3,
            "closed": 1,
            "open": 3
          },
          "11/2023": {
            "created": 2,
            "merged": 3,
            "closed": 0,
            "open": 2
          },
          "12/2023": {
            "created": 2,
            "merged": 0,
            "closed": 0,
            "open": 4
          },
          "01/2024": {
            "created": 4,
            "merged": 4,
            "closed": 2,
            "open": 2
          },
          "02/2024": {
            "created": 14,
            "merged": 15,
            "closed": 0,
            "open": 1
          },
          "03/2024": {
            "created": 2,
            "merged": 2,
            "closed": 0,
            "open": 1
          },
          "04/2024": {
            "created": 10,
            "merged": 6,
            "closed": 0,
            "open": 5
          },
          "05/2024": {
            "created": 9,
            "merged": 12,
            "closed": 2,
            "open": 0
          },
          "06/2024": {
            "created": 4,
            "merged": 4,
            "closed": 0,
            "open": 0
          },
          "07/2024": {
            "created": 12,
            "merged": 11,
            "closed": 0,
            "open": 1
          },
          "08/2024": {
            "created": 6,
            "merged": 4,
            "closed": 0,
            "open": 3
          },
          "09/2024": {
            "created": 6,
            "merged": 7,
            "closed": 1,
            "open": 1
          },
          "10/2024": {
            "created": 1,
            "merged": 1,
            "closed": 0,
            "open": 1
          }
        },
        "issues": {
          "02/2022": {
            "created": 5,
            "merged": 0,
            "closed": 1,
            "open": 0
          },
          "03/2022": {
            "created": 9,
            "merged": 0,
            "closed": 8,
            "open": 1
          },
          "04/2022": {
            "created": 2,
            "merged": 0,
            "closed": 1,
            "open": 2
          },
          "05/2022": {
            "created": 4,
            "merged": 0,
            "closed": 0,
            "open": 6
          },
          "06/2022": {
            "created": 0,
            "merged": 0,
            "closed": 3,
            "open": 3
          },
          "07/2022": {
            "created": 0,
            "merged": 0,
            "closed": 0,
            "open": 3
          },
          "08/2022": {
            "created": 1,
            "merged": 0,
            "closed": 0,
            "open": 4
          },
          "09/2022": {
            "created": 3,
            "merged": 0,
            "closed": 10,
            "open": 0
          },
          "10/2022": {
            "created": 0,
            "merged": 0,
            "closed": 0,
            "open": 0
          },
          "11/2022": {
            "created": 0,
            "merged": 0,
            "closed": 1,
            "open": 0
          },
          "12/2022": {
            "created": 0,
            "merged": 0,
            "closed": 0,
            "open": 0
          },
          "01/2023": {
            "created": 1,
            "merged": 0,
            "closed": 1,
            "open": 0
          },
          "02/2023": {
            "created": 1,
            "merged": 0,
            "closed": 0,
            "open": 1
          },
          "03/2023": {
            "created": 1,
            "merged": 0,
            "closed": 0,
            "open": 2
          },
          "04/2023": {
            "created": 0,
            "merged": 0,
            "closed": 0,
            "open": 2
          },
          "05/2023": {
            "created": 1,
            "merged": 0,
            "closed": 1,
            "open": 2
          },
          "06/2023": {
            "created": 0,
            "merged": 0,
            "closed": 0,
            "open": 2
          },
          "07/2023": {
            "created": 1,
            "merged": 0,
            "closed": 1,
            "open": 2
          },
          "08/2023": {
            "created": 2,
            "merged": 0,
            "closed": 1,
            "open": 3
          },
          "09/2023": {
            "created": 2,
            "merged": 0,
            "closed": 4,
            "open": 1
          },
          "10/2023": {
            "created": 0,
            "merged": 0,
            "closed": 1,
            "open": 0
          },
          "11/2023": {
            "created": 2,
            "merged": 0,
            "closed": 0,
            "open": 2
          },
          "12/2023": {
            "created": 1,
            "merged": 0,
            "closed": 0,
            "open": 3
          },
          "01/2024": {
            "created": 1,
            "merged": 0,
            "closed": 0,
            "open": 4
          },
          "02/2024": {
            "created": 1,
            "merged": 0,
            "closed": 1,
            "open": 4
          },
          "03/2024": {
            "created": 2,
            "merged": 0,
            "closed": 3,
            "open": 3
          },
          "04/2024": {
            "created": 1,
            "merged": 0,
            "closed": 0,
            "open": 4
          },
          "05/2024": {
            "created": 1,
            "merged": 0,
            "closed": 2,
            "open": 3
          },
          "06/2024": {
            "created": 5,
            "merged": 0,
            "closed": 5,
            "open": 3
          },
          "07/2024": {
            "created": 2,
            "merged": 0,
            "closed": 1,
            "open": 4
          },
          "08/2024": {
            "created": 4,
            "merged": 0,
            "closed": 4,
            "open": 4
          }
        }
      },
      {
        "name": "Notary (Software)",
        "mergeRequests": {
          "02/2023": {
            "created": 8,
            "merged": 8,
            "closed": 0,
            "open": 0
          },
          "03/2023": {
            "created": 3,
            "merged": 2,
            "closed": 0,
            "open": 1
          },
          "04/2023": {
            "created": 7,
            "merged": 8,
            "closed": 0,
            "open": 0
          },
          "05/2023": {
            "created": 0,
            "merged": 0,
            "closed": 0,
            "open": 0
          },
          "06/2023": {
            "created": 6,
            "merged": 6,
            "closed": 0,
            "open": 0
          },
          "07/2023": {
            "created": 4,
            "merged": 4,
            "closed": 0,
            "open": 0
          },
          "08/2023": {
            "created": 3,
            "merged": 3,
            "closed": 0,
            "open": 0
          },
          "09/2023": {
            "created": 1,
            "merged": 0,
            "closed": 0,
            "open": 1
          },
          "10/2023": {
            "created": 8,
            "merged": 9,
            "closed": 0,
            "open": 0
          },
          "11/2023": {
            "created": 2,
            "merged": 2,
            "closed": 0,
            "open": 0
          },
          "12/2023": {
            "created": 3,
            "merged": 3,
            "closed": 0,
            "open": 0
          },
          "01/2024": {
            "created": 2,
            "merged": 2,
            "closed": 0,
            "open": 0
          },
          "02/2024": {
            "created": 1,
            "merged": 1,
            "closed": 0,
            "open": 0
          },
          "03/2024": {
            "created": 3,
            "merged": 2,
            "closed": 0,
            "open": 1
          },
          "04/2024": {
            "created": 4,
            "merged": 5,
            "closed": 0,
            "open": 0
          },
          "05/2024": {
            "created": 6,
            "merged": 4,
            "closed": 0,
            "open": 2
          },
          "06/2024": {
            "created": 4,
            "merged": 4,
            "closed": 0,
            "open": 2
          },
          "07/2024": {
            "created": 3,
            "merged": 4,
            "closed": 0,
            "open": 1
          },
          "08/2024": {
            "created": 1,
            "merged": 0,
            "closed": 0,
            "open": 2
          },
          "09/2024": {
            "created": 3,
            "merged": 2,
            "closed": 0,
            "open": 3
          },
          "10/2024": {
            "created": 1,
            "merged": 2,
            "closed": 0,
            "open": 2
          }
        },
        "issues": {
          "02/2023": {
            "created": 1,
            "merged": 0,
            "closed": 1,
            "open": 0
          },
          "03/2023": {
            "created": 1,
            "merged": 0,
            "closed": 1,
            "open": 0
          },
          "04/2023": {
            "created": 0,
            "merged": 0,
            "closed": 0,
            "open": 0
          },
          "05/2023": {
            "created": 0,
            "merged": 0,
            "closed": 0,
            "open": 0
          },
          "06/2023": {
            "created": 0,
            "merged": 0,
            "closed": 0,
            "open": 0
          },
          "07/2023": {
            "created": 0,
            "merged": 0,
            "closed": 0,
            "open": 0
          },
          "08/2023": {
            "created": 0,
            "merged": 0,
            "closed": 0,
            "open": 0
          },
          "09/2023": {
            "created": 1,
            "merged": 0,
            "closed": 0,
            "open": 1
          },
          "10/2023": {
            "created": 1,
            "merged": 0,
            "closed": 2,
            "open": 0
          },
          "11/2023": {
            "created": 0,
            "merged": 0,
            "closed": 0,
            "open": 0
          },
          "12/2023": {
            "created": 0,
            "merged": 0,
            "closed": 0,
            "open": 0
          },
          "01/2024": {
            "created": 0,
            "merged": 0,
            "closed": 0,
            "open": 0
          },
          "02/2024": {
            "created": 0,
            "merged": 0,
            "closed": 0,
            "open": 0
          },
          "03/2024": {
            "created": 0,
            "merged": 0,
            "closed": 0,
            "open": 0
          },
          "04/2024": {
            "created": 0,
            "merged": 0,
            "closed": 0,
            "open": 0
          },
          "05/2024": {
            "created": 0,
            "merged": 0,
            "closed": 0,
            "open": 0
          },
          "06/2024": {
            "created": 2,
            "merged": 0,
            "closed": 1,
            "open": 1
          },
          "07/2024": {
            "created": 0,
            "merged": 0,
            "closed": 1,
            "open": 0
          }
        }
      }
    ]
  }
}