<mxfile host="Electron" modified="2024-08-23T08:41:22.340Z" agent="Mozilla/5.0 (Macintosh; Intel Mac OS X 10_15_7) AppleWebKit/537.36 (KHTML, like Gecko) draw.io/22.0.2 Chrome/114.0.5735.289 Electron/25.8.4 Safari/537.36" etag="aa4ULAAjF4KQbipd24WE" version="22.0.2" type="device">
  <diagram id="kgpKYQtTHZ0yAKxKKP6v" name="Page-1">
    <mxGraphModel dx="2848" dy="617" grid="1" gridSize="10" guides="1" tooltips="1" connect="1" arrows="1" fold="1" page="1" pageScale="1" pageWidth="827" pageHeight="1169" math="0" shadow="0">
      <root>
        <mxCell id="0" />
        <mxCell id="1" parent="0" />
        <mxCell id="FXN2Bj1WnniETb85nXx2-7" value="" style="html=1;points=[];perimeter=orthogonalPerimeter;" parent="1" vertex="1">
          <mxGeometry x="-734" y="440" width="10" height="40" as="geometry" />
        </mxCell>
        <mxCell id="3nuBFxr9cyL0pnOWT2aG-5" value="myPFM&#xa;as Data Consumer" style="shape=umlLifeline;perimeter=lifelinePerimeter;container=0;collapsible=0;recursiveResize=0;rounded=0;shadow=0;strokeWidth=1;" parent="1" vertex="1">
          <mxGeometry x="-1089" y="40" width="110" height="1120" as="geometry" />
        </mxCell>
        <mxCell id="iz6BomqZgV8wwgHXzJbM-10" value="" style="points=[];perimeter=orthogonalPerimeter;rounded=0;shadow=0;strokeWidth=1;" parent="1" vertex="1">
          <mxGeometry x="-434" y="790" width="10" height="229" as="geometry" />
        </mxCell>
        <mxCell id="iz6BomqZgV8wwgHXzJbM-8" value="" style="points=[];perimeter=orthogonalPerimeter;rounded=0;shadow=0;strokeWidth=1;" parent="1" vertex="1">
          <mxGeometry x="-559" y="790" width="10" height="229" as="geometry" />
        </mxCell>
        <mxCell id="iz6BomqZgV8wwgHXzJbM-4" value="" style="points=[];perimeter=orthogonalPerimeter;rounded=0;shadow=0;strokeWidth=1;" parent="1" vertex="1">
          <mxGeometry x="-914" y="838.86" width="10" height="91.14" as="geometry" />
        </mxCell>
        <mxCell id="iz6BomqZgV8wwgHXzJbM-49" value="" style="points=[];perimeter=orthogonalPerimeter;rounded=0;shadow=0;strokeWidth=1;" parent="1" vertex="1">
          <mxGeometry x="-1194" y="619" width="10" height="521" as="geometry" />
        </mxCell>
        <mxCell id="iz6BomqZgV8wwgHXzJbM-1" value="Jane &#xa;as DataSubject" style="shape=umlLifeline;perimeter=lifelinePerimeter;container=1;collapsible=0;recursiveResize=0;rounded=0;shadow=0;strokeWidth=1;dashed=1;" parent="1" vertex="1">
          <mxGeometry x="-1339" y="40" width="90" height="1080" as="geometry" />
        </mxCell>
        <mxCell id="9igQDUlaKGqJAjwGfmc6-1" value="" style="html=1;points=[];perimeter=orthogonalPerimeter;fillColor=none;" parent="iz6BomqZgV8wwgHXzJbM-1" vertex="1">
          <mxGeometry x="40" y="90" width="10" height="80" as="geometry" />
        </mxCell>
        <mxCell id="9igQDUlaKGqJAjwGfmc6-2" value="" style="html=1;points=[];perimeter=orthogonalPerimeter;fillColor=none;" parent="iz6BomqZgV8wwgHXzJbM-1" vertex="1">
          <mxGeometry x="40" y="270" width="10" height="70" as="geometry" />
        </mxCell>
        <mxCell id="9igQDUlaKGqJAjwGfmc6-4" value="" style="html=1;points=[];perimeter=orthogonalPerimeter;fillColor=none;" parent="iz6BomqZgV8wwgHXzJbM-1" vertex="1">
          <mxGeometry x="40" y="599" width="10" height="70" as="geometry" />
        </mxCell>
        <mxCell id="iz6BomqZgV8wwgHXzJbM-3" value="myPFM&#xa;as Data Product &#xa;Provider" style="shape=umlLifeline;perimeter=lifelinePerimeter;container=1;collapsible=0;recursiveResize=0;rounded=0;shadow=0;strokeWidth=1;" parent="1" vertex="1">
          <mxGeometry x="-959" y="40" width="100" height="1000" as="geometry" />
        </mxCell>
        <mxCell id="iz6BomqZgV8wwgHXzJbM-7" value="Lender(i)&#xa;as Service Provider" style="shape=umlLifeline;perimeter=lifelinePerimeter;container=1;collapsible=0;recursiveResize=0;rounded=0;shadow=0;strokeWidth=1;" parent="1" vertex="1">
          <mxGeometry x="-609" y="40" width="110" height="990" as="geometry" />
        </mxCell>
        <mxCell id="iz6BomqZgV8wwgHXzJbM-9" value="Lender(i)&#xa;as Data Consumer" style="shape=umlLifeline;perimeter=lifelinePerimeter;container=1;collapsible=0;recursiveResize=0;rounded=0;shadow=0;strokeWidth=1;" parent="1" vertex="1">
          <mxGeometry x="-489" y="40" width="120" height="1000" as="geometry" />
        </mxCell>
        <mxCell id="iz6BomqZgV8wwgHXzJbM-14" value="Data Product &#xa;Catalog" style="shape=umlLifeline;perimeter=lifelinePerimeter;container=1;collapsible=0;recursiveResize=0;rounded=0;shadow=0;strokeWidth=1;" parent="1" vertex="1">
          <mxGeometry x="-140" y="40" width="100" height="1000" as="geometry" />
        </mxCell>
        <mxCell id="iz6BomqZgV8wwgHXzJbM-66" value="DataUsageAgreement&lt;br&gt;Trust Anchor" style="shape=umlLifeline;perimeter=lifelinePerimeter;whiteSpace=wrap;html=1;container=1;collapsible=0;recursiveResize=0;outlineConnect=0;dashed=1;fontSize=11;" parent="1" vertex="1">
          <mxGeometry x="-280" y="40" width="120" height="990" as="geometry" />
        </mxCell>
        <mxCell id="iz6BomqZgV8wwgHXzJbM-73" value="" style="verticalAlign=bottom;endArrow=block;shadow=0;strokeWidth=1;exitX=0.475;exitY=0.128;exitDx=0;exitDy=0;exitPerimeter=0;" parent="1" edge="1">
          <mxGeometry relative="1" as="geometry">
            <mxPoint x="-1191" y="147" as="sourcePoint" />
            <mxPoint x="-1294.5" y="147" as="targetPoint" />
          </mxGeometry>
        </mxCell>
        <mxCell id="iz6BomqZgV8wwgHXzJbM-76" value="Agreement signature &amp; notarisation" style="verticalAlign=bottom;endArrow=block;shadow=0;strokeWidth=1;" parent="1" target="iz6BomqZgV8wwgHXzJbM-66" edge="1">
          <mxGeometry relative="1" as="geometry">
            <mxPoint x="-1295" y="175" as="sourcePoint" />
            <mxPoint x="-90.5" y="175" as="targetPoint" />
            <Array as="points">
              <mxPoint x="-1295" y="175" />
            </Array>
          </mxGeometry>
        </mxCell>
        <mxCell id="iz6BomqZgV8wwgHXzJbM-72" value="Signed Agreement&#xa;for Loan Proposal" style="verticalAlign=top;endArrow=block;shadow=0;strokeWidth=1;entryX=0.463;entryY=0.589;entryDx=0;entryDy=0;entryPerimeter=0;dashed=1;" parent="1" source="iz6BomqZgV8wwgHXzJbM-1" target="3nuBFxr9cyL0pnOWT2aG-1" edge="1">
          <mxGeometry x="0.0232" relative="1" as="geometry">
            <mxPoint x="-1294.9899999999998" y="679.54" as="sourcePoint" />
            <mxPoint x="-1187.5" y="680" as="targetPoint" />
            <mxPoint as="offset" />
          </mxGeometry>
        </mxCell>
        <mxCell id="iz6BomqZgV8wwgHXzJbM-36" value="Negociate, configure and sign DUC for XX-profile Loan Related Data" style="verticalAlign=bottom;endArrow=block;shadow=0;strokeWidth=1;startArrow=block;startFill=1;entryX=0.5;entryY=0.813;entryDx=0;entryDy=0;entryPerimeter=0;" parent="1" source="iz6BomqZgV8wwgHXzJbM-3" target="iz6BomqZgV8wwgHXzJbM-9" edge="1">
          <mxGeometry x="-0.1816" relative="1" as="geometry">
            <mxPoint x="-911.8000000000002" y="846" as="sourcePoint" />
            <mxPoint x="-428.49999999999955" y="846" as="targetPoint" />
            <mxPoint as="offset" />
          </mxGeometry>
        </mxCell>
        <mxCell id="iz6BomqZgV8wwgHXzJbM-44" value="" style="html=1;verticalAlign=bottom;endArrow=block;rounded=0;fontSize=9;strokeColor=#000000;exitX=0.5;exitY=0.831;exitDx=0;exitDy=0;exitPerimeter=0;" parent="1" edge="1">
          <mxGeometry width="80" relative="1" as="geometry">
            <mxPoint x="-429" y="970" as="sourcePoint" />
            <mxPoint x="-554.9285714285716" y="970" as="targetPoint" />
          </mxGeometry>
        </mxCell>
        <mxCell id="iz6BomqZgV8wwgHXzJbM-31" value="Get DPD for &#xa;Loan Related data DP" style="verticalAlign=bottom;endArrow=block;shadow=0;strokeWidth=1;exitX=0.496;exitY=0.779;exitDx=0;exitDy=0;exitPerimeter=0;" parent="1" source="iz6BomqZgV8wwgHXzJbM-9" target="iz6BomqZgV8wwgHXzJbM-14" edge="1">
          <mxGeometry x="-0.0886" y="-32" relative="1" as="geometry">
            <mxPoint x="-428.97619047619037" y="800.04" as="sourcePoint" />
            <mxPoint x="-278" y="800.04" as="targetPoint" />
            <mxPoint as="offset" />
          </mxGeometry>
        </mxCell>
        <mxCell id="iz6BomqZgV8wwgHXzJbM-48" value="" style="verticalAlign=bottom;endArrow=block;shadow=0;strokeWidth=1;exitX=0.5;exitY=0.284;exitDx=0;exitDy=0;exitPerimeter=0;entryX=0.499;entryY=0.286;entryDx=0;entryDy=0;entryPerimeter=0;" parent="1" edge="1">
          <mxGeometry relative="1" as="geometry">
            <mxPoint x="-1189" y="323.9999999999999" as="sourcePoint" />
            <mxPoint x="-1294.09" y="323.1399999999999" as="targetPoint" />
          </mxGeometry>
        </mxCell>
        <mxCell id="iz6BomqZgV8wwgHXzJbM-53" value="" style="html=1;verticalAlign=bottom;endArrow=block;rounded=0;fontSize=9;strokeColor=#000000;exitX=0.48;exitY=0.787;exitDx=0;exitDy=0;exitPerimeter=0;" parent="1" source="iz6BomqZgV8wwgHXzJbM-7" target="iz6BomqZgV8wwgHXzJbM-9" edge="1">
          <mxGeometry width="80" relative="1" as="geometry">
            <mxPoint x="-553.9761904761904" y="800" as="sourcePoint" />
            <mxPoint x="-429" y="800" as="targetPoint" />
            <mxPoint as="offset" />
          </mxGeometry>
        </mxCell>
        <mxCell id="iz6BomqZgV8wwgHXzJbM-57" value="" style="html=1;verticalAlign=bottom;endArrow=open;dashed=1;endSize=8;rounded=0;fontSize=9;strokeColor=#000000;exitX=0.5;exitY=0.775;exitDx=0;exitDy=0;exitPerimeter=0;entryX=0.492;entryY=0.775;entryDx=0;entryDy=0;entryPerimeter=0;" parent="1" edge="1">
          <mxGeometry relative="1" as="geometry">
            <mxPoint x="-909" y="913.9999999999998" as="sourcePoint" />
            <mxPoint x="-429.96000000000004" y="913.9999999999998" as="targetPoint" />
          </mxGeometry>
        </mxCell>
        <mxCell id="RN6gnvtAF0V6DGEFLZ67-1" value="" style="group" parent="1" vertex="1" connectable="0">
          <mxGeometry x="-1229" y="40" width="80" height="1110" as="geometry" />
        </mxCell>
        <mxCell id="iz6BomqZgV8wwgHXzJbM-96" value="" style="points=[];perimeter=orthogonalPerimeter;rounded=0;shadow=0;strokeWidth=1;" parent="RN6gnvtAF0V6DGEFLZ67-1" vertex="1">
          <mxGeometry x="35" y="360" width="10" height="150" as="geometry" />
        </mxCell>
        <mxCell id="3nuBFxr9cyL0pnOWT2aG-2" value="" style="points=[];perimeter=orthogonalPerimeter;rounded=0;shadow=0;strokeWidth=1;" parent="RN6gnvtAF0V6DGEFLZ67-1" vertex="1">
          <mxGeometry x="35" y="77.7" width="10" height="262.3" as="geometry" />
        </mxCell>
        <mxCell id="3nuBFxr9cyL0pnOWT2aG-1" value="Jane &#xa;as EndUser" style="shape=umlLifeline;perimeter=lifelinePerimeter;container=0;collapsible=0;recursiveResize=0;rounded=0;shadow=0;strokeWidth=1;dashed=1;" parent="RN6gnvtAF0V6DGEFLZ67-1" vertex="1">
          <mxGeometry width="80" height="1110" as="geometry" />
        </mxCell>
        <mxCell id="iz6BomqZgV8wwgHXzJbM-19" value="" style="html=1;points=[];perimeter=orthogonalPerimeter;fillColor=none;" parent="1" vertex="1">
          <mxGeometry x="-1039" y="220" width="10" height="160" as="geometry" />
        </mxCell>
        <mxCell id="iz6BomqZgV8wwgHXzJbM-37" value="" style="points=[];perimeter=orthogonalPerimeter;rounded=0;shadow=0;strokeWidth=1;glass=0;fillColor=none;" parent="1" vertex="1">
          <mxGeometry x="-1039" y="619" width="10" height="510" as="geometry" />
        </mxCell>
        <mxCell id="iz6BomqZgV8wwgHXzJbM-18" value="Review DPSD&lt;br&gt;Create Agreement for Bank(i)" style="edgeStyle=orthogonalEdgeStyle;html=1;align=left;spacingLeft=2;endArrow=block;rounded=0;entryX=0.509;entryY=0.269;entryDx=0;entryDy=0;entryPerimeter=0;exitX=0.508;exitY=0.231;exitDx=0;exitDy=0;exitPerimeter=0;" parent="1" edge="1">
          <mxGeometry x="0.5905" y="-20" relative="1" as="geometry">
            <mxPoint x="-1033.12" y="260" as="sourcePoint" />
            <Array as="points">
              <mxPoint x="-1033" y="259" />
              <mxPoint x="-969" y="259" />
              <mxPoint x="-969" y="299" />
              <mxPoint x="-1033" y="299" />
            </Array>
            <mxPoint x="-1033.0099999999998" y="298" as="targetPoint" />
            <mxPoint as="offset" />
          </mxGeometry>
        </mxCell>
        <mxCell id="3nuBFxr9cyL0pnOWT2aG-9" value="Request to sign &#xa;Agreement for Bank(i)" style="verticalAlign=bottom;endArrow=block;shadow=0;strokeWidth=1;exitX=0;exitY=0.588;exitDx=0;exitDy=0;exitPerimeter=0;" parent="1" source="iz6BomqZgV8wwgHXzJbM-19" target="3nuBFxr9cyL0pnOWT2aG-1" edge="1">
          <mxGeometry relative="1" as="geometry">
            <mxPoint x="-1034" y="325.66999999999996" as="sourcePoint" />
            <mxPoint x="-1184" y="325.66999999999996" as="targetPoint" />
          </mxGeometry>
        </mxCell>
        <mxCell id="iz6BomqZgV8wwgHXzJbM-43" value="&lt;font style=&quot;font-size: 11px&quot;&gt;Prepare &lt;br&gt;loan proposal&lt;/font&gt;" style="html=1;verticalAlign=middle;endArrow=block;rounded=0;fontSize=9;strokeColor=#000000;align=left;" parent="1" edge="1">
          <mxGeometry x="0.4263" y="-20" width="80" relative="1" as="geometry">
            <mxPoint x="-424" y="928.8600000000001" as="sourcePoint" />
            <mxPoint x="-429.3333333333335" y="968.86" as="targetPoint" />
            <Array as="points">
              <mxPoint x="-359" y="929" />
              <mxPoint x="-359" y="969" />
            </Array>
            <mxPoint as="offset" />
          </mxGeometry>
        </mxCell>
        <mxCell id="iz6BomqZgV8wwgHXzJbM-16" value="Get DPD for Bank(i)" style="verticalAlign=bottom;endArrow=block;shadow=0;strokeWidth=1;entryX=0.5;entryY=0.204;entryDx=0;entryDy=0;entryPerimeter=0;" parent="1" source="3nuBFxr9cyL0pnOWT2aG-5" target="iz6BomqZgV8wwgHXzJbM-14" edge="1">
          <mxGeometry x="-0.5652" relative="1" as="geometry">
            <mxPoint x="-1023" y="260" as="sourcePoint" />
            <mxPoint x="-283.6699999999996" y="260.01200000000006" as="targetPoint" />
            <mxPoint as="offset" />
          </mxGeometry>
        </mxCell>
        <mxCell id="iz6BomqZgV8wwgHXzJbM-11" value="Negotiate, configure and sign DUC" style="verticalAlign=bottom;endArrow=block;shadow=0;strokeWidth=1;startArrow=block;startFill=1;entryX=0.512;entryY=0.616;entryDx=0;entryDy=0;entryPerimeter=0;" parent="1" source="3nuBFxr9cyL0pnOWT2aG-5" target="iz6BomqZgV8wwgHXzJbM-5" edge="1">
          <mxGeometry x="0.0075" relative="1" as="geometry">
            <mxPoint x="-1034" y="380" as="sourcePoint" />
            <mxPoint x="-730.3" y="374.4200000000001" as="targetPoint" />
            <mxPoint as="offset" />
          </mxGeometry>
        </mxCell>
        <mxCell id="iz6BomqZgV8wwgHXzJbM-39" value="Get XX-profile Loan Related Data" style="verticalAlign=bottom;endArrow=block;shadow=0;strokeWidth=1;" parent="1" edge="1">
          <mxGeometry relative="1" as="geometry">
            <mxPoint x="-434" y="902.7" as="sourcePoint" />
            <mxPoint x="-909.9285714285716" y="902.7" as="targetPoint" />
          </mxGeometry>
        </mxCell>
        <mxCell id="iz6BomqZgV8wwgHXzJbM-45" value="Negociate, configure and sign DUC for Loan Proposal" style="verticalAlign=bottom;endArrow=block;shadow=0;strokeWidth=1;startArrow=block;startFill=1;entryX=0.5;entryY=0.667;entryDx=0;entryDy=0;entryPerimeter=0;" parent="1" edge="1">
          <mxGeometry relative="1" as="geometry">
            <mxPoint x="-1034.9285714285716" y="798.9999999999998" as="sourcePoint" />
            <mxPoint x="-554" y="799.3300000000002" as="targetPoint" />
            <Array as="points">
              <mxPoint x="-839" y="799" />
            </Array>
          </mxGeometry>
        </mxCell>
        <mxCell id="iz6BomqZgV8wwgHXzJbM-50" value="Get Loan recommendation" style="verticalAlign=bottom;endArrow=block;shadow=0;strokeWidth=1;exitX=0.5;exitY=0.96;exitDx=0;exitDy=0;exitPerimeter=0;" parent="1" source="3nuBFxr9cyL0pnOWT2aG-1" target="iz6BomqZgV8wwgHXzJbM-37" edge="1">
          <mxGeometry relative="1" as="geometry">
            <mxPoint x="-1187" y="1081.9999999999998" as="sourcePoint" />
            <mxPoint x="-1032" y="1081.46" as="targetPoint" />
          </mxGeometry>
        </mxCell>
        <mxCell id="iz6BomqZgV8wwgHXzJbM-58" value="" style="html=1;verticalAlign=bottom;endArrow=open;dashed=1;endSize=8;rounded=0;fontSize=9;strokeColor=#000000;exitX=0.491;exitY=0.873;exitDx=0;exitDy=0;exitPerimeter=0;entryX=0.5;entryY=0.863;entryDx=0;entryDy=0;entryPerimeter=0;" parent="1" edge="1">
          <mxGeometry relative="1" as="geometry">
            <mxPoint x="-554.9899999999998" y="1003.27" as="sourcePoint" />
            <mxPoint x="-1034" y="1002" as="targetPoint" />
          </mxGeometry>
        </mxCell>
        <mxCell id="iz6BomqZgV8wwgHXzJbM-59" value="" style="html=1;verticalAlign=bottom;endArrow=open;dashed=1;endSize=8;rounded=0;fontSize=9;strokeColor=#000000;exitX=-0.3;exitY=0.978;exitDx=0;exitDy=0;exitPerimeter=0;" parent="1" source="iz6BomqZgV8wwgHXzJbM-37" target="iz6BomqZgV8wwgHXzJbM-49" edge="1">
          <mxGeometry relative="1" as="geometry">
            <mxPoint x="-1035.98" y="1092" as="sourcePoint" />
            <mxPoint x="-1187.96" y="1092" as="targetPoint" />
          </mxGeometry>
        </mxCell>
        <mxCell id="iz6BomqZgV8wwgHXzJbM-62" value="Query Catalog for appropriate Loan Services" style="verticalAlign=bottom;endArrow=block;shadow=0;strokeWidth=1;" parent="1" edge="1">
          <mxGeometry x="0.006" y="-23" relative="1" as="geometry">
            <mxPoint x="-1035.1666666666665" y="727.372" as="sourcePoint" />
            <mxPoint x="-90.5" y="727.3719999999998" as="targetPoint" />
            <mxPoint as="offset" />
          </mxGeometry>
        </mxCell>
        <mxCell id="iz6BomqZgV8wwgHXzJbM-84" value="" style="html=1;points=[];perimeter=orthogonalPerimeter;fillColor=none;" parent="1" vertex="1">
          <mxGeometry x="-1039" y="110" width="10" height="50" as="geometry" />
        </mxCell>
        <mxCell id="iz6BomqZgV8wwgHXzJbM-85" value="Get Dashboard" style="verticalAlign=bottom;endArrow=block;shadow=0;strokeWidth=1;exitX=0.475;exitY=0.317;exitDx=0;exitDy=0;exitPerimeter=0;" parent="1" edge="1">
          <mxGeometry x="-0.0968" relative="1" as="geometry">
            <mxPoint x="-1189" y="407.99999999999994" as="sourcePoint" />
            <mxPoint x="-1034.5" y="408" as="targetPoint" />
            <mxPoint as="offset" />
          </mxGeometry>
        </mxCell>
        <mxCell id="iz6BomqZgV8wwgHXzJbM-61" value="Activate Dashboard &#xa;(with signed agreement)" style="verticalAlign=bottom;endArrow=block;shadow=0;strokeWidth=1;exitX=0.488;exitY=0.177;exitDx=0;exitDy=0;exitPerimeter=0;" parent="1" source="3nuBFxr9cyL0pnOWT2aG-1" target="iz6BomqZgV8wwgHXzJbM-19" edge="1">
          <mxGeometry x="0.0196" relative="1" as="geometry">
            <mxPoint x="-1190.5033333333336" y="220.0000000000001" as="sourcePoint" />
            <mxPoint x="-1089" y="220.0000000000001" as="targetPoint" />
            <mxPoint as="offset" />
          </mxGeometry>
        </mxCell>
        <mxCell id="3nuBFxr9cyL0pnOWT2aG-8" value="Agreement for Dashboard" style="verticalAlign=bottom;endArrow=block;shadow=0;strokeWidth=1;entryX=0.508;entryY=0.126;entryDx=0;entryDy=0;entryPerimeter=0;" parent="1" edge="1">
          <mxGeometry relative="1" as="geometry">
            <mxPoint x="-1034.5" y="147" as="sourcePoint" />
            <mxPoint x="-1188.36" y="147" as="targetPoint" />
          </mxGeometry>
        </mxCell>
        <mxCell id="iz6BomqZgV8wwgHXzJbM-27" value="Request Jane&#39;s financial transactions &#xa;(inc. signed Agreement for Bank(i))" style="verticalAlign=bottom;endArrow=block;shadow=0;strokeWidth=1;entryX=0.495;entryY=0.754;entryDx=0;entryDy=0;entryPerimeter=0;" parent="1" source="3nuBFxr9cyL0pnOWT2aG-5" target="iz6BomqZgV8wwgHXzJbM-5" edge="1">
          <mxGeometry x="0.0131" y="-13" relative="1" as="geometry">
            <mxPoint x="-1029" y="444" as="sourcePoint" />
            <mxPoint x="-729.5" y="444" as="targetPoint" />
            <mxPoint x="1" as="offset" />
          </mxGeometry>
        </mxCell>
        <mxCell id="iz6BomqZgV8wwgHXzJbM-29" value="&lt;font style=&quot;font-size: 11px&quot;&gt;Aggregate&amp;nbsp;&lt;br&gt;Jane&#39;s data&lt;/font&gt;" style="edgeStyle=orthogonalEdgeStyle;html=1;align=left;spacingLeft=2;endArrow=block;rounded=0;fontSize=9;fillColor=none;labelBackgroundColor=default;" parent="1" edge="1">
          <mxGeometry x="0.6317" y="-20" relative="1" as="geometry">
            <mxPoint x="-1034.3333333333335" y="492" as="sourcePoint" />
            <Array as="points">
              <mxPoint x="-969" y="492" />
              <mxPoint x="-969" y="532" />
            </Array>
            <mxPoint x="-1034.3333333333335" y="532" as="targetPoint" />
            <mxPoint as="offset" />
          </mxGeometry>
        </mxCell>
        <mxCell id="iz6BomqZgV8wwgHXzJbM-60" value="" style="verticalAlign=bottom;endArrow=block;shadow=0;strokeWidth=1;exitX=0.475;exitY=0.317;exitDx=0;exitDy=0;exitPerimeter=0;entryX=-0.3;entryY=0.449;entryDx=0;entryDy=0;entryPerimeter=0;" parent="1" edge="1">
          <mxGeometry x="-0.3735" y="-17" relative="1" as="geometry">
            <mxPoint x="-1189" y="364.99999999999994" as="sourcePoint" />
            <mxPoint x="-1034" y="365.5470000000001" as="targetPoint" />
            <mxPoint as="offset" />
          </mxGeometry>
        </mxCell>
        <mxCell id="iz6BomqZgV8wwgHXzJbM-75" value="Signed Agreement&#xa;for Dashboard" style="verticalAlign=top;endArrow=block;shadow=0;strokeWidth=1;entryX=0.475;entryY=0.151;entryDx=0;entryDy=0;entryPerimeter=0;fillColor=none;exitX=0.511;exitY=0.152;exitDx=0;exitDy=0;exitPerimeter=0;" parent="1" edge="1">
          <mxGeometry x="-0.0979" relative="1" as="geometry">
            <mxPoint x="-1293.01" y="198.48000000000002" as="sourcePoint" />
            <mxPoint x="-1191" y="199" as="targetPoint" />
            <mxPoint as="offset" />
          </mxGeometry>
        </mxCell>
        <mxCell id="iz6BomqZgV8wwgHXzJbM-89" value="" style="verticalAlign=bottom;endArrow=block;shadow=0;strokeWidth=1;entryX=0.5;entryY=0.526;entryDx=0;entryDy=0;entryPerimeter=0;" parent="1" edge="1">
          <mxGeometry relative="1" as="geometry">
            <mxPoint x="-1189" y="658" as="sourcePoint" />
            <mxPoint x="-1294" y="658.74" as="targetPoint" />
          </mxGeometry>
        </mxCell>
        <mxCell id="iz6BomqZgV8wwgHXzJbM-47" value="Aggregate / rank&lt;br&gt;proposals" style="html=1;verticalAlign=middle;endArrow=block;rounded=0;fontSize=11;strokeColor=#000000;align=center;" parent="1" edge="1">
          <mxGeometry x="0.0116" width="80" relative="1" as="geometry">
            <mxPoint x="-1034.9285714285716" y="1018.9999999999998" as="sourcePoint" />
            <mxPoint x="-1034.9285714285716" y="1058.9999999999998" as="targetPoint" />
            <Array as="points">
              <mxPoint x="-969" y="1019" />
              <mxPoint x="-969" y="1059" />
            </Array>
            <mxPoint as="offset" />
          </mxGeometry>
        </mxCell>
        <mxCell id="iz6BomqZgV8wwgHXzJbM-46" value="Get Loan Proposal" style="verticalAlign=bottom;endArrow=block;shadow=0;strokeWidth=1;entryX=0.509;entryY=0.862;entryDx=0;entryDy=0;entryPerimeter=0;" parent="1" edge="1">
          <mxGeometry relative="1" as="geometry">
            <mxPoint x="-1034.9285714285716" y="992.3799999999999" as="sourcePoint" />
            <mxPoint x="-553.0099999999998" y="992.3799999999999" as="targetPoint" />
          </mxGeometry>
        </mxCell>
        <mxCell id="iz6BomqZgV8wwgHXzJbM-64" value="Review the various DPD&lt;br&gt;Select Credit Institutions" style="edgeStyle=orthogonalEdgeStyle;html=1;align=left;spacingLeft=2;endArrow=block;rounded=0;" parent="1" edge="1">
          <mxGeometry x="0.5884" y="-20" relative="1" as="geometry">
            <mxPoint x="-1034.9285714285716" y="739.0000000000002" as="sourcePoint" />
            <Array as="points">
              <mxPoint x="-969" y="739" />
              <mxPoint x="-969" y="779" />
            </Array>
            <mxPoint x="-1034.9285714285716" y="779.0000000000002" as="targetPoint" />
            <mxPoint as="offset" />
          </mxGeometry>
        </mxCell>
        <mxCell id="iz6BomqZgV8wwgHXzJbM-86" value="&lt;font style=&quot;font-size: 11px&quot;&gt;Jane&#39;s dashboard&lt;/font&gt;" style="html=1;verticalAlign=bottom;endArrow=open;dashed=1;endSize=8;rounded=0;fontSize=9;strokeColor=#000000;entryX=0.488;entryY=0.448;entryDx=0;entryDy=0;entryPerimeter=0;exitX=0.5;exitY=0.441;exitDx=0;exitDy=0;exitPerimeter=0;" parent="1" source="3nuBFxr9cyL0pnOWT2aG-5" target="3nuBFxr9cyL0pnOWT2aG-1" edge="1">
          <mxGeometry relative="1" as="geometry">
            <mxPoint x="-1034" y="533.0000000000002" as="sourcePoint" />
            <mxPoint x="-1189.3333333333335" y="533.0000000000002" as="targetPoint" />
          </mxGeometry>
        </mxCell>
        <mxCell id="iz6BomqZgV8wwgHXzJbM-97" value="Activate LoanBrokering&#xa;(with signed consent)" style="verticalAlign=bottom;endArrow=block;shadow=0;strokeWidth=1;entryX=0.5;entryY=0.577;entryDx=0;entryDy=0;entryPerimeter=0;" parent="1" edge="1">
          <mxGeometry x="0.0252" y="-34" relative="1" as="geometry">
            <mxPoint x="-1189.9285714285716" y="716" as="sourcePoint" />
            <mxPoint x="-1034" y="716" as="targetPoint" />
            <mxPoint as="offset" />
          </mxGeometry>
        </mxCell>
        <mxCell id="iz6BomqZgV8wwgHXzJbM-51" value="" style="html=1;verticalAlign=bottom;endArrow=open;dashed=1;endSize=8;rounded=0;fontSize=9;strokeColor=#000000;" parent="1" source="iz6BomqZgV8wwgHXzJbM-5" target="3nuBFxr9cyL0pnOWT2aG-5" edge="1">
          <mxGeometry relative="1" as="geometry">
            <mxPoint x="-735.6700000000001" y="425.3900000000001" as="sourcePoint" />
            <mxPoint x="-1024" y="424.9000000000001" as="targetPoint" />
            <Array as="points">
              <mxPoint x="-760" y="470" />
            </Array>
          </mxGeometry>
        </mxCell>
        <mxCell id="iz6BomqZgV8wwgHXzJbM-94" value="Request Dashboard Service" style="verticalAlign=bottom;endArrow=block;shadow=0;strokeWidth=1;entryX=0.5;entryY=0.091;entryDx=0;entryDy=0;entryPerimeter=0;" parent="1" edge="1">
          <mxGeometry x="0.0196" relative="1" as="geometry">
            <mxPoint x="-1189.6764705882351" y="123" as="sourcePoint" />
            <mxPoint x="-1034" y="123" as="targetPoint" />
            <mxPoint as="offset" />
          </mxGeometry>
        </mxCell>
        <mxCell id="iz6BomqZgV8wwgHXzJbM-5" value="Bank(i)&#xa;as Data Product &#xa;Provider" style="shape=umlLifeline;perimeter=lifelinePerimeter;container=0;collapsible=0;recursiveResize=0;rounded=0;shadow=0;strokeWidth=1;" parent="1" vertex="1">
          <mxGeometry x="-779" y="40" width="100" height="540" as="geometry" />
        </mxCell>
        <mxCell id="iz6BomqZgV8wwgHXzJbM-83" value="Signed Agreement&#xa;for Bank(i)" style="verticalAlign=top;endArrow=block;shadow=0;strokeWidth=1;dashed=1;" parent="1" source="iz6BomqZgV8wwgHXzJbM-1" edge="1">
          <mxGeometry x="0.0415" relative="1" as="geometry">
            <mxPoint x="-1296.16" y="364.68000000000006" as="sourcePoint" />
            <mxPoint x="-1190" y="365" as="targetPoint" />
            <mxPoint as="offset" />
          </mxGeometry>
        </mxCell>
        <mxCell id="iz6BomqZgV8wwgHXzJbM-95" value="Request LoanBrokering &#xa;Service" style="verticalAlign=bottom;endArrow=block;shadow=0;strokeWidth=1;exitX=0.513;exitY=0.531;exitDx=0;exitDy=0;exitPerimeter=0;" parent="1" source="3nuBFxr9cyL0pnOWT2aG-1" edge="1">
          <mxGeometry x="0.0196" relative="1" as="geometry">
            <mxPoint x="-1180" y="639" as="sourcePoint" />
            <mxPoint x="-1034" y="629" as="targetPoint" />
            <mxPoint as="offset" />
          </mxGeometry>
        </mxCell>
        <mxCell id="iz6BomqZgV8wwgHXzJbM-88" value="Agreement for Loanbrokering" style="verticalAlign=bottom;endArrow=block;shadow=0;strokeWidth=1;exitX=0.491;exitY=0.522;exitDx=0;exitDy=0;exitPerimeter=0;entryX=0.5;entryY=0.522;entryDx=0;entryDy=0;entryPerimeter=0;" parent="1" edge="1">
          <mxGeometry relative="1" as="geometry">
            <mxPoint x="-1034.9899999999998" y="655" as="sourcePoint" />
            <mxPoint x="-1189" y="655" as="targetPoint" />
          </mxGeometry>
        </mxCell>
        <mxCell id="3" value="" style="html=1;points=[];perimeter=orthogonalPerimeter;fillColor=none;" parent="1" vertex="1">
          <mxGeometry x="-1039" y="400" width="10" height="160" as="geometry" />
        </mxCell>
        <mxCell id="FXN2Bj1WnniETb85nXx2-3" value="" style="html=1;verticalAlign=bottom;endArrow=open;dashed=1;endSize=8;rounded=0;fontSize=11;strokeColor=#000000;" parent="1" target="iz6BomqZgV8wwgHXzJbM-1" edge="1">
          <mxGeometry relative="1" as="geometry">
            <mxPoint x="-229.5" y="348" as="sourcePoint" />
            <mxPoint x="-1250" y="348" as="targetPoint" />
          </mxGeometry>
        </mxCell>
        <mxCell id="FXN2Bj1WnniETb85nXx2-4" value="Agreement signature &amp; notarisation" style="verticalAlign=bottom;endArrow=block;shadow=0;strokeWidth=1;" parent="1" target="iz6BomqZgV8wwgHXzJbM-66" edge="1">
          <mxGeometry relative="1" as="geometry">
            <mxPoint x="-1290" y="340" as="sourcePoint" />
            <mxPoint x="-225.5" y="340" as="targetPoint" />
            <Array as="points">
              <mxPoint x="-1290" y="340" />
            </Array>
          </mxGeometry>
        </mxCell>
        <mxCell id="FXN2Bj1WnniETb85nXx2-5" value="Check &quot;DashBoard Service&quot; Agreement validity" style="verticalAlign=bottom;endArrow=block;shadow=0;strokeWidth=1;" parent="1" target="iz6BomqZgV8wwgHXzJbM-66" edge="1">
          <mxGeometry x="0.1301" relative="1" as="geometry">
            <mxPoint x="-1034" y="420" as="sourcePoint" />
            <mxPoint x="-719.5" y="457.1600000000001" as="targetPoint" />
            <mxPoint as="offset" />
          </mxGeometry>
        </mxCell>
        <mxCell id="FXN2Bj1WnniETb85nXx2-6" value="Check &quot;DashBoard Service&quot; Agreement validity" style="verticalAlign=bottom;endArrow=block;shadow=0;strokeWidth=1;entryX=0.497;entryY=0.423;entryDx=0;entryDy=0;entryPerimeter=0;" parent="1" source="iz6BomqZgV8wwgHXzJbM-5" target="iz6BomqZgV8wwgHXzJbM-66" edge="1">
          <mxGeometry relative="1" as="geometry">
            <mxPoint x="-1024.3333333333335" y="433.13" as="sourcePoint" />
            <mxPoint x="-220.29999999999973" y="433.13" as="targetPoint" />
          </mxGeometry>
        </mxCell>
        <mxCell id="FXN2Bj1WnniETb85nXx2-8" value="" style="html=1;verticalAlign=bottom;endArrow=open;dashed=1;endSize=8;rounded=0;fontSize=11;strokeColor=#000000;" parent="1" source="iz6BomqZgV8wwgHXzJbM-66" edge="1">
          <mxGeometry relative="1" as="geometry">
            <mxPoint x="-234.49999999999955" y="183" as="sourcePoint" />
            <mxPoint x="-1293" y="183" as="targetPoint" />
          </mxGeometry>
        </mxCell>
        <mxCell id="FXN2Bj1WnniETb85nXx2-9" value="" style="html=1;verticalAlign=bottom;endArrow=open;dashed=1;endSize=8;rounded=0;fontSize=11;strokeColor=#000000;" parent="1" source="iz6BomqZgV8wwgHXzJbM-66" target="9igQDUlaKGqJAjwGfmc6-4" edge="1">
          <mxGeometry relative="1" as="geometry">
            <mxPoint x="-274.17" y="668.0000000000001" as="sourcePoint" />
            <mxPoint x="-1339.0033333333336" y="668.0000000000001" as="targetPoint" />
            <Array as="points">
              <mxPoint x="-1250" y="680" />
            </Array>
          </mxGeometry>
        </mxCell>
        <mxCell id="FXN2Bj1WnniETb85nXx2-10" value="Agreement signature &amp; notarisation" style="verticalAlign=bottom;endArrow=block;shadow=0;strokeWidth=1;" parent="1" source="iz6BomqZgV8wwgHXzJbM-1" target="iz6BomqZgV8wwgHXzJbM-66" edge="1">
          <mxGeometry relative="1" as="geometry">
            <mxPoint x="-1334.67" y="660" as="sourcePoint" />
            <mxPoint x="-270.17" y="660" as="targetPoint" />
            <Array as="points">
              <mxPoint x="-1290" y="670" />
            </Array>
          </mxGeometry>
        </mxCell>
        <mxCell id="FXN2Bj1WnniETb85nXx2-11" value="Request Loan Proposal" style="verticalAlign=bottom;endArrow=block;shadow=0;strokeWidth=1;" parent="1" source="3nuBFxr9cyL0pnOWT2aG-5" edge="1">
          <mxGeometry relative="1" as="geometry">
            <mxPoint x="-1025.1666666666665" y="737.3719999999998" as="sourcePoint" />
            <mxPoint x="-554" y="880" as="targetPoint" />
          </mxGeometry>
        </mxCell>
        <mxCell id="FXN2Bj1WnniETb85nXx2-12" value="" style="verticalAlign=bottom;endArrow=block;shadow=0;strokeWidth=1;entryX=0.492;entryY=0.841;entryDx=0;entryDy=0;entryPerimeter=0;" parent="1" source="iz6BomqZgV8wwgHXzJbM-7" target="iz6BomqZgV8wwgHXzJbM-9" edge="1">
          <mxGeometry relative="1" as="geometry">
            <mxPoint x="-1024.5" y="890" as="sourcePoint" />
            <mxPoint x="-544" y="890" as="targetPoint" />
          </mxGeometry>
        </mxCell>
        <mxCell id="zHcgugQnksoFF_NFCvLK-4" value="Check &quot;LoanBrokering&quot; Agreement validity" style="verticalAlign=bottom;endArrow=block;shadow=0;strokeWidth=1;exitX=0.9;exitY=0.19;exitDx=0;exitDy=0;exitPerimeter=0;" parent="1" source="iz6BomqZgV8wwgHXzJbM-37" target="iz6BomqZgV8wwgHXzJbM-66" edge="1">
          <mxGeometry x="0.1301" relative="1" as="geometry">
            <mxPoint x="-1039" y="690" as="sourcePoint" />
            <mxPoint x="-235.5" y="690" as="targetPoint" />
            <mxPoint as="offset" />
          </mxGeometry>
        </mxCell>
      </root>
    </mxGraphModel>
  </diagram>
</mxfile>
