<mxfile host="app.diagrams.net" modified="2024-05-16T09:27:37.907Z" agent="Mozilla/5.0 (Windows NT 10.0; Win64; x64) AppleWebKit/537.36 (KHTML, like Gecko) Chrome/124.0.0.0 Safari/537.36" etag="5u_l2v7uFhKmupyRb3rI" version="24.4.2" type="device">
  <diagram id="PQsIrTk9AEA1yJ4AET9J" name="Main">
    <mxGraphModel dx="1050" dy="-218" grid="1" gridSize="10" guides="1" tooltips="1" connect="1" arrows="1" fold="1" page="1" pageScale="1" pageWidth="1169" pageHeight="827" math="0" shadow="0">
      <root>
        <mxCell id="-WpIlOUu-dirKlklOnX_-0" />
        <mxCell id="-WpIlOUu-dirKlklOnX_-1" parent="-WpIlOUu-dirKlklOnX_-0" />
        <mxCell id="0xoxwfwinay00_8SYfpg-3" value="" style="rounded=0;whiteSpace=wrap;html=1;strokeColor=#FFFFFF;fillColor=#CCFFCC;" parent="-WpIlOUu-dirKlklOnX_-1" vertex="1">
          <mxGeometry x="620" y="1670" width="220" height="20" as="geometry" />
        </mxCell>
        <mxCell id="0xoxwfwinay00_8SYfpg-2" value="" style="rounded=0;whiteSpace=wrap;html=1;strokeColor=#FFFFFF;fillColor=#DAE8FC;" parent="-WpIlOUu-dirKlklOnX_-1" vertex="1">
          <mxGeometry x="620" y="1639.75" width="200" height="20" as="geometry" />
        </mxCell>
        <mxCell id="nJnasyYV8iAriuF3crtY-27" value="" style="verticalLabelPosition=bottom;verticalAlign=top;html=1;shape=mxgraph.basic.rect;fillColor2=none;strokeWidth=1;size=20;indent=5;rounded=0;sketch=0;fontSize=20;fillColor=none;" parent="-WpIlOUu-dirKlklOnX_-1" vertex="1">
          <mxGeometry x="790" y="3350" width="970" height="130" as="geometry" />
        </mxCell>
        <mxCell id="nJnasyYV8iAriuF3crtY-25" style="edgeStyle=orthogonalEdgeStyle;curved=0;rounded=1;sketch=0;orthogonalLoop=1;jettySize=auto;html=1;exitX=0.75;exitY=0;exitDx=0;exitDy=0;fontSize=20;entryX=0;entryY=0.5;entryDx=0;entryDy=0;" parent="-WpIlOUu-dirKlklOnX_-1" source="-WpIlOUu-dirKlklOnX_-3" target="-WpIlOUu-dirKlklOnX_-27" edge="1">
          <mxGeometry relative="1" as="geometry">
            <mxPoint x="820" y="1840" as="targetPoint" />
          </mxGeometry>
        </mxCell>
        <mxCell id="-WpIlOUu-dirKlklOnX_-3" value="Participant" style="swimlane;fontStyle=3;childLayout=stackLayout;horizontal=1;startSize=26;fillColor=#dae8fc;horizontalStack=0;resizeParent=1;resizeParentMax=0;resizeLast=0;collapsible=1;marginBottom=0;strokeColor=#6c8ebf;fontSize=16;align=center;" parent="-WpIlOUu-dirKlklOnX_-1" vertex="1">
          <mxGeometry x="747.25" y="1790" width="140" height="78" as="geometry">
            <mxRectangle x="640" y="10" width="90" height="26" as="alternateBounds" />
          </mxGeometry>
        </mxCell>
        <mxCell id="-WpIlOUu-dirKlklOnX_-4" value="identified " style="text;strokeColor=none;fillColor=none;align=center;verticalAlign=top;spacingLeft=4;spacingRight=4;overflow=hidden;rotatable=0;points=[[0,0.5],[1,0.5]];portConstraint=eastwest;" parent="-WpIlOUu-dirKlklOnX_-3" vertex="1">
          <mxGeometry y="26" width="140" height="26" as="geometry" />
        </mxCell>
        <mxCell id="-WpIlOUu-dirKlklOnX_-5" value="authorized" style="text;strokeColor=none;fillColor=none;align=center;verticalAlign=top;spacingLeft=4;spacingRight=4;overflow=hidden;rotatable=0;points=[[0,0.5],[1,0.5]];portConstraint=eastwest;" parent="-WpIlOUu-dirKlklOnX_-3" vertex="1">
          <mxGeometry y="52" width="140" height="26" as="geometry" />
        </mxCell>
        <mxCell id="-WpIlOUu-dirKlklOnX_-16" style="edgeStyle=orthogonalEdgeStyle;rounded=1;orthogonalLoop=1;jettySize=auto;html=1;endSize=12;" parent="-WpIlOUu-dirKlklOnX_-1" target="-WpIlOUu-dirKlklOnX_-39" edge="1">
          <mxGeometry relative="1" as="geometry">
            <Array as="points" />
            <mxPoint x="1207" y="2680" as="sourcePoint" />
          </mxGeometry>
        </mxCell>
        <mxCell id="LT_-Wd7cu-P7tVOZNdv3-45" style="edgeStyle=orthogonalEdgeStyle;rounded=0;orthogonalLoop=1;jettySize=auto;html=1;exitX=1;exitY=0.5;exitDx=0;exitDy=0;entryX=1;entryY=0.5;entryDx=0;entryDy=0;" parent="-WpIlOUu-dirKlklOnX_-1" source="-WpIlOUu-dirKlklOnX_-27" target="LT_-Wd7cu-P7tVOZNdv3-1" edge="1">
          <mxGeometry relative="1" as="geometry">
            <Array as="points">
              <mxPoint x="1420" y="1746" />
              <mxPoint x="1420" y="2644" />
            </Array>
          </mxGeometry>
        </mxCell>
        <mxCell id="-WpIlOUu-dirKlklOnX_-27" value="End user / Provider" style="swimlane;fontStyle=3;childLayout=stackLayout;horizontal=1;startSize=50;fillColor=#CCFFCC;horizontalStack=0;resizeParent=1;resizeParentMax=0;resizeLast=0;collapsible=1;marginBottom=0;fontSize=16;strokeColor=#82b366;" parent="-WpIlOUu-dirKlklOnX_-1" vertex="1">
          <mxGeometry x="1080" y="1720" width="240" height="70" as="geometry">
            <mxRectangle x="1489" y="3314" width="90" height="26" as="alternateBounds" />
          </mxGeometry>
        </mxCell>
        <mxCell id="nJnasyYV8iAriuF3crtY-1" value="&lt;font style=&quot;font-size: 14px&quot;&gt;Request a service or a solution&lt;/font&gt;" style="text;html=1;align=center;verticalAlign=middle;resizable=0;points=[];autosize=1;strokeColor=none;fillColor=none;" parent="-WpIlOUu-dirKlklOnX_-27" vertex="1">
          <mxGeometry y="50" width="240" height="20" as="geometry" />
        </mxCell>
        <mxCell id="-WpIlOUu-dirKlklOnX_-36" style="edgeStyle=orthogonalEdgeStyle;rounded=0;orthogonalLoop=1;jettySize=auto;html=1;startArrow=none;startFill=0;startSize=12;endArrow=classic;endFill=1;endSize=12;entryX=0;entryY=0.25;entryDx=0;entryDy=0;exitX=0.5;exitY=1.036;exitDx=0;exitDy=0;exitPerimeter=0;" parent="-WpIlOUu-dirKlklOnX_-1" source="nJnasyYV8iAriuF3crtY-4" target="zM3tTEwaH6NU_oMfZcbb-59" edge="1">
          <mxGeometry relative="1" as="geometry">
            <mxPoint x="632.25" y="1876.75" as="sourcePoint" />
            <mxPoint x="632.25" y="2010.75" as="targetPoint" />
            <Array as="points">
              <mxPoint x="817" y="2323" />
            </Array>
          </mxGeometry>
        </mxCell>
        <mxCell id="-WpIlOUu-dirKlklOnX_-38" value="Operator" style="swimlane;fontStyle=1;childLayout=stackLayout;horizontal=1;startSize=36;fillColor=#dae8fc;horizontalStack=0;resizeParent=1;resizeParentMax=0;resizeLast=0;collapsible=1;marginBottom=0;strokeColor=#6c8ebf;fontSize=16;" parent="-WpIlOUu-dirKlklOnX_-1" vertex="1">
          <mxGeometry x="700.88" y="1970" width="232.75" height="86" as="geometry">
            <mxRectangle x="640" y="10" width="90" height="26" as="alternateBounds" />
          </mxGeometry>
        </mxCell>
        <mxCell id="nJnasyYV8iAriuF3crtY-4" value="&lt;font style=&quot;font-size: 16px&quot;&gt;Operates the&lt;br&gt;Federation of Services&lt;/font&gt;" style="text;html=1;align=center;verticalAlign=middle;resizable=0;points=[];autosize=1;strokeColor=none;fillColor=none;" parent="-WpIlOUu-dirKlklOnX_-38" vertex="1">
          <mxGeometry y="36" width="232.75" height="50" as="geometry" />
        </mxCell>
        <mxCell id="-WpIlOUu-dirKlklOnX_-39" value="Contract" style="swimlane;fontStyle=1;childLayout=stackLayout;horizontal=1;startSize=26;horizontalStack=0;resizeParent=1;resizeParentMax=0;resizeLast=0;collapsible=1;marginBottom=0;fillColor=#d5e8d4;strokeColor=#82b366;" parent="-WpIlOUu-dirKlklOnX_-1" vertex="1">
          <mxGeometry x="1134" y="2740" width="146" height="80" as="geometry" />
        </mxCell>
        <mxCell id="-WpIlOUu-dirKlklOnX_-40" value="date" style="text;align=center;verticalAlign=top;spacingLeft=4;spacingRight=4;overflow=hidden;rotatable=0;points=[[0,0.5],[1,0.5]];portConstraint=eastwest;" parent="-WpIlOUu-dirKlklOnX_-39" vertex="1">
          <mxGeometry y="26" width="146" height="24" as="geometry" />
        </mxCell>
        <mxCell id="-WpIlOUu-dirKlklOnX_-41" value="rights &amp; obligations" style="text;strokeColor=none;fillColor=none;align=center;verticalAlign=top;spacingLeft=4;spacingRight=4;overflow=hidden;rotatable=0;points=[[0,0.5],[1,0.5]];portConstraint=eastwest;" parent="-WpIlOUu-dirKlklOnX_-39" vertex="1">
          <mxGeometry y="50" width="146" height="30" as="geometry" />
        </mxCell>
        <mxCell id="-WpIlOUu-dirKlklOnX_-83" value="&lt;div&gt;&lt;u&gt;Legend:&lt;/u&gt;&lt;/div&gt;&lt;div style=&quot;text-align: left&quot;&gt;&lt;u&gt;&lt;br&gt;&lt;/u&gt;&lt;/div&gt;&lt;div style=&quot;text-align: left&quot;&gt;&lt;span style=&quot;background-color: rgb(216 , 233 , 251)&quot;&gt;Blue backgroud&lt;/span&gt;: &lt;span&gt;within Gaia-X scope&lt;/span&gt;&lt;/div&gt;&lt;div style=&quot;text-align: left&quot;&gt;&lt;span&gt;&lt;br&gt;&lt;/span&gt;&lt;/div&gt;&lt;div style=&quot;text-align: left&quot;&gt;Green background: outside Gaia-X scope&lt;br&gt;&lt;/div&gt;" style="text;html=1;strokeColor=none;fillColor=none;align=center;verticalAlign=middle;whiteSpace=wrap;rounded=0;" parent="-WpIlOUu-dirKlklOnX_-1" vertex="1">
          <mxGeometry x="600" y="1590" width="261" height="119.5" as="geometry" />
        </mxCell>
        <mxCell id="-WpIlOUu-dirKlklOnX_-85" value="*" style="text;html=1;align=center;verticalAlign=middle;resizable=0;points=[];autosize=1;" parent="-WpIlOUu-dirKlklOnX_-1" vertex="1">
          <mxGeometry x="899.13" y="2068" width="20" height="20" as="geometry" />
        </mxCell>
        <mxCell id="doZnjEXnIsl8Ogr9NGfD-2" value="Service Discovery" style="swimlane;fontStyle=1;childLayout=stackLayout;horizontal=1;startSize=26;horizontalStack=0;resizeParent=1;resizeParentMax=0;resizeLast=0;collapsible=1;marginBottom=0;fillColor=#dae8fc;strokeColor=#6c8ebf;" parent="-WpIlOUu-dirKlklOnX_-1" vertex="1">
          <mxGeometry x="1229" y="2015.75" width="175" height="96" as="geometry">
            <mxRectangle x="640" y="10" width="90" height="26" as="alternateBounds" />
          </mxGeometry>
        </mxCell>
        <mxCell id="zM3tTEwaH6NU_oMfZcbb-2" value="Parsing" style="text;html=1;align=center;verticalAlign=middle;resizable=0;points=[];autosize=1;" parent="doZnjEXnIsl8Ogr9NGfD-2" vertex="1">
          <mxGeometry y="26" width="175" height="20" as="geometry" />
        </mxCell>
        <mxCell id="zM3tTEwaH6NU_oMfZcbb-4" value="Matching" style="text;html=1;align=center;verticalAlign=middle;resizable=0;points=[];autosize=1;" parent="doZnjEXnIsl8Ogr9NGfD-2" vertex="1">
          <mxGeometry y="46" width="175" height="20" as="geometry" />
        </mxCell>
        <mxCell id="zM3tTEwaH6NU_oMfZcbb-5" value="Selection&lt;br&gt;(on constraints and criteria)" style="text;html=1;align=center;verticalAlign=middle;resizable=0;points=[];autosize=1;" parent="doZnjEXnIsl8Ogr9NGfD-2" vertex="1">
          <mxGeometry y="66" width="175" height="30" as="geometry" />
        </mxCell>
        <mxCell id="zM3tTEwaH6NU_oMfZcbb-52" value="Validates the&lt;br&gt;condition of&lt;br&gt;the selected&amp;nbsp;&lt;br&gt;Service" style="endArrow=none;endFill=0;endSize=12;html=1;edgeStyle=orthogonalEdgeStyle;startArrow=classic;startFill=1;targetPerimeterSpacing=6;sourcePerimeterSpacing=6;dashed=1;startSize=12;entryX=-0.024;entryY=0.133;entryDx=0;entryDy=0;entryPerimeter=0;" parent="-WpIlOUu-dirKlklOnX_-1" target="zM3tTEwaH6NU_oMfZcbb-59" edge="1">
          <mxGeometry width="160" relative="1" as="geometry">
            <mxPoint x="1130" y="1720" as="sourcePoint" />
            <mxPoint x="1000" y="2197.75" as="targetPoint" />
            <Array as="points">
              <mxPoint x="1130" y="1700" />
              <mxPoint x="1050" y="1700" />
              <mxPoint x="1050" y="2311" />
            </Array>
          </mxGeometry>
        </mxCell>
        <mxCell id="LT_-Wd7cu-P7tVOZNdv3-40" value="&lt;br&gt;&lt;span style=&quot;color: rgb(0 , 0 , 0) ; font-family: &amp;#34;helvetica&amp;#34; ; font-size: 11px ; font-style: normal ; font-weight: 400 ; letter-spacing: normal ; text-align: center ; text-indent: 0px ; text-transform: none ; word-spacing: 0px ; background-color: rgb(255 , 255 , 255) ; display: inline ; float: none&quot;&gt;conforms&lt;/span&gt;&lt;br style=&quot;color: rgb(0 , 0 , 0) ; font-family: &amp;#34;helvetica&amp;#34; ; font-size: 11px ; font-style: normal ; font-weight: 400 ; letter-spacing: normal ; text-align: center ; text-indent: 0px ; text-transform: none ; word-spacing: 0px&quot;&gt;&lt;span style=&quot;color: rgb(0 , 0 , 0) ; font-family: &amp;#34;helvetica&amp;#34; ; font-size: 11px ; font-style: normal ; font-weight: 400 ; letter-spacing: normal ; text-align: center ; text-indent: 0px ; text-transform: none ; word-spacing: 0px ; background-color: rgb(255 , 255 , 255) ; display: inline ; float: none&quot;&gt;[based on&lt;/span&gt;&lt;br style=&quot;color: rgb(0 , 0 , 0) ; font-family: &amp;#34;helvetica&amp;#34; ; font-size: 11px ; font-style: normal ; font-weight: 400 ; letter-spacing: normal ; text-align: center ; text-indent: 0px ; text-transform: none ; word-spacing: 0px&quot;&gt;&lt;span style=&quot;color: rgb(0 , 0 , 0) ; font-family: &amp;#34;helvetica&amp;#34; ; font-size: 11px ; font-style: normal ; font-weight: 400 ; letter-spacing: normal ; text-align: center ; text-indent: 0px ; text-transform: none ; word-spacing: 0px ; background-color: rgb(255 , 255 , 255) ; display: inline ; float: none&quot;&gt;denormalized&lt;/span&gt;&lt;br style=&quot;color: rgb(0 , 0 , 0) ; font-family: &amp;#34;helvetica&amp;#34; ; font-size: 11px ; font-style: normal ; font-weight: 400 ; letter-spacing: normal ; text-align: center ; text-indent: 0px ; text-transform: none ; word-spacing: 0px&quot;&gt;&lt;span style=&quot;color: rgb(0 , 0 , 0) ; font-family: &amp;#34;helvetica&amp;#34; ; font-size: 11px ; font-style: normal ; font-weight: 400 ; letter-spacing: normal ; text-align: center ; text-indent: 0px ; text-transform: none ; word-spacing: 0px ; background-color: rgb(255 , 255 , 255) ; display: inline ; float: none&quot;&gt;SO&#39;s SD]&lt;/span&gt;&lt;br&gt;" style="edgeStyle=orthogonalEdgeStyle;rounded=0;orthogonalLoop=1;jettySize=auto;html=1;exitX=0;exitY=0.5;exitDx=0;exitDy=0;entryX=0.534;entryY=0.025;entryDx=0;entryDy=0;entryPerimeter=0;" parent="-WpIlOUu-dirKlklOnX_-1" source="zM3tTEwaH6NU_oMfZcbb-59" target="LT_-Wd7cu-P7tVOZNdv3-22" edge="1">
          <mxGeometry x="-0.3478" y="-19" relative="1" as="geometry">
            <mxPoint as="offset" />
          </mxGeometry>
        </mxCell>
        <mxCell id="zM3tTEwaH6NU_oMfZcbb-59" value="Federation Services" style="swimlane;fontStyle=1;align=center;verticalAlign=top;childLayout=stackLayout;horizontal=1;startSize=26;horizontalStack=0;resizeParent=1;resizeParentMax=0;resizeLast=0;collapsible=1;marginBottom=0;fillColor=#dae8fc;strokeColor=#6c8ebf;fontSize=16;" parent="-WpIlOUu-dirKlklOnX_-1" vertex="1">
          <mxGeometry x="1129" y="2296.75" width="191" height="106" as="geometry" />
        </mxCell>
        <mxCell id="zM3tTEwaH6NU_oMfZcbb-60" value="Identity &amp;amp; Trust" style="text;html=1;align=center;verticalAlign=middle;resizable=0;points=[];autosize=1;" parent="zM3tTEwaH6NU_oMfZcbb-59" vertex="1">
          <mxGeometry y="26" width="191" height="20" as="geometry" />
        </mxCell>
        <mxCell id="zM3tTEwaH6NU_oMfZcbb-61" value="Catalogue" style="text;html=1;align=center;verticalAlign=middle;resizable=0;points=[];autosize=1;" parent="zM3tTEwaH6NU_oMfZcbb-59" vertex="1">
          <mxGeometry y="46" width="191" height="20" as="geometry" />
        </mxCell>
        <mxCell id="zM3tTEwaH6NU_oMfZcbb-62" value="Sovereign Data Exchange" style="text;html=1;align=center;verticalAlign=middle;resizable=0;points=[];autosize=1;" parent="zM3tTEwaH6NU_oMfZcbb-59" vertex="1">
          <mxGeometry y="66" width="191" height="20" as="geometry" />
        </mxCell>
        <mxCell id="zM3tTEwaH6NU_oMfZcbb-63" value="Compliance" style="text;html=1;align=center;verticalAlign=middle;resizable=0;points=[];autosize=1;" parent="zM3tTEwaH6NU_oMfZcbb-59" vertex="1">
          <mxGeometry y="86" width="191" height="20" as="geometry" />
        </mxCell>
        <mxCell id="zM3tTEwaH6NU_oMfZcbb-64" value="Searches in&amp;nbsp;&lt;br&gt;Service Catalogue" style="edgeStyle=orthogonalEdgeStyle;rounded=1;orthogonalLoop=1;jettySize=auto;html=1;startArrow=none;startFill=0;startSize=12;endArrow=classic;endFill=1;endSize=12;strokeColor=#000000;exitX=0.001;exitY=-0.076;exitDx=0;exitDy=0;exitPerimeter=0;" parent="-WpIlOUu-dirKlklOnX_-1" source="zM3tTEwaH6NU_oMfZcbb-5" edge="1">
          <mxGeometry relative="1" as="geometry">
            <Array as="points">
              <mxPoint x="1139" y="2080" />
              <mxPoint x="1139" y="2270" />
              <mxPoint x="1169" y="2270" />
            </Array>
            <mxPoint x="1179.98" y="2245.9139999999998" as="sourcePoint" />
            <mxPoint x="1169" y="2297" as="targetPoint" />
          </mxGeometry>
        </mxCell>
        <mxCell id="zM3tTEwaH6NU_oMfZcbb-66" value="" style="endArrow=none;endFill=0;endSize=12;html=1;edgeStyle=orthogonalEdgeStyle;startArrow=classic;startFill=1;targetPerimeterSpacing=6;sourcePerimeterSpacing=6;dashed=1;startSize=12;exitX=-0.012;exitY=0.551;exitDx=0;exitDy=0;exitPerimeter=0;" parent="-WpIlOUu-dirKlklOnX_-1" source="zM3tTEwaH6NU_oMfZcbb-5" edge="1">
          <mxGeometry width="160" relative="1" as="geometry">
            <mxPoint x="1169" y="2219.48" as="sourcePoint" />
            <mxPoint x="1243" y="2296" as="targetPoint" />
            <Array as="points">
              <mxPoint x="1199" y="2098" />
              <mxPoint x="1199" y="2280" />
              <mxPoint x="1243" y="2280" />
            </Array>
          </mxGeometry>
        </mxCell>
        <mxCell id="zM3tTEwaH6NU_oMfZcbb-67" value="Returns&amp;nbsp;&lt;br&gt;matching &lt;br&gt;service &lt;br&gt;offferings" style="edgeLabel;html=1;align=center;verticalAlign=middle;resizable=0;points=[];" parent="zM3tTEwaH6NU_oMfZcbb-66" vertex="1" connectable="0">
          <mxGeometry x="-0.4119" y="1" relative="1" as="geometry">
            <mxPoint x="-2" y="81" as="offset" />
          </mxGeometry>
        </mxCell>
        <mxCell id="zM3tTEwaH6NU_oMfZcbb-71" value="Selects&lt;br&gt;Negoitiates&lt;br&gt;Provider" style="edgeLabel;html=1;align=center;verticalAlign=middle;resizable=0;points=[];" parent="-WpIlOUu-dirKlklOnX_-1" vertex="1" connectable="0">
          <mxGeometry x="1440" y="2274.745294117647" as="geometry">
            <mxPoint x="-22" y="48" as="offset" />
          </mxGeometry>
        </mxCell>
        <mxCell id="zM3tTEwaH6NU_oMfZcbb-76" value="" style="endArrow=none;endFill=0;endSize=12;html=1;edgeStyle=orthogonalEdgeStyle;exitX=1;exitY=0.25;exitDx=0;exitDy=0;startArrow=classic;startFill=1;targetPerimeterSpacing=6;sourcePerimeterSpacing=6;dashed=1;startSize=12;entryX=0.986;entryY=1.122;entryDx=0;entryDy=0;entryPerimeter=0;" parent="-WpIlOUu-dirKlklOnX_-1" source="LT_-Wd7cu-P7tVOZNdv3-1" target="zM3tTEwaH6NU_oMfZcbb-60" edge="1">
          <mxGeometry width="160" relative="1" as="geometry">
            <mxPoint x="1335.6" y="2485.7960000000003" as="sourcePoint" />
            <mxPoint x="1300" y="2344.75" as="targetPoint" />
            <Array as="points">
              <mxPoint x="1390" y="2626" />
              <mxPoint x="1390" y="2345" />
            </Array>
          </mxGeometry>
        </mxCell>
        <mxCell id="zM3tTEwaH6NU_oMfZcbb-77" value="Send&lt;br&gt;credentials, &lt;br&gt;identity &lt;br&gt;and &lt;br&gt;access to &lt;br&gt;service &lt;br&gt;instances" style="edgeLabel;html=1;align=center;verticalAlign=middle;resizable=0;points=[];" parent="zM3tTEwaH6NU_oMfZcbb-76" vertex="1" connectable="0">
          <mxGeometry x="-0.4119" y="1" relative="1" as="geometry">
            <mxPoint x="-19" y="-162" as="offset" />
          </mxGeometry>
        </mxCell>
        <mxCell id="-sgH_u3aD0VonC3nqC-O-8" value="" style="edgeStyle=orthogonalEdgeStyle;rounded=0;orthogonalLoop=1;jettySize=auto;html=1;entryX=0.5;entryY=0;entryDx=0;entryDy=0;" parent="-WpIlOUu-dirKlklOnX_-1" source="pWIpgPFCMo9Slf4YioUr-6" target="-sgH_u3aD0VonC3nqC-O-2" edge="1">
          <mxGeometry relative="1" as="geometry" />
        </mxCell>
        <mxCell id="-sgH_u3aD0VonC3nqC-O-24" value="&lt;span style=&quot;color: rgba(0 , 0 , 0 , 0) ; font-family: monospace ; font-size: 0px ; background-color: rgb(248 , 249 , 250)&quot;&gt;%3CmxGraphModel%3E%3Croot%3E%3CmxCell%20id%3D%220%22%2F%3E%3CmxCell%20id%3D%221%22%20parent%3D%220%22%2F%3E%3CmxCell%20id%3D%222%22%20value%3D%22Configure%26amp%3Bnbsp%3B%20templates%20%26lt%3Bbr%26gt%3Bfrom%20generic%20to%20%26lt%3Bbr%26gt%3Bcustomized%22%20style%3D%22edgeLabel%3Bhtml%3D1%3Balign%3Dcenter%3BverticalAlign%3Dmiddle%3Bresizable%3D0%3Bpoints%3D%5B%5D%3B%22%20vertex%3D%221%22%20connectable%3D%220%22%20parent%3D%221%22%3E%3CmxGeometry%20x%3D%221047.4%22%20y%3D%223100%22%20as%3D%22geometry%22%2F%3E%3C%2FmxCell%3E%3C%2Froot%3E%3C%2FmxGraphModel%3E&lt;/span&gt;" style="edgeLabel;html=1;align=center;verticalAlign=middle;resizable=0;points=[];" parent="-sgH_u3aD0VonC3nqC-O-8" vertex="1" connectable="0">
          <mxGeometry x="-0.1953" y="2" relative="1" as="geometry">
            <mxPoint as="offset" />
          </mxGeometry>
        </mxCell>
        <mxCell id="-sgH_u3aD0VonC3nqC-O-25" value="&lt;span style=&quot;color: rgba(0 , 0 , 0 , 0) ; font-family: monospace ; font-size: 0px ; background-color: rgb(248 , 249 , 250)&quot;&gt;%3CmxGraphModel%3E%3Croot%3E%3CmxCell%20id%3D%220%22%2F%3E%3CmxCell%20id%3D%221%22%20parent%3D%220%22%2F%3E%3CmxCell%20id%3D%222%22%20value%3D%22Configure%26amp%3Bnbsp%3B%20templates%20%26lt%3Bbr%26gt%3Bfrom%20generic%20to%20%26lt%3Bbr%26gt%3Bcustomized%22%20style%3D%22edgeLabel%3Bhtml%3D1%3Balign%3Dcenter%3BverticalAlign%3Dmiddle%3Bresizable%3D0%3Bpoints%3D%5B%5D%3B%22%20vertex%3D%221%22%20connectable%3D%220%22%20parent%3D%221%22%3E%3CmxGeometry%20x%3D%221047.4%22%20y%3D%223100%22%20as%3D%22geometry%22%2F%3E%3C%2FmxCell%3E%3C%2Froot%3E%3C%2FmxGraphModel%3E&lt;/span&gt;" style="edgeLabel;html=1;align=center;verticalAlign=middle;resizable=0;points=[];" parent="-sgH_u3aD0VonC3nqC-O-8" vertex="1" connectable="0">
          <mxGeometry x="-0.2141" relative="1" as="geometry">
            <mxPoint as="offset" />
          </mxGeometry>
        </mxCell>
        <mxCell id="-sgH_u3aD0VonC3nqC-O-26" value="Configure templates&lt;br&gt;from generic to&lt;br&gt;customized" style="edgeLabel;html=1;align=center;verticalAlign=middle;resizable=0;points=[];" parent="-sgH_u3aD0VonC3nqC-O-8" vertex="1" connectable="0">
          <mxGeometry x="0.1435" y="-2" relative="1" as="geometry">
            <mxPoint x="2" y="-13" as="offset" />
          </mxGeometry>
        </mxCell>
        <mxCell id="pWIpgPFCMo9Slf4YioUr-6" value="Resource &amp; Interconnection&#xa; Templates" style="swimlane;fontStyle=3;childLayout=stackLayout;horizontal=1;startSize=50;horizontalStack=0;resizeParent=1;resizeParentMax=0;resizeLast=0;collapsible=1;marginBottom=0;fillColor=#CCFFCC;strokeColor=#82b366;fontSize=16;" parent="-WpIlOUu-dirKlklOnX_-1" vertex="1">
          <mxGeometry x="1130" y="3020" width="250" height="125" as="geometry" />
        </mxCell>
        <mxCell id="pWIpgPFCMo9Slf4YioUr-10" value="Node, switch, router templates" style="text;strokeColor=none;fillColor=none;align=center;verticalAlign=middle;spacingLeft=4;spacingRight=4;overflow=hidden;points=[[0,0.5],[1,0.5]];portConstraint=eastwest;rotatable=0;fontSize=12;" parent="pWIpgPFCMo9Slf4YioUr-6" vertex="1">
          <mxGeometry y="50" width="250" height="15" as="geometry" />
        </mxCell>
        <mxCell id="pWIpgPFCMo9Slf4YioUr-8" value="interconnection templates" style="text;strokeColor=none;fillColor=none;align=center;verticalAlign=middle;spacingLeft=4;spacingRight=4;overflow=hidden;points=[[0,0.5],[1,0.5]];portConstraint=eastwest;rotatable=0;fontSize=12;" parent="pWIpgPFCMo9Slf4YioUr-6" vertex="1">
          <mxGeometry y="65" width="250" height="20" as="geometry" />
        </mxCell>
        <mxCell id="pWIpgPFCMo9Slf4YioUr-9" value="endpoints, connetcion points" style="text;strokeColor=none;fillColor=none;align=center;verticalAlign=middle;spacingLeft=4;spacingRight=4;overflow=hidden;points=[[0,0.5],[1,0.5]];portConstraint=eastwest;rotatable=0;fontSize=12;" parent="pWIpgPFCMo9Slf4YioUr-6" vertex="1">
          <mxGeometry y="85" width="250" height="20" as="geometry" />
        </mxCell>
        <mxCell id="pWIpgPFCMo9Slf4YioUr-16" value="interconnections , etc." style="text;strokeColor=none;fillColor=none;align=center;verticalAlign=middle;spacingLeft=4;spacingRight=4;overflow=hidden;points=[[0,0.5],[1,0.5]];portConstraint=eastwest;rotatable=0;fontSize=12;" parent="pWIpgPFCMo9Slf4YioUr-6" vertex="1">
          <mxGeometry y="105" width="250" height="20" as="geometry" />
        </mxCell>
        <mxCell id="LT_-Wd7cu-P7tVOZNdv3-41" value="Returns Services &lt;br&gt;that&lt;br&gt;matching request" style="edgeStyle=orthogonalEdgeStyle;rounded=0;orthogonalLoop=1;jettySize=auto;html=1;exitX=0;exitY=0.25;exitDx=0;exitDy=0;entryX=0.25;entryY=1;entryDx=0;entryDy=0;" parent="-WpIlOUu-dirKlklOnX_-1" source="doZnjEXnIsl8Ogr9NGfD-2" target="-WpIlOUu-dirKlklOnX_-27" edge="1">
          <mxGeometry x="0.2771" relative="1" as="geometry">
            <mxPoint as="offset" />
          </mxGeometry>
        </mxCell>
        <mxCell id="LT_-Wd7cu-P7tVOZNdv3-43" value="&lt;br&gt;&lt;span style=&quot;color: rgb(0 , 0 , 0) ; font-family: &amp;#34;helvetica&amp;#34; ; font-size: 10px ; font-style: normal ; font-weight: 400 ; letter-spacing: normal ; text-align: center ; text-indent: 0px ; text-transform: none ; word-spacing: 0px ; background-color: rgb(248 , 249 , 250) ; display: inline ; float: none&quot;&gt;Parsed analyzed and &lt;br&gt;validated&lt;/span&gt;&lt;br style=&quot;color: rgb(0 , 0 , 0) ; font-family: &amp;#34;helvetica&amp;#34; ; font-size: 10px ; font-style: normal ; font-weight: 400 ; letter-spacing: normal ; text-align: center ; text-indent: 0px ; text-transform: none ; word-spacing: 0px ; background-color: rgb(248 , 249 , 250)&quot;&gt;&lt;span style=&quot;color: rgb(0 , 0 , 0) ; font-family: &amp;#34;helvetica&amp;#34; ; font-size: 10px ; font-style: normal ; font-weight: 400 ; letter-spacing: normal ; text-align: center ; text-indent: 0px ; text-transform: none ; word-spacing: 0px ; background-color: rgb(248 , 249 , 250) ; display: inline ; float: none&quot;&gt;Service request&lt;/span&gt;&lt;br&gt;" style="edgeStyle=orthogonalEdgeStyle;rounded=0;orthogonalLoop=1;jettySize=auto;html=1;exitX=0.783;exitY=1.4;exitDx=0;exitDy=0;exitPerimeter=0;" parent="-WpIlOUu-dirKlklOnX_-1" source="nJnasyYV8iAriuF3crtY-1" target="doZnjEXnIsl8Ogr9NGfD-2" edge="1">
          <mxGeometry relative="1" as="geometry">
            <mxPoint x="1305" y="1865.75" as="sourcePoint" />
          </mxGeometry>
        </mxCell>
        <object label="Service Offering DB" placeholders="1" id="LT_-Wd7cu-P7tVOZNdv3-1">
          <mxCell style="swimlane;fontStyle=1;childLayout=stackLayout;horizontal=1;startSize=30;fillColor=#dae8fc;horizontalStack=0;resizeParent=1;resizeParentMax=0;resizeLast=0;collapsible=1;marginBottom=0;strokeColor=#6c8ebf;fontSize=16;" parent="-WpIlOUu-dirKlklOnX_-1" vertex="1">
            <mxGeometry x="1070" y="2608.75" width="270" height="70" as="geometry">
              <mxRectangle x="1095" y="3140" width="130" height="26" as="alternateBounds" />
            </mxGeometry>
          </mxCell>
        </object>
        <mxCell id="LT_-Wd7cu-P7tVOZNdv3-2" value="&lt;span style=&quot;font-weight: 700&quot;&gt;List of Providers&lt;/span&gt;" style="text;html=1;align=center;verticalAlign=middle;resizable=0;points=[];autosize=1;fillColor=#fff2cc;strokeColor=#d6b656;" parent="LT_-Wd7cu-P7tVOZNdv3-1" vertex="1">
          <mxGeometry y="30" width="270" height="20" as="geometry" />
        </mxCell>
        <mxCell id="LT_-Wd7cu-P7tVOZNdv3-3" value="terms, conditions, policies" style="text;html=1;align=center;verticalAlign=middle;resizable=0;points=[];autosize=1;" parent="LT_-Wd7cu-P7tVOZNdv3-1" vertex="1">
          <mxGeometry y="50" width="270" height="20" as="geometry" />
        </mxCell>
        <mxCell id="LT_-Wd7cu-P7tVOZNdv3-37" value="Choose the templates&lt;br&gt;&amp;nbsp;from Generic DB" style="edgeStyle=orthogonalEdgeStyle;rounded=0;orthogonalLoop=1;jettySize=auto;html=1;exitX=-0.003;exitY=0.16;exitDx=0;exitDy=0;entryX=0.5;entryY=0;entryDx=0;entryDy=0;exitPerimeter=0;" parent="-WpIlOUu-dirKlklOnX_-1" source="LT_-Wd7cu-P7tVOZNdv3-8" target="pWIpgPFCMo9Slf4YioUr-6" edge="1">
          <mxGeometry x="-0.2609" relative="1" as="geometry">
            <mxPoint x="1142" y="3020" as="targetPoint" />
            <Array as="points">
              <mxPoint x="917" y="2887" />
              <mxPoint x="917" y="3000" />
              <mxPoint x="1255" y="3000" />
            </Array>
            <mxPoint x="994.0300000000002" y="2919" as="sourcePoint" />
            <mxPoint as="offset" />
          </mxGeometry>
        </mxCell>
        <mxCell id="LT_-Wd7cu-P7tVOZNdv3-8" value="Service Composition Tool" style="swimlane;fontStyle=1;childLayout=stackLayout;horizontal=1;startSize=26;fillColor=#DAE8FC;horizontalStack=0;resizeParent=1;resizeParentMax=0;resizeLast=0;collapsible=1;marginBottom=0;strokeColor=#6c8ebf;fontSize=18;" parent="-WpIlOUu-dirKlklOnX_-1" vertex="1">
          <mxGeometry x="1110" y="2870" width="330" height="106" as="geometry">
            <mxRectangle x="640" y="10" width="90" height="26" as="alternateBounds" />
          </mxGeometry>
        </mxCell>
        <mxCell id="LT_-Wd7cu-P7tVOZNdv3-9" value="Provider 1 to n" style="text;html=1;align=center;verticalAlign=middle;resizable=0;points=[];autosize=1;fillColor=#FFFCEB;strokeColor=#d6b656;" parent="LT_-Wd7cu-P7tVOZNdv3-8" vertex="1">
          <mxGeometry y="26" width="330" height="20" as="geometry" />
        </mxCell>
        <mxCell id="LT_-Wd7cu-P7tVOZNdv3-10" value="Service templates&amp;nbsp;" style="text;html=1;align=center;verticalAlign=middle;resizable=0;points=[];autosize=1;" parent="LT_-Wd7cu-P7tVOZNdv3-8" vertex="1">
          <mxGeometry y="46" width="330" height="20" as="geometry" />
        </mxCell>
        <mxCell id="LT_-Wd7cu-P7tVOZNdv3-11" value="Service Workflows/Plans" style="text;html=1;align=center;verticalAlign=middle;resizable=0;points=[];autosize=1;" parent="LT_-Wd7cu-P7tVOZNdv3-8" vertex="1">
          <mxGeometry y="66" width="330" height="20" as="geometry" />
        </mxCell>
        <mxCell id="LT_-Wd7cu-P7tVOZNdv3-12" value="Service decomposition" style="text;html=1;align=center;verticalAlign=middle;resizable=0;points=[];autosize=1;" parent="LT_-Wd7cu-P7tVOZNdv3-8" vertex="1">
          <mxGeometry y="86" width="330" height="20" as="geometry" />
        </mxCell>
        <mxCell id="LT_-Wd7cu-P7tVOZNdv3-49" value="Implement templates&lt;br&gt;and configure&lt;br&gt;resources" style="edgeStyle=orthogonalEdgeStyle;rounded=0;orthogonalLoop=1;jettySize=auto;html=1;exitX=0.5;exitY=1;exitDx=0;exitDy=0;startArrow=none;entryX=0.189;entryY=0.308;entryDx=0;entryDy=0;entryPerimeter=0;" parent="-WpIlOUu-dirKlklOnX_-1" source="LT_-Wd7cu-P7tVOZNdv3-14" target="nJnasyYV8iAriuF3crtY-27" edge="1">
          <mxGeometry x="-0.5439" relative="1" as="geometry">
            <Array as="points" />
            <mxPoint as="offset" />
            <mxPoint x="974" y="3380" as="targetPoint" />
          </mxGeometry>
        </mxCell>
        <mxCell id="LT_-Wd7cu-P7tVOZNdv3-14" value="Resource Owner" style="swimlane;fontStyle=1;childLayout=stackLayout;horizontal=1;startSize=26;fillColor=#CCFFCC;horizontalStack=0;resizeParent=1;resizeParentMax=0;resizeLast=0;collapsible=1;marginBottom=0;strokeColor=#82b366;" parent="-WpIlOUu-dirKlklOnX_-1" vertex="1">
          <mxGeometry x="903.75" y="3130" width="140" height="56" as="geometry">
            <mxRectangle x="895" y="3320" width="110" height="26" as="alternateBounds" />
          </mxGeometry>
        </mxCell>
        <mxCell id="LT_-Wd7cu-P7tVOZNdv3-15" value="Provider 1 " style="text;strokeColor=#d6b656;fillColor=#FFFFCC;align=center;verticalAlign=middle;spacingLeft=4;spacingRight=4;overflow=hidden;points=[[0,0.5],[1,0.5]];portConstraint=eastwest;rotatable=0;fontStyle=1" parent="LT_-Wd7cu-P7tVOZNdv3-14" vertex="1">
          <mxGeometry y="26" width="140" height="30" as="geometry" />
        </mxCell>
        <mxCell id="nJnasyYV8iAriuF3crtY-9" style="edgeStyle=orthogonalEdgeStyle;rounded=0;orthogonalLoop=1;jettySize=auto;html=1;exitX=1;exitY=0.25;exitDx=0;exitDy=0;entryX=0.5;entryY=0;entryDx=0;entryDy=0;fontSize=14;" parent="-WpIlOUu-dirKlklOnX_-1" source="LT_-Wd7cu-P7tVOZNdv3-16" target="nJnasyYV8iAriuF3crtY-6" edge="1">
          <mxGeometry relative="1" as="geometry">
            <Array as="points">
              <mxPoint x="1460" y="3164" />
            </Array>
          </mxGeometry>
        </mxCell>
        <mxCell id="LT_-Wd7cu-P7tVOZNdv3-16" value="Resource Owner" style="swimlane;fontStyle=1;childLayout=stackLayout;horizontal=1;startSize=26;fillColor=#CCFFCC;horizontalStack=0;resizeParent=1;resizeParentMax=0;resizeLast=0;collapsible=1;marginBottom=0;strokeColor=#82b366;" parent="-WpIlOUu-dirKlklOnX_-1" vertex="1">
          <mxGeometry x="1390" y="3150" width="140" height="56" as="geometry">
            <mxRectangle x="895" y="3320" width="110" height="26" as="alternateBounds" />
          </mxGeometry>
        </mxCell>
        <mxCell id="LT_-Wd7cu-P7tVOZNdv3-17" value="Provider n" style="text;strokeColor=#d6b656;fillColor=#FFFFCC;align=center;verticalAlign=middle;spacingLeft=4;spacingRight=4;overflow=hidden;points=[[0,0.5],[1,0.5]];portConstraint=eastwest;rotatable=0;fontStyle=1" parent="LT_-Wd7cu-P7tVOZNdv3-16" vertex="1">
          <mxGeometry y="26" width="140" height="30" as="geometry" />
        </mxCell>
        <mxCell id="LT_-Wd7cu-P7tVOZNdv3-27" style="edgeStyle=orthogonalEdgeStyle;rounded=0;orthogonalLoop=1;jettySize=auto;html=1;exitX=0;exitY=0.25;exitDx=0;exitDy=0;" parent="-WpIlOUu-dirKlklOnX_-1" source="LT_-Wd7cu-P7tVOZNdv3-1" edge="1">
          <mxGeometry relative="1" as="geometry">
            <Array as="points">
              <mxPoint x="1010" y="2626" />
              <mxPoint x="1010" y="2853" />
              <mxPoint x="1269" y="2853" />
            </Array>
            <mxPoint x="1269" y="2870" as="targetPoint" />
          </mxGeometry>
        </mxCell>
        <mxCell id="LT_-Wd7cu-P7tVOZNdv3-46" value="Matching the requirements" style="edgeStyle=orthogonalEdgeStyle;rounded=0;orthogonalLoop=1;jettySize=auto;html=1;entryX=0.5;entryY=0;entryDx=0;entryDy=0;" parent="-WpIlOUu-dirKlklOnX_-1" source="LT_-Wd7cu-P7tVOZNdv3-24" target="LT_-Wd7cu-P7tVOZNdv3-1" edge="1">
          <mxGeometry relative="1" as="geometry" />
        </mxCell>
        <mxCell id="LT_-Wd7cu-P7tVOZNdv3-22" value="Service Instance Definition" style="swimlane;fontStyle=1;childLayout=stackLayout;horizontal=1;startSize=26;horizontalStack=0;resizeParent=1;resizeParentMax=0;resizeLast=0;collapsible=1;marginBottom=0;fillColor=#dae8fc;strokeColor=#6c8ebf;" parent="-WpIlOUu-dirKlklOnX_-1" vertex="1">
          <mxGeometry x="1040" y="2502.75" width="320" height="76" as="geometry">
            <mxRectangle x="1040" y="2502.75" width="130" height="26" as="alternateBounds" />
          </mxGeometry>
        </mxCell>
        <mxCell id="LT_-Wd7cu-P7tVOZNdv3-23" value="denormalized credentials" style="text;html=1;align=center;verticalAlign=middle;resizable=0;points=[];autosize=1;" parent="LT_-Wd7cu-P7tVOZNdv3-22" vertex="1">
          <mxGeometry y="26" width="320" height="30" as="geometry" />
        </mxCell>
        <mxCell id="LT_-Wd7cu-P7tVOZNdv3-24" value="policies" style="text;html=1;align=center;verticalAlign=middle;resizable=0;points=[];autosize=1;" parent="LT_-Wd7cu-P7tVOZNdv3-22" vertex="1">
          <mxGeometry y="56" width="320" height="20" as="geometry" />
        </mxCell>
        <mxCell id="LT_-Wd7cu-P7tVOZNdv3-30" value="Resource" style="swimlane;fontStyle=3;childLayout=stackLayout;horizontal=1;startSize=28;horizontalStack=0;resizeParent=1;resizeParentMax=0;resizeLast=0;collapsible=1;marginBottom=0;fillColor=#FFFFCC;strokeColor=#000000;" parent="-WpIlOUu-dirKlklOnX_-1" vertex="1">
          <mxGeometry x="909" y="3390" width="140" height="70" as="geometry">
            <mxRectangle x="1070" y="3150" width="140" height="23" as="alternateBounds" />
          </mxGeometry>
        </mxCell>
        <mxCell id="LT_-Wd7cu-P7tVOZNdv3-31" value="endpoints" style="text;align=center;verticalAlign=top;spacingLeft=4;spacingRight=4;overflow=hidden;rotatable=0;points=[[0,0.5],[1,0.5]];portConstraint=eastwest;strokeColor=#000000;" parent="LT_-Wd7cu-P7tVOZNdv3-30" vertex="1">
          <mxGeometry y="28" width="140" height="22" as="geometry" />
        </mxCell>
        <mxCell id="LT_-Wd7cu-P7tVOZNdv3-32" value="access rights" style="text;align=center;verticalAlign=top;spacingLeft=4;spacingRight=4;overflow=hidden;rotatable=0;points=[[0,0.5],[1,0.5]];portConstraint=eastwest;strokeColor=#000000;" parent="LT_-Wd7cu-P7tVOZNdv3-30" vertex="1">
          <mxGeometry y="50" width="140" height="20" as="geometry" />
        </mxCell>
        <mxCell id="LT_-Wd7cu-P7tVOZNdv3-38" style="edgeStyle=orthogonalEdgeStyle;rounded=0;orthogonalLoop=1;jettySize=auto;html=1;entryX=0.5;entryY=0;entryDx=0;entryDy=0;" parent="-WpIlOUu-dirKlklOnX_-1" edge="1">
          <mxGeometry relative="1" as="geometry">
            <mxPoint x="1130" y="3100" as="sourcePoint" />
            <mxPoint x="962.63" y="3130" as="targetPoint" />
            <Array as="points">
              <mxPoint x="1130" y="3100" />
              <mxPoint x="963" y="3100" />
            </Array>
          </mxGeometry>
        </mxCell>
        <mxCell id="LT_-Wd7cu-P7tVOZNdv3-50" value="Configure templates &lt;br&gt;from generic to &lt;br&gt;customized" style="edgeLabel;html=1;align=center;verticalAlign=middle;resizable=0;points=[];" parent="LT_-Wd7cu-P7tVOZNdv3-38" vertex="1" connectable="0">
          <mxGeometry x="-0.4362" relative="1" as="geometry">
            <mxPoint x="-27" as="offset" />
          </mxGeometry>
        </mxCell>
        <mxCell id="LT_-Wd7cu-P7tVOZNdv3-39" style="edgeStyle=orthogonalEdgeStyle;rounded=0;orthogonalLoop=1;jettySize=auto;html=1;exitX=1;exitY=0.5;exitDx=0;exitDy=0;entryX=0.5;entryY=0;entryDx=0;entryDy=0;" parent="-WpIlOUu-dirKlklOnX_-1" source="pWIpgPFCMo9Slf4YioUr-9" target="LT_-Wd7cu-P7tVOZNdv3-16" edge="1">
          <mxGeometry relative="1" as="geometry" />
        </mxCell>
        <mxCell id="LT_-Wd7cu-P7tVOZNdv3-47" value="&#xa;&#xa;&lt;div style=&quot;color: rgb(0, 0, 0); font-family: helvetica; font-size: 11px; font-style: normal; font-weight: 400; letter-spacing: normal; text-align: left; text-indent: 0px; text-transform: none; word-spacing: 0px; background-color: rgb(248, 249, 250);&quot;&gt;legally&amp;nbsp;enables&lt;br style=&quot;font-size: 11px&quot;&gt;&lt;/div&gt;&lt;div style=&quot;color: rgb(0, 0, 0); font-family: helvetica; font-size: 11px; font-style: normal; font-weight: 400; letter-spacing: normal; text-align: left; text-indent: 0px; text-transform: none; word-spacing: 0px; background-color: rgb(248, 249, 250);&quot;&gt;resource&amp;nbsp;&lt;span&gt;provision&lt;/span&gt;&lt;/div&gt;&#xa;&#xa;" style="edgeStyle=orthogonalEdgeStyle;rounded=0;orthogonalLoop=1;jettySize=auto;html=1;exitX=1;exitY=0.5;exitDx=0;exitDy=0;entryX=0.75;entryY=0;entryDx=0;entryDy=0;" parent="-WpIlOUu-dirKlklOnX_-1" source="-WpIlOUu-dirKlklOnX_-40" target="-WpIlOUu-dirKlklOnX_-27" edge="1">
          <mxGeometry relative="1" as="geometry">
            <Array as="points">
              <mxPoint x="1480" y="2778" />
              <mxPoint x="1480" y="1670" />
              <mxPoint x="1260" y="1670" />
            </Array>
          </mxGeometry>
        </mxCell>
        <mxCell id="nJnasyYV8iAriuF3crtY-3" value="Feedback&lt;br&gt;Services is&lt;br&gt;Provided" style="edgeStyle=orthogonalEdgeStyle;rounded=0;orthogonalLoop=1;jettySize=auto;html=1;entryX=0.5;entryY=0;entryDx=0;entryDy=0;exitX=0.999;exitY=0.369;exitDx=0;exitDy=0;exitPerimeter=0;startArrow=none;" parent="-WpIlOUu-dirKlklOnX_-1" source="nJnasyYV8iAriuF3crtY-27" target="-WpIlOUu-dirKlklOnX_-27" edge="1">
          <mxGeometry x="0.6351" relative="1" as="geometry">
            <Array as="points">
              <mxPoint x="1830" y="3398" />
              <mxPoint x="1830" y="1630" />
              <mxPoint x="1200" y="1630" />
            </Array>
            <mxPoint x="1500" y="1603.24" as="sourcePoint" />
            <mxPoint as="offset" />
          </mxGeometry>
        </mxCell>
        <mxCell id="nJnasyYV8iAriuF3crtY-6" value="Resource" style="swimlane;fontStyle=3;childLayout=stackLayout;horizontal=1;startSize=28;horizontalStack=0;resizeParent=1;resizeParentMax=0;resizeLast=0;collapsible=1;marginBottom=0;align=center;fillColor=#FFFFCC;strokeColor=#000000;" parent="-WpIlOUu-dirKlklOnX_-1" vertex="1">
          <mxGeometry x="1390" y="3390" width="140" height="70" as="geometry">
            <mxRectangle x="1070" y="3150" width="140" height="23" as="alternateBounds" />
          </mxGeometry>
        </mxCell>
        <mxCell id="nJnasyYV8iAriuF3crtY-7" value="endpoints" style="text;align=center;verticalAlign=top;spacingLeft=4;spacingRight=4;overflow=hidden;rotatable=0;points=[[0,0.5],[1,0.5]];portConstraint=eastwest;strokeColor=#000000;" parent="nJnasyYV8iAriuF3crtY-6" vertex="1">
          <mxGeometry y="28" width="140" height="22" as="geometry" />
        </mxCell>
        <mxCell id="nJnasyYV8iAriuF3crtY-8" value="access rights" style="text;align=center;verticalAlign=top;spacingLeft=4;spacingRight=4;overflow=hidden;rotatable=0;points=[[0,0.5],[1,0.5]];portConstraint=eastwest;strokeColor=#000000;" parent="nJnasyYV8iAriuF3crtY-6" vertex="1">
          <mxGeometry y="50" width="140" height="20" as="geometry" />
        </mxCell>
        <UserObject label="Resources Pool" treeRoot="1" id="nJnasyYV8iAriuF3crtY-24">
          <mxCell style="whiteSpace=wrap;html=1;align=center;treeFolding=1;treeMoving=1;newEdgeStyle={&quot;edgeStyle&quot;:&quot;elbowEdgeStyle&quot;,&quot;startArrow&quot;:&quot;none&quot;,&quot;endArrow&quot;:&quot;none&quot;};rounded=0;sketch=0;fillColor=#d5e8d4;strokeColor=#82b366;fontSize=20;" parent="-WpIlOUu-dirKlklOnX_-1" vertex="1">
            <mxGeometry x="784" y="3480" width="970" height="32" as="geometry" />
          </mxCell>
        </UserObject>
        <mxCell id="-sgH_u3aD0VonC3nqC-O-0" value="dispatch" style="html=1;verticalAlign=bottom;endArrow=block;rounded=0;" parent="-WpIlOUu-dirKlklOnX_-1" edge="1">
          <mxGeometry width="80" relative="1" as="geometry">
            <mxPoint x="1300" y="2800" as="sourcePoint" />
            <mxPoint x="1380" y="2800" as="targetPoint" />
          </mxGeometry>
        </mxCell>
        <mxCell id="-sgH_u3aD0VonC3nqC-O-19" value="" style="edgeStyle=orthogonalEdgeStyle;rounded=0;orthogonalLoop=1;jettySize=auto;html=1;" parent="-WpIlOUu-dirKlklOnX_-1" source="-sgH_u3aD0VonC3nqC-O-2" target="-sgH_u3aD0VonC3nqC-O-9" edge="1">
          <mxGeometry relative="1" as="geometry" />
        </mxCell>
        <mxCell id="-sgH_u3aD0VonC3nqC-O-23" value="Implement inteconnection templates&lt;br&gt;and configureinterconnection services" style="edgeLabel;html=1;align=center;verticalAlign=middle;resizable=0;points=[];" parent="-sgH_u3aD0VonC3nqC-O-19" vertex="1" connectable="0">
          <mxGeometry x="-0.3182" relative="1" as="geometry">
            <mxPoint y="-13" as="offset" />
          </mxGeometry>
        </mxCell>
        <mxCell id="-sgH_u3aD0VonC3nqC-O-2" value="Resource Owner" style="swimlane;fontStyle=1;childLayout=stackLayout;horizontal=1;startSize=26;fillColor=#d5e8d4;horizontalStack=0;resizeParent=1;resizeParentMax=0;resizeLast=0;collapsible=1;marginBottom=0;strokeColor=#82b366;" parent="-WpIlOUu-dirKlklOnX_-1" vertex="1">
          <mxGeometry x="1160" y="3230" width="190" height="56" as="geometry">
            <mxRectangle x="895" y="3320" width="110" height="26" as="alternateBounds" />
          </mxGeometry>
        </mxCell>
        <mxCell id="-sgH_u3aD0VonC3nqC-O-3" value="Interconnection service&#xa;Provider j" style="text;strokeColor=#d6b656;fillColor=#FFFFCC;align=center;verticalAlign=middle;spacingLeft=4;spacingRight=4;overflow=hidden;points=[[0,0.5],[1,0.5]];portConstraint=eastwest;rotatable=0;fontStyle=1" parent="-sgH_u3aD0VonC3nqC-O-2" vertex="1">
          <mxGeometry y="26" width="190" height="30" as="geometry" />
        </mxCell>
        <mxCell id="-sgH_u3aD0VonC3nqC-O-9" value="Resource" style="swimlane;fontStyle=3;childLayout=stackLayout;horizontal=1;startSize=28;horizontalStack=0;resizeParent=1;resizeParentMax=0;resizeLast=0;collapsible=1;marginBottom=0;align=center;fillColor=#FFFFCC;strokeColor=#000000;" parent="-WpIlOUu-dirKlklOnX_-1" vertex="1">
          <mxGeometry x="1160" y="3371" width="140" height="90" as="geometry">
            <mxRectangle x="1070" y="3150" width="140" height="23" as="alternateBounds" />
          </mxGeometry>
        </mxCell>
        <mxCell id="-sgH_u3aD0VonC3nqC-O-10" value="Interconnection service" style="text;align=center;verticalAlign=top;spacingLeft=4;spacingRight=4;overflow=hidden;rotatable=0;points=[[0,0.5],[1,0.5]];portConstraint=eastwest;strokeColor=#000000;fillColor=#FFFFCC;" parent="-sgH_u3aD0VonC3nqC-O-9" vertex="1">
          <mxGeometry y="28" width="140" height="22" as="geometry" />
        </mxCell>
        <mxCell id="-sgH_u3aD0VonC3nqC-O-11" value="access rights" style="text;align=center;verticalAlign=top;spacingLeft=4;spacingRight=4;overflow=hidden;rotatable=0;points=[[0,0.5],[1,0.5]];portConstraint=eastwest;strokeColor=#000000;" parent="-sgH_u3aD0VonC3nqC-O-9" vertex="1">
          <mxGeometry y="50" width="140" height="20" as="geometry" />
        </mxCell>
        <mxCell id="-sgH_u3aD0VonC3nqC-O-12" value="connection points" style="text;align=center;verticalAlign=top;spacingLeft=4;spacingRight=4;overflow=hidden;rotatable=0;points=[[0,0.5],[1,0.5]];portConstraint=eastwest;strokeColor=#000000;" parent="-sgH_u3aD0VonC3nqC-O-9" vertex="1">
          <mxGeometry y="70" width="140" height="20" as="geometry" />
        </mxCell>
        <mxCell id="-sgH_u3aD0VonC3nqC-O-21" value="" style="endArrow=block;startArrow=block;endFill=1;startFill=1;html=1;rounded=0;exitX=0.268;exitY=0.615;exitDx=0;exitDy=0;exitPerimeter=0;entryX=0;entryY=0.5;entryDx=0;entryDy=0;" parent="-WpIlOUu-dirKlklOnX_-1" source="nJnasyYV8iAriuF3crtY-27" target="-sgH_u3aD0VonC3nqC-O-12" edge="1">
          <mxGeometry width="160" relative="1" as="geometry">
            <mxPoint x="1080" y="3380" as="sourcePoint" />
            <mxPoint x="1240" y="3380" as="targetPoint" />
          </mxGeometry>
        </mxCell>
        <mxCell id="-sgH_u3aD0VonC3nqC-O-22" value="" style="endArrow=block;startArrow=block;endFill=1;startFill=1;html=1;rounded=0;exitX=0.268;exitY=0.615;exitDx=0;exitDy=0;exitPerimeter=0;entryX=0.619;entryY=0.615;entryDx=0;entryDy=0;entryPerimeter=0;" parent="-WpIlOUu-dirKlklOnX_-1" target="nJnasyYV8iAriuF3crtY-27" edge="1">
          <mxGeometry width="160" relative="1" as="geometry">
            <mxPoint x="1300" y="3450.0000000000005" as="sourcePoint" />
            <mxPoint x="1410.04" y="3471.05" as="targetPoint" />
          </mxGeometry>
        </mxCell>
        <mxCell id="0xoxwfwinay00_8SYfpg-1" value="Multi cloud / multiprovider / multiservice" style="text;html=1;strokeColor=none;fillColor=none;align=center;verticalAlign=middle;whiteSpace=wrap;rounded=0;fontStyle=1;fontColor=#000066;fontSize=30;" parent="-WpIlOUu-dirKlklOnX_-1" vertex="1">
          <mxGeometry x="850" y="1530" width="700" height="60" as="geometry" />
        </mxCell>
      </root>
    </mxGraphModel>
  </diagram>
</mxfile>
