{
    "policies": [
      {
        "policy": "SignaturePolicy"
      }
    ],
    "credentials": [
      {
        "type": [
          "VerifiableCredential",
          "VerifiableAttestation",
          "VerifiableId"
        ],
        "@context": [
          "https://www.w3.org/2018/credentials/v1",
          "https://w3id.org/security/suites/jws-2020/v1"
        ],
        "id": "urn:uuid:9bec96a7-1e6d-41da-9ab9-a0e4c20448d7",
        "issuer": "did:key:z6Mkvzm4qKDmqCFyhfvwfeSVwE74qK7PJv8qCjEu5Jjn5Y62",
        "issuanceDate": "2023-01-19T09:39:22Z",
        "issued": "2023-01-19T09:39:22Z",
        "validFrom": "2023-01-19T09:39:22Z",
        "credentialSchema": {
          "id": "https://raw.githubusercontent.com/walt-id/waltid-ssikit-vclib/master/src/test/resources/schemas/VerifiableId.json",
          "type": "FullJsonSchemaValidator2021"
        },
        "credentialSubject": {
          "id": "did:key:z6Mkvzm4qKDmqCFyhfvwfeSVwE74qK7PJv8qCjEu5Jjn5Y62",
          "currentAddress": [
            "1 Boulevard de la Liberté, 59800 Lille"
          ],
          "dateOfBirth": "1993-04-08",
          "familyName": "DOE",
          "firstName": "Jane",
          "gender": "FEMALE",
          "nameAndFamilyNameAtBirth": "Jane DOE",
          "personalIdentifier": "0904008084H",
          "placeOfBirth": "LILLE, FRANCE"
        },
        "evidence": [
          {
            "documentPresence": [
              "Physical"
            ],
            "evidenceDocument": [
              "Passport"
            ],
            "subjectPresence": "Physical",
            "type": [
              "DocumentVerification"
            ],
            "verifier": "did:ebsi:2A9BZ9SUe6BatacSpvs1V5CdjHvLpQ7bEsi2Jb6LdHKnQxaN"
          }
        ],
        "proof": {
          "type": "JsonWebSignature2020",
          "creator": "did:key:z6Mkvzm4qKDmqCFyhfvwfeSVwE74qK7PJv8qCjEu5Jjn5Y62",
          "created": "2023-01-19T09:39:22Z",
          "proofPurpose": "assertionMethod",
          "verificationMethod": "did:key:z6Mkvzm4qKDmqCFyhfvwfeSVwE74qK7PJv8qCjEu5Jjn5Y62#z6Mkvzm4qKDmqCFyhfvwfeSVwE74qK7PJv8qCjEu5Jjn5Y62",
          "jws": "eyJiNjQiOmZhbHNlLCJjcml0IjpbImI2NCJdLCJhbGciOiJFZERTQSJ9..iBOX-qhrR9_trFEIfRyZdrxvAWb_5NmJKsTKUfF3tA1688xPjspEhhrT-qyWzXJvxgisjHFOEnU4x6BvtgHIDg"
        }
      }
    ]
  }