@startuml
!include https://raw.githubusercontent.com/plantuml-stdlib/C4-PlantUML/master/C4_Component.puml
Container(compliance, "Compliance", "nestJS and Typescript"){
    Component(appController, "App controller", "", "Root controller. Exposes information of the API, docs url, version etc.")
    Component(commonController, "Common controller", "", "Compliance entrypoint. Used to assert compliance to rules & return a gx:compliance VC")
    Component(verifiablePresentationValidationService, "VerifiablePresentation validation service", "","Validates the VerifiablePresentation content")
    Component(proofService, "Proof service", "","Generates the gx:compliance credential")
    Component(shaclService, "SHACL service", "","Checks VerifiableCredentials")
    Component(trustFramework2210ValidationService, "TrustFramework 2210 Validation Service", "","Asserts consistency rules")
    Component(ParticipantContentValidationService, "ParticipantContentValidationService", "","Asserts participant consistency rules")
    Component(ServiceOfferingContentValidationService, "ServiceOfferingContentValidationService", "","Asserts service offering consistency rules")
    Component(ServiceOfferingLabelLevelValidationService, "ServiceOfferingLabelLevelValidationService", "","Asserts serviceoffering labels consistency rules")
    Component(VcQueryService, "VcQueryService", "","Contains and runs graph queries")
    Component(registryService, "Registry service", "","Retrieves and serves registry files")
    Rel(commonController, proofService, "Generates and outputs compliance VC")
    Rel(verifiablePresentationValidationService, proofService, "Verifies each VC signature")
    Rel(verifiablePresentationValidationService, shaclService, "Verifies each VC structure")
    Rel(shaclService, registryService, "Retrieves shape")
    Rel(verifiablePresentationValidationService, trustFramework2210ValidationService, "Verifies each VC respects consistency rules")
}
Component(registry, "registry")
ComponentDb(memgraph, "Graph database")
Rel(VcQueryService, memgraph, "")
Rel(trustFramework2210ValidationService, ParticipantContentValidationService, "Checks Participant VC rules")
Rel(trustFramework2210ValidationService, ServiceOfferingContentValidationService, "Checks ServiceOffering VC rules")
Rel(trustFramework2210ValidationService, ServiceOfferingLabelLevelValidationService, "Checks ServiceOffering Labels VC rules")
Rel(ParticipantContentValidationService, VcQueryService, "Checks Participant VC rules")
Rel(ServiceOfferingContentValidationService, VcQueryService, "Checks ServiceOffering VC rules")
Rel(ServiceOfferingLabelLevelValidationService, VcQueryService, "Checks ServiceOffering Labels VC rules")
Rel(registryService, registry, "Fetches shapes & implemented classes")
@enduml