@startuml
!include https://raw.githubusercontent.com/plantuml-stdlib/C4-PlantUML/master/C4_Component.puml
Container(registry, "Registry", "nestJS and Typescript"){
    Component(appController, "App controller", "", "Root controller. Exposes information of the API, docs url, version etc.")
    Component(configurationController, "Configuration controller", "", "Exposes current instance configuration in a VerifiableCredential.")

    Component(shapeController, "Shape controller", "", "Returns SHACL shapes in TTL and JSON")
    Component(shapeService, "Shape service", "", "Fetches ttl shapes on disk and returns them either in JSON or original TTL")
    Rel(shapeController, shapeService, "uses")

    Component(complianceIssuersController, "Compliance issuers controller", "outdated", "Returns ['did:web:compliance.gaia-x.eu']")
    Component(complianceIssuersService, "Compliance issuers service", "outdated", "Returns ['did:web:compliance.gaia-x.eu']")
    Rel(complianceIssuersController, complianceIssuersService, "Uses")

    Component(trustAnchorController, "TrustAnchorController", "", "Allows to check whether a certificate belongs to a trusted anchors")
    Component(trustAnchorService, "TrustAnchorService")
    Component(TrustAnchorListService, "TrustAnchorListService", "","Loads from trusted anchors using parsers")
    Rel(trustAnchorController, trustAnchorService, "uses")
    Rel(TrustAnchorListService, trustAnchorService, "uses")

    Component(trustedIssuersController, "Trusted issuers controllers", "", "Allows to retrieve GXDCH accredited instances for each component")
    Component(TrustedIssuersService, "Trusted issuers service", "", "Fetches trusted GXDCH from Gitlab or other specified URL")
    Rel(trustedIssuersController, TrustedIssuersService, "uses")

    Component(termsAndConditionsController, "TermsAndConditions controller", "outdated", "Returns Gaia-X terms and conditions in a JSON")
    Component(termsAndConditionsService, "TermsAndConditions Service", "outdated")
    Rel(termsAndConditionsController, termsAndConditionsService, "uses")

    Component(trustedSchemaController, "trustedSchemaController", "Returns a JSON-LD string allowing jsonld normalization to happen")
    Component(trustedSchemaService, "trustedSchemaService", "", "Fetches schema on disk and returns it")
    Rel(trustedSchemaController, trustedSchemaService, "uses")

}
ComponentDb(nosql,"NoSQL database","Contains x509 certificate chain of trusted issuers")
Rel(trustAnchorService, nosql, "fetches certificate from")
Rel(trustAnchorService, nosql, "stores certificates in")

System(eidasTSPs, "eIDAS Trust Service Providers", "")
System(mozillacacert, "Mozilla certificate list of Certificate Authorities", "")
System(gaiaxtrustedissuers, "Gaia-X list of DCH", "Gitlab.com")
Rel(TrustAnchorListService, eidasTSPs, "Loads TSPs from", "XML/HTTPS")
Rel(TrustAnchorListService, mozillacacert, "Loads CA certs from", "csv/HTTPS")
Rel(TrustedIssuersService, gaiaxtrustedissuers, "Loads trusted issuers list from", "yaml/HTTPS")

@enduml