@startuml
!include https://raw.githubusercontent.com/plantuml-stdlib/C4-PlantUML/master/C4_Container.puml
Person(company, "Company", "A company willing to share its services or discover and use other companies services")
System_Boundary(gaiax, "Gaia-X ecosystem"){

Container(wizard, "Wizard", "WebApp", "GUI allowing to visualize")
Container(compliance, "Compliance engine", "NestJS and Typescript", "Checks descriptions conformity and issues compliance credentials")
Container(registry, "Registry", "NestJS and Typescript", "Source of truth for trusted anchors, shapes")
Container(notary, "Notary", "NestJS and Typescript", "Issues LegalRegistrationNumber credentials relying on 3rd party trusted anchors")
Container(ces, "Credentials Events Service", "Quarkus and Kotlin", "Receives and shares credentials to the world")


Rel(company, wizard, "Describes itself and services using")
Rel(company, compliance, "Validates compliance using", "ld+json/https")
Rel(company, ces, "Offers its credentials to the world using", "json/https")
Rel(wizard, notary, "Gets LegalRegistrationNumber VerifiableCredential using", "ld+json/https")
Rel(company, notary, "Gets LegalRegistrationNumber VerifiableCredential using", "ld+json/https")
Rel(compliance, registry, "Retrieves SHACL shapes from", "ttl/http")
Rel(compliance, registry, "Validates certificate using", "x509-pem/http")
}
System(eidasTSPs, "eIDAS Trust Service Providers")
System(mozillaCaCert, "Mozilla CA Certificate List", "List of Certificate from trusted Certificate Authorities")
System(vatAPI, "European Commission VAT API", "API allowing to check whether a european VAT ID is valid")
System(eoriAPI, "EORI API", "API allowing to check whether an EORI number is valid")
System(leiAPI, "GLEIF API", "API allowing to check whether a leicode is valid")
Rel(notary, vatAPI, "Validates company existence using")
Rel(notary, eoriAPI, "Validates company existence using")
Rel(notary, leiAPI, "Validates company existence using")
Rel(registry, mozillaCaCert, "Retrieves trusted CA from")
Rel(registry, eidasTSPs, "Retrieves trusted eIDAS issuers from")

@enduml