{
  "blue": "#000094",
  "dark-blue": "#0c1b5a",
  "black": "#000000",
  "white": "#ffffff",
  "purple": "#7300f3",
  "violet": "#b900ff",
  "cyan": "#46daff",
  "light-grey": "#a0aec0",
  "info": "#2094f3",
  "success": "#009485",
  "error": "#ff5724"
}
