<mxfile host="app.diagrams.net" modified="2024-05-17T12:22:51.693Z" agent="Mozilla/5.0 (Windows NT 10.0; Win64; x64) AppleWebKit/537.36 (KHTML, like Gecko) Chrome/125.0.0.0 Safari/537.36" etag="lIKapbZvppdwLAzh_5Wf" version="24.4.4" type="device">
  <diagram name="Arch_Conceptual Model_main" id="nNwWRXBlL0BoIlTvyEb5">
    <mxGraphModel dx="223" dy="-1729" grid="1" gridSize="10" guides="1" tooltips="1" connect="1" arrows="1" fold="1" page="1" pageScale="1" pageWidth="827" pageHeight="1169" math="0" shadow="0">
      <root>
        <mxCell id="0" />
        <mxCell id="1" parent="0" />
        <mxCell id="35Z6kdMx8G1nahkrQOwo-1" value="" style="rounded=0;whiteSpace=wrap;html=1;dashed=1;fillColor=none;strokeWidth=1;perimeterSpacing=0;" vertex="1" parent="1">
          <mxGeometry x="850" y="2574" width="990" height="366" as="geometry" />
        </mxCell>
        <mxCell id="35Z6kdMx8G1nahkrQOwo-2" value="Participant" style="swimlane;fontStyle=3;childLayout=stackLayout;horizontal=1;startSize=26;fillColor=#dae8fc;horizontalStack=0;resizeParent=1;resizeParentMax=0;resizeLast=0;collapsible=1;marginBottom=0;strokeColor=#6c8ebf;" vertex="1" parent="1">
          <mxGeometry x="1201" y="2370" width="140" height="78" as="geometry">
            <mxRectangle x="640" y="10" width="90" height="26" as="alternateBounds" />
          </mxGeometry>
        </mxCell>
        <mxCell id="35Z6kdMx8G1nahkrQOwo-3" value="identified " style="text;strokeColor=none;fillColor=none;align=left;verticalAlign=top;spacingLeft=4;spacingRight=4;overflow=hidden;rotatable=0;points=[[0,0.5],[1,0.5]];portConstraint=eastwest;" vertex="1" parent="35Z6kdMx8G1nahkrQOwo-2">
          <mxGeometry y="26" width="140" height="26" as="geometry" />
        </mxCell>
        <mxCell id="35Z6kdMx8G1nahkrQOwo-4" value="authorized" style="text;strokeColor=none;fillColor=none;align=left;verticalAlign=top;spacingLeft=4;spacingRight=4;overflow=hidden;rotatable=0;points=[[0,0.5],[1,0.5]];portConstraint=eastwest;" vertex="1" parent="35Z6kdMx8G1nahkrQOwo-2">
          <mxGeometry y="52" width="140" height="26" as="geometry" />
        </mxCell>
        <mxCell id="35Z6kdMx8G1nahkrQOwo-5" value="Consumer" style="swimlane;fontStyle=1;childLayout=stackLayout;horizontal=1;startSize=26;fillColor=#dae8fc;horizontalStack=0;resizeParent=1;resizeParentMax=0;resizeLast=0;collapsible=1;marginBottom=0;strokeColor=#6c8ebf;" vertex="1" parent="1">
          <mxGeometry x="1419.25" y="2591" width="140" height="52" as="geometry">
            <mxRectangle x="640" y="10" width="90" height="26" as="alternateBounds" />
          </mxGeometry>
        </mxCell>
        <mxCell id="35Z6kdMx8G1nahkrQOwo-6" value="" style="endArrow=none;endSize=12;endFill=0;html=1;startArrow=block;startFill=0;startSize=12;" edge="1" parent="1" source="35Z6kdMx8G1nahkrQOwo-2" target="35Z6kdMx8G1nahkrQOwo-5">
          <mxGeometry width="160" relative="1" as="geometry">
            <mxPoint x="1219.5" y="2779" as="sourcePoint" />
            <mxPoint x="1310" y="2640" as="targetPoint" />
          </mxGeometry>
        </mxCell>
        <mxCell id="35Z6kdMx8G1nahkrQOwo-7" value="" style="endArrow=none;endSize=12;endFill=0;html=1;startArrow=block;startFill=0;startSize=12;" edge="1" parent="1" source="35Z6kdMx8G1nahkrQOwo-2" target="35Z6kdMx8G1nahkrQOwo-24">
          <mxGeometry width="160" relative="1" as="geometry">
            <mxPoint x="1100" y="2694.3707462686566" as="sourcePoint" />
            <mxPoint x="1269" y="2610" as="targetPoint" />
          </mxGeometry>
        </mxCell>
        <mxCell id="35Z6kdMx8G1nahkrQOwo-8" value="" style="endArrow=block;endSize=12;endFill=0;html=1;" edge="1" parent="1" source="35Z6kdMx8G1nahkrQOwo-27" target="35Z6kdMx8G1nahkrQOwo-2">
          <mxGeometry width="160" relative="1" as="geometry">
            <mxPoint x="1275.5" y="2690" as="sourcePoint" />
            <mxPoint x="1340" y="2480" as="targetPoint" />
          </mxGeometry>
        </mxCell>
        <mxCell id="35Z6kdMx8G1nahkrQOwo-9" value="Resource Owner" style="swimlane;fontStyle=1;childLayout=stackLayout;horizontal=1;startSize=26;fillColor=none;horizontalStack=0;resizeParent=1;resizeParentMax=0;resizeLast=0;collapsible=1;marginBottom=0;" vertex="1" parent="1">
          <mxGeometry x="893.75" y="2956" width="140" height="52" as="geometry">
            <mxRectangle x="895" y="3320" width="110" height="26" as="alternateBounds" />
          </mxGeometry>
        </mxCell>
        <mxCell id="35Z6kdMx8G1nahkrQOwo-10" style="edgeStyle=orthogonalEdgeStyle;rounded=1;orthogonalLoop=1;jettySize=auto;html=1;endSize=12;" edge="1" parent="1" source="35Z6kdMx8G1nahkrQOwo-12" target="35Z6kdMx8G1nahkrQOwo-28">
          <mxGeometry relative="1" as="geometry">
            <Array as="points">
              <mxPoint x="1272.5" y="3076" />
              <mxPoint x="1272.5" y="3076" />
            </Array>
          </mxGeometry>
        </mxCell>
        <mxCell id="35Z6kdMx8G1nahkrQOwo-11" value="relies on" style="edgeLabel;html=1;align=center;verticalAlign=middle;resizable=0;points=[];" vertex="1" connectable="0" parent="35Z6kdMx8G1nahkrQOwo-10">
          <mxGeometry x="0.0042" y="-1" relative="1" as="geometry">
            <mxPoint as="offset" />
          </mxGeometry>
        </mxCell>
        <mxCell id="35Z6kdMx8G1nahkrQOwo-12" value="Service Instance" style="swimlane;fontStyle=1;childLayout=stackLayout;horizontal=1;startSize=26;horizontalStack=0;resizeParent=1;resizeParentMax=0;resizeLast=0;collapsible=1;marginBottom=0;" vertex="1" parent="1">
          <mxGeometry x="1157.5" y="2996" width="230" height="76" as="geometry">
            <mxRectangle x="1195.25" y="3450" width="130" height="26" as="alternateBounds" />
          </mxGeometry>
        </mxCell>
        <mxCell id="35Z6kdMx8G1nahkrQOwo-13" value="credentials" style="text;html=1;align=center;verticalAlign=middle;resizable=0;points=[];autosize=1;" vertex="1" parent="35Z6kdMx8G1nahkrQOwo-12">
          <mxGeometry y="26" width="230" height="30" as="geometry" />
        </mxCell>
        <mxCell id="35Z6kdMx8G1nahkrQOwo-14" value="access rights &amp;amp; usage policies" style="text;html=1;align=center;verticalAlign=middle;resizable=0;points=[];autosize=1;" vertex="1" parent="35Z6kdMx8G1nahkrQOwo-12">
          <mxGeometry y="56" width="230" height="20" as="geometry" />
        </mxCell>
        <mxCell id="35Z6kdMx8G1nahkrQOwo-15" value="*" style="text;html=1;align=center;verticalAlign=middle;resizable=0;points=[];autosize=1;" vertex="1" parent="1">
          <mxGeometry x="1296.5" y="3106" width="20" height="20" as="geometry" />
        </mxCell>
        <mxCell id="35Z6kdMx8G1nahkrQOwo-16" value="" style="endArrow=classic;html=1;edgeStyle=orthogonalEdgeStyle;strokeWidth=1;endFill=1;exitX=0;exitY=0.25;exitDx=0;exitDy=0;endSize=12;" edge="1" parent="1" source="35Z6kdMx8G1nahkrQOwo-24" target="35Z6kdMx8G1nahkrQOwo-12">
          <mxGeometry relative="1" as="geometry">
            <mxPoint x="971" y="2674" as="sourcePoint" />
            <mxPoint x="1156" y="3284" as="targetPoint" />
            <Array as="points">
              <mxPoint x="880" y="2604" />
              <mxPoint x="880" y="3050" />
            </Array>
          </mxGeometry>
        </mxCell>
        <mxCell id="35Z6kdMx8G1nahkrQOwo-17" value="operates" style="edgeLabel;html=1;align=center;verticalAlign=middle;resizable=0;points=[];" vertex="1" connectable="0" parent="35Z6kdMx8G1nahkrQOwo-16">
          <mxGeometry x="0.4889" y="-1" relative="1" as="geometry">
            <mxPoint as="offset" />
          </mxGeometry>
        </mxCell>
        <mxCell id="35Z6kdMx8G1nahkrQOwo-18" style="edgeStyle=orthogonalEdgeStyle;orthogonalLoop=1;jettySize=auto;html=1;rounded=1;endSize=12;" edge="1" parent="1" source="35Z6kdMx8G1nahkrQOwo-20" target="35Z6kdMx8G1nahkrQOwo-12">
          <mxGeometry relative="1" as="geometry">
            <Array as="points">
              <mxPoint x="1532" y="3032" />
            </Array>
            <mxPoint x="1362.5" y="3038" as="targetPoint" />
          </mxGeometry>
        </mxCell>
        <mxCell id="35Z6kdMx8G1nahkrQOwo-19" value="uses" style="edgeLabel;html=1;align=center;verticalAlign=middle;resizable=0;points=[];" vertex="1" connectable="0" parent="35Z6kdMx8G1nahkrQOwo-18">
          <mxGeometry x="0.0405" y="1" relative="1" as="geometry">
            <mxPoint as="offset" />
          </mxGeometry>
        </mxCell>
        <mxCell id="35Z6kdMx8G1nahkrQOwo-20" value="End User" style="swimlane;fontStyle=1;childLayout=stackLayout;horizontal=1;startSize=26;fillColor=none;horizontalStack=0;resizeParent=1;resizeParentMax=0;resizeLast=0;collapsible=1;marginBottom=0;" vertex="1" parent="1">
          <mxGeometry x="1462" y="2957" width="140" height="52" as="geometry">
            <mxRectangle x="1489" y="3314" width="90" height="26" as="alternateBounds" />
          </mxGeometry>
        </mxCell>
        <mxCell id="35Z6kdMx8G1nahkrQOwo-21" value="Federation Services" style="swimlane;fontStyle=1;align=center;verticalAlign=top;childLayout=stackLayout;horizontal=1;startSize=26;horizontalStack=0;resizeParent=1;resizeParentMax=0;resizeLast=0;collapsible=1;marginBottom=0;fillColor=#dae8fc;strokeColor=#6c8ebf;" vertex="1" parent="1">
          <mxGeometry x="1191" y="2680" width="160" height="46" as="geometry" />
        </mxCell>
        <mxCell id="35Z6kdMx8G1nahkrQOwo-22" value="" style="endArrow=none;html=1;edgeStyle=orthogonalEdgeStyle;" edge="1" parent="1" source="35Z6kdMx8G1nahkrQOwo-5" target="35Z6kdMx8G1nahkrQOwo-20">
          <mxGeometry relative="1" as="geometry">
            <mxPoint x="1481" y="2700" as="sourcePoint" />
            <mxPoint x="1531" y="3196" as="targetPoint" />
            <Array as="points">
              <mxPoint x="1532" y="2710" />
              <mxPoint x="1532" y="2710" />
            </Array>
          </mxGeometry>
        </mxCell>
        <mxCell id="35Z6kdMx8G1nahkrQOwo-23" value="" style="endArrow=none;html=1;edgeStyle=orthogonalEdgeStyle;" edge="1" parent="1" source="35Z6kdMx8G1nahkrQOwo-9" target="35Z6kdMx8G1nahkrQOwo-24">
          <mxGeometry relative="1" as="geometry">
            <mxPoint x="947" y="3164" as="sourcePoint" />
            <mxPoint x="960" y="2703" as="targetPoint" />
            <Array as="points">
              <mxPoint x="920" y="2624" />
            </Array>
          </mxGeometry>
        </mxCell>
        <mxCell id="35Z6kdMx8G1nahkrQOwo-24" value="Provider" style="swimlane;fontStyle=1;childLayout=stackLayout;horizontal=1;startSize=26;fillColor=#dae8fc;horizontalStack=0;resizeParent=1;resizeParentMax=0;resizeLast=0;collapsible=1;marginBottom=0;strokeColor=#6c8ebf;" vertex="1" parent="1">
          <mxGeometry x="990.25" y="2591" width="140" height="52" as="geometry">
            <mxRectangle x="640" y="10" width="90" height="26" as="alternateBounds" />
          </mxGeometry>
        </mxCell>
        <mxCell id="35Z6kdMx8G1nahkrQOwo-25" style="edgeStyle=orthogonalEdgeStyle;rounded=0;orthogonalLoop=1;jettySize=auto;html=1;startArrow=none;startFill=0;startSize=12;endArrow=none;endFill=0;endSize=12;" edge="1" parent="1" source="35Z6kdMx8G1nahkrQOwo-27" target="35Z6kdMx8G1nahkrQOwo-21">
          <mxGeometry relative="1" as="geometry">
            <mxPoint x="1271" y="2546" as="sourcePoint" />
          </mxGeometry>
        </mxCell>
        <mxCell id="35Z6kdMx8G1nahkrQOwo-26" value="provides" style="edgeLabel;html=1;align=center;verticalAlign=middle;resizable=0;points=[];" vertex="1" connectable="0" parent="35Z6kdMx8G1nahkrQOwo-25">
          <mxGeometry x="-0.2707" relative="1" as="geometry">
            <mxPoint y="45" as="offset" />
          </mxGeometry>
        </mxCell>
        <mxCell id="35Z6kdMx8G1nahkrQOwo-27" value="Operator" style="swimlane;fontStyle=1;childLayout=stackLayout;horizontal=1;startSize=26;fillColor=#dae8fc;horizontalStack=0;resizeParent=1;resizeParentMax=0;resizeLast=0;collapsible=1;marginBottom=0;strokeColor=#6c8ebf;" vertex="1" parent="1">
          <mxGeometry x="1201" y="2496" width="140" height="52" as="geometry">
            <mxRectangle x="640" y="10" width="90" height="26" as="alternateBounds" />
          </mxGeometry>
        </mxCell>
        <mxCell id="35Z6kdMx8G1nahkrQOwo-28" value="Contract" style="swimlane;fontStyle=1;childLayout=stackLayout;horizontal=1;startSize=26;horizontalStack=0;resizeParent=1;resizeParentMax=0;resizeLast=0;collapsible=1;marginBottom=0;" vertex="1" parent="1">
          <mxGeometry x="1198.5" y="3126" width="140" height="80" as="geometry" />
        </mxCell>
        <mxCell id="35Z6kdMx8G1nahkrQOwo-29" value="date" style="text;align=left;verticalAlign=top;spacingLeft=4;spacingRight=4;overflow=hidden;rotatable=0;points=[[0,0.5],[1,0.5]];portConstraint=eastwest;" vertex="1" parent="35Z6kdMx8G1nahkrQOwo-28">
          <mxGeometry y="26" width="140" height="24" as="geometry" />
        </mxCell>
        <mxCell id="35Z6kdMx8G1nahkrQOwo-30" value="rights &amp; obligations" style="text;strokeColor=none;fillColor=none;align=left;verticalAlign=top;spacingLeft=4;spacingRight=4;overflow=hidden;rotatable=0;points=[[0,0.5],[1,0.5]];portConstraint=eastwest;" vertex="1" parent="35Z6kdMx8G1nahkrQOwo-28">
          <mxGeometry y="50" width="140" height="30" as="geometry" />
        </mxCell>
        <mxCell id="35Z6kdMx8G1nahkrQOwo-31" value="1" style="text;html=1;align=center;verticalAlign=middle;resizable=0;points=[];autosize=1;" vertex="1" parent="1">
          <mxGeometry x="1469.75" y="2643" width="20" height="20" as="geometry" />
        </mxCell>
        <mxCell id="35Z6kdMx8G1nahkrQOwo-32" value="*" style="text;html=1;align=center;verticalAlign=middle;resizable=0;points=[];autosize=1;" vertex="1" parent="1">
          <mxGeometry x="1250" y="2660" width="20" height="20" as="geometry" />
        </mxCell>
        <mxCell id="35Z6kdMx8G1nahkrQOwo-33" value="&lt;div style=&quot;font-size: 11px;&quot;&gt;legally&lt;br style=&quot;font-size: 11px;&quot;&gt;enables&lt;br style=&quot;font-size: 11px;&quot;&gt;&lt;/div&gt;&lt;div style=&quot;font-size: 11px;&quot;&gt;resource&lt;/div&gt;&lt;div style=&quot;font-size: 11px;&quot;&gt;provision&lt;/div&gt;" style="text;html=1;strokeColor=none;fillColor=none;align=left;verticalAlign=middle;whiteSpace=wrap;rounded=0;fontSize=11;" vertex="1" parent="1">
          <mxGeometry x="921.12" y="2812" width="48" height="80" as="geometry" />
        </mxCell>
        <mxCell id="35Z6kdMx8G1nahkrQOwo-34" value="provides&lt;br style=&quot;font-size: 11px;&quot;&gt;resources from" style="text;html=1;strokeColor=none;fillColor=none;align=left;verticalAlign=middle;whiteSpace=wrap;rounded=0;fontSize=11;" vertex="1" parent="1">
          <mxGeometry x="925" y="2674" width="63.25" height="20" as="geometry" />
        </mxCell>
        <mxCell id="35Z6kdMx8G1nahkrQOwo-35" value="" style="triangle;whiteSpace=wrap;html=1;fillColor=#000000;rotation=90;" vertex="1" parent="1">
          <mxGeometry x="940.37" y="2712" width="9.5" height="10" as="geometry" />
        </mxCell>
        <mxCell id="35Z6kdMx8G1nahkrQOwo-36" value="" style="triangle;whiteSpace=wrap;html=1;fillColor=#000000;rotation=-90;" vertex="1" parent="1">
          <mxGeometry x="938.37" y="2812" width="9.5" height="10" as="geometry" />
        </mxCell>
        <mxCell id="35Z6kdMx8G1nahkrQOwo-37" value="1..*" style="text;html=1;align=center;verticalAlign=middle;resizable=0;points=[];autosize=1;" vertex="1" parent="1">
          <mxGeometry x="948.75" y="2631" width="30" height="20" as="geometry" />
        </mxCell>
        <mxCell id="35Z6kdMx8G1nahkrQOwo-38" value="" style="triangle;whiteSpace=wrap;html=1;fillColor=#000000;rotation=90;" vertex="1" parent="1">
          <mxGeometry x="1535.75" y="2700" width="9.5" height="10" as="geometry" />
        </mxCell>
        <mxCell id="35Z6kdMx8G1nahkrQOwo-39" value="uses digital offering by" style="text;html=1;strokeColor=none;fillColor=none;align=center;verticalAlign=middle;whiteSpace=wrap;rounded=0;rotation=0;fontSize=11;" vertex="1" parent="1">
          <mxGeometry x="1512" y="2866" width="90" height="20" as="geometry" />
        </mxCell>
        <mxCell id="35Z6kdMx8G1nahkrQOwo-40" value="offers to" style="text;html=1;strokeColor=none;fillColor=none;align=center;verticalAlign=middle;whiteSpace=wrap;rounded=0;rotation=0;fontSize=11;" vertex="1" parent="1">
          <mxGeometry x="1507.25" y="2680" width="80" height="20" as="geometry" />
        </mxCell>
        <mxCell id="35Z6kdMx8G1nahkrQOwo-41" value="" style="triangle;whiteSpace=wrap;html=1;fillColor=#000000;rotation=-90;" vertex="1" parent="1">
          <mxGeometry x="1534" y="2847" width="9.5" height="10" as="geometry" />
        </mxCell>
        <mxCell id="35Z6kdMx8G1nahkrQOwo-42" value="Conceptual Model Gaia-X&lt;br&gt;&lt;hr&gt;level 0" style="text;html=1;strokeColor=none;fillColor=none;align=center;verticalAlign=middle;whiteSpace=wrap;rounded=0;fontStyle=1;fontColor=#000066;" vertex="1" parent="1">
          <mxGeometry x="828.75" y="2350" width="251.25" height="60" as="geometry" />
        </mxCell>
        <mxCell id="35Z6kdMx8G1nahkrQOwo-43" value="" style="endArrow=classic;html=1;edgeStyle=orthogonalEdgeStyle;strokeWidth=1;endFill=1;endSize=12;exitX=0.5;exitY=1;exitDx=0;exitDy=0;startArrow=none;startFill=0;" edge="1" parent="1" source="35Z6kdMx8G1nahkrQOwo-5" target="35Z6kdMx8G1nahkrQOwo-12">
          <mxGeometry relative="1" as="geometry">
            <mxPoint x="1485.44" y="2716" as="sourcePoint" />
            <mxPoint x="1421" y="3444" as="targetPoint" />
            <Array as="points">
              <mxPoint x="1489" y="2920" />
              <mxPoint x="1380" y="2920" />
            </Array>
          </mxGeometry>
        </mxCell>
        <mxCell id="35Z6kdMx8G1nahkrQOwo-44" value="consumes" style="edgeLabel;html=1;align=center;verticalAlign=middle;resizable=0;points=[];" vertex="1" connectable="0" parent="35Z6kdMx8G1nahkrQOwo-43">
          <mxGeometry x="-0.0421" y="-4" relative="1" as="geometry">
            <mxPoint x="-43" y="41" as="offset" />
          </mxGeometry>
        </mxCell>
        <mxCell id="35Z6kdMx8G1nahkrQOwo-45" value="" style="endArrow=classic;html=1;edgeStyle=orthogonalEdgeStyle;targetPerimeterSpacing=0;endFill=1;endSize=12;" edge="1" parent="1" source="35Z6kdMx8G1nahkrQOwo-9" target="35Z6kdMx8G1nahkrQOwo-50">
          <mxGeometry relative="1" as="geometry">
            <mxPoint x="1050" y="3191" as="sourcePoint" />
            <mxPoint x="1090" y="3183" as="targetPoint" />
            <Array as="points">
              <mxPoint x="964" y="2910" />
              <mxPoint x="1240" y="2910" />
            </Array>
          </mxGeometry>
        </mxCell>
        <mxCell id="35Z6kdMx8G1nahkrQOwo-46" value="owns" style="edgeLabel;html=1;align=center;verticalAlign=middle;resizable=0;points=[];" vertex="1" connectable="0" parent="35Z6kdMx8G1nahkrQOwo-45">
          <mxGeometry x="-0.5117" y="2" relative="1" as="geometry">
            <mxPoint x="7.75" y="3" as="offset" />
          </mxGeometry>
        </mxCell>
        <mxCell id="35Z6kdMx8G1nahkrQOwo-47" value="1..*" style="text;html=1;align=center;verticalAlign=middle;resizable=0;points=[];autosize=1;" vertex="1" parent="1">
          <mxGeometry x="917" y="2906" width="30" height="20" as="geometry" />
        </mxCell>
        <mxCell id="35Z6kdMx8G1nahkrQOwo-48" style="edgeStyle=orthogonalEdgeStyle;rounded=0;orthogonalLoop=1;jettySize=auto;html=1;endSize=12;endArrow=classic;endFill=1;" edge="1" parent="1" source="35Z6kdMx8G1nahkrQOwo-50" target="35Z6kdMx8G1nahkrQOwo-12">
          <mxGeometry relative="1" as="geometry">
            <Array as="points">
              <mxPoint x="1330" y="2960" />
              <mxPoint x="1330" y="2960" />
            </Array>
          </mxGeometry>
        </mxCell>
        <mxCell id="35Z6kdMx8G1nahkrQOwo-49" value="realized by" style="edgeLabel;html=1;align=center;verticalAlign=middle;resizable=0;points=[];" vertex="1" connectable="0" parent="35Z6kdMx8G1nahkrQOwo-48">
          <mxGeometry x="0.2832" relative="1" as="geometry">
            <mxPoint x="-3" y="-32" as="offset" />
          </mxGeometry>
        </mxCell>
        <object label="Service Composition" placeholders="1" id="35Z6kdMx8G1nahkrQOwo-50">
          <mxCell style="swimlane;fontStyle=1;childLayout=stackLayout;horizontal=1;startSize=26;horizontalStack=0;resizeParent=1;resizeParentMax=0;resizeLast=0;collapsible=1;marginBottom=0;strokeColor=#6c8ebf;rounded=0;sketch=0;shadow=0;glass=0;swimlaneLine=0;fillColor=#DAE8FC;" vertex="1" parent="1">
            <mxGeometry x="1205" y="2810" width="140" height="46" as="geometry">
              <mxRectangle x="1203" y="2810" width="130" height="26" as="alternateBounds" />
            </mxGeometry>
          </mxCell>
        </object>
        <mxCell id="35Z6kdMx8G1nahkrQOwo-51" value="*" style="text;html=1;align=center;verticalAlign=middle;resizable=0;points=[];autosize=1;" vertex="1" parent="1">
          <mxGeometry x="1509.75" y="2643" width="20" height="20" as="geometry" />
        </mxCell>
        <mxCell id="35Z6kdMx8G1nahkrQOwo-52" value="1..*" style="text;html=1;align=center;verticalAlign=middle;resizable=0;points=[];autosize=1;" vertex="1" parent="1">
          <mxGeometry x="1122" y="3012" width="30" height="20" as="geometry" />
        </mxCell>
        <mxCell id="35Z6kdMx8G1nahkrQOwo-53" value="*" style="text;html=1;align=center;verticalAlign=middle;resizable=0;points=[];autosize=1;" vertex="1" parent="1">
          <mxGeometry x="1243.5" y="3062" width="20" height="20" as="geometry" />
        </mxCell>
        <mxCell id="35Z6kdMx8G1nahkrQOwo-54" value="*" style="text;html=1;align=center;verticalAlign=middle;resizable=0;points=[];autosize=1;" vertex="1" parent="1">
          <mxGeometry x="1358.5" y="2976" width="20" height="20" as="geometry" />
        </mxCell>
        <mxCell id="35Z6kdMx8G1nahkrQOwo-55" value="1" style="text;html=1;align=center;verticalAlign=middle;resizable=0;points=[];autosize=1;" vertex="1" parent="1">
          <mxGeometry x="968.25" y="2920" width="20" height="20" as="geometry" />
        </mxCell>
        <mxCell id="35Z6kdMx8G1nahkrQOwo-56" style="edgeStyle=orthogonalEdgeStyle;rounded=1;orthogonalLoop=1;jettySize=auto;html=1;startArrow=none;startFill=0;startSize=12;endArrow=classic;endFill=1;endSize=12;strokeColor=#000000;" edge="1" parent="1" source="35Z6kdMx8G1nahkrQOwo-50" target="35Z6kdMx8G1nahkrQOwo-21">
          <mxGeometry relative="1" as="geometry">
            <Array as="points">
              <mxPoint x="1411" y="2824" />
              <mxPoint x="1411" y="2694" />
            </Array>
          </mxGeometry>
        </mxCell>
        <mxCell id="35Z6kdMx8G1nahkrQOwo-57" value="uses&lt;br&gt;&amp;amp;&lt;br&gt;conforms" style="edgeLabel;html=1;align=center;verticalAlign=middle;resizable=0;points=[];" vertex="1" connectable="0" parent="35Z6kdMx8G1nahkrQOwo-56">
          <mxGeometry x="0.3949" y="1" relative="1" as="geometry">
            <mxPoint x="-0.5" y="23.52" as="offset" />
          </mxGeometry>
        </mxCell>
        <mxCell id="35Z6kdMx8G1nahkrQOwo-58" value="*" style="text;html=1;align=center;verticalAlign=middle;resizable=0;points=[];autosize=1;" vertex="1" parent="1">
          <mxGeometry x="1504" y="2995" width="20" height="20" as="geometry" />
        </mxCell>
        <mxCell id="35Z6kdMx8G1nahkrQOwo-59" style="edgeStyle=orthogonalEdgeStyle;rounded=1;orthogonalLoop=1;jettySize=auto;html=1;startArrow=none;startFill=0;startSize=12;endArrow=classic;endFill=1;endSize=12;strokeColor=#000000;" edge="1" parent="1" source="35Z6kdMx8G1nahkrQOwo-21" target="35Z6kdMx8G1nahkrQOwo-50">
          <mxGeometry relative="1" as="geometry">
            <Array as="points">
              <mxPoint x="1151" y="2696" />
              <mxPoint x="1151" y="2820" />
            </Array>
            <mxPoint x="1191" y="2742" as="sourcePoint" />
            <mxPoint x="1201" y="2904" as="targetPoint" />
          </mxGeometry>
        </mxCell>
        <mxCell id="35Z6kdMx8G1nahkrQOwo-60" value="provides&lt;br&gt;foundation" style="edgeLabel;html=1;align=center;verticalAlign=middle;resizable=0;points=[];" vertex="1" connectable="0" parent="35Z6kdMx8G1nahkrQOwo-59">
          <mxGeometry x="-0.3915" y="-2" relative="1" as="geometry">
            <mxPoint x="2" y="23.16" as="offset" />
          </mxGeometry>
        </mxCell>
        <mxCell id="35Z6kdMx8G1nahkrQOwo-61" value="1" style="text;html=1;align=center;verticalAlign=middle;resizable=0;points=[];autosize=1;" vertex="1" parent="1">
          <mxGeometry x="958.75" y="2584" width="20" height="20" as="geometry" />
        </mxCell>
        <mxCell id="35Z6kdMx8G1nahkrQOwo-62" value="*" style="text;html=1;align=center;verticalAlign=middle;resizable=0;points=[];autosize=1;" vertex="1" parent="1">
          <mxGeometry x="1507.25" y="2924" width="20" height="20" as="geometry" />
        </mxCell>
        <mxCell id="35Z6kdMx8G1nahkrQOwo-63" value="1" style="text;html=1;align=center;verticalAlign=middle;resizable=0;points=[];autosize=1;" vertex="1" parent="1">
          <mxGeometry x="1050.25" y="2643" width="20" height="20" as="geometry" />
        </mxCell>
        <mxCell id="35Z6kdMx8G1nahkrQOwo-64" value="&lt;div&gt;&lt;u&gt;Legend:&lt;/u&gt;&lt;/div&gt;&lt;div style=&quot;text-align: left&quot;&gt;&lt;u&gt;&lt;br&gt;&lt;/u&gt;&lt;/div&gt;&lt;div style=&quot;text-align: left&quot;&gt;&lt;span style=&quot;background-color: rgb(216 , 233 , 251)&quot;&gt;Blue background&lt;/span&gt;: &lt;span&gt;within Gaia-X scope&lt;br&gt;and subject to Trust Framework&lt;/span&gt;&lt;/div&gt;&lt;div style=&quot;text-align: left&quot;&gt;&lt;span&gt;&lt;br&gt;&lt;/span&gt;&lt;/div&gt;&lt;div style=&quot;text-align: left&quot;&gt;&lt;span style=&quot;background-color: rgb(255 , 255 , 255)&quot;&gt;&lt;font&gt;White &lt;/font&gt;background&lt;/span&gt;: outside Gaia-X scope&lt;br&gt;&lt;/div&gt;" style="text;html=1;strokeColor=none;fillColor=none;align=center;verticalAlign=middle;whiteSpace=wrap;rounded=0;" vertex="1" parent="1">
          <mxGeometry x="1381" y="2349.25" width="261" height="119.5" as="geometry" />
        </mxCell>
        <mxCell id="35Z6kdMx8G1nahkrQOwo-65" value="offers&lt;br&gt;&amp;amp;&lt;br&gt;provides" style="endArrow=none;html=1;edgeStyle=orthogonalEdgeStyle;strokeWidth=1;endFill=0;endSize=12;entryX=1.174;entryY=0.014;entryDx=0;entryDy=0;entryPerimeter=0;" edge="1" parent="1" target="35Z6kdMx8G1nahkrQOwo-68">
          <mxGeometry x="-0.7314" relative="1" as="geometry">
            <mxPoint x="1047" y="2643" as="sourcePoint" />
            <mxPoint x="1200" y="2840" as="targetPoint" />
            <Array as="points">
              <mxPoint x="1047" y="2840" />
            </Array>
            <mxPoint as="offset" />
          </mxGeometry>
        </mxCell>
        <mxCell id="35Z6kdMx8G1nahkrQOwo-66" value="isOfferedBy&lt;br&gt;&amp;amp;&lt;br&gt;isProvidedBy" style="edgeLabel;html=1;align=center;verticalAlign=middle;resizable=0;points=[];" vertex="1" connectable="0" parent="35Z6kdMx8G1nahkrQOwo-65">
          <mxGeometry x="-0.1854" y="-1" relative="1" as="geometry">
            <mxPoint as="offset" />
          </mxGeometry>
        </mxCell>
        <mxCell id="35Z6kdMx8G1nahkrQOwo-67" value="1" style="text;html=1;align=center;verticalAlign=middle;resizable=0;points=[];autosize=1;" vertex="1" parent="1">
          <mxGeometry x="1250" y="2548" width="20" height="20" as="geometry" />
        </mxCell>
        <mxCell id="35Z6kdMx8G1nahkrQOwo-68" value="*" style="text;html=1;align=center;verticalAlign=middle;resizable=0;points=[];autosize=1;" vertex="1" parent="1">
          <mxGeometry x="1182" y="2840" width="20" height="20" as="geometry" />
        </mxCell>
        <mxCell id="35Z6kdMx8G1nahkrQOwo-69" value="Data Infrastructure ecosystem" style="text;html=1;strokeColor=none;fillColor=none;align=center;verticalAlign=middle;whiteSpace=wrap;rounded=0;dashed=1;fontSize=11;" vertex="1" parent="1">
          <mxGeometry x="850" y="2546" width="180" height="20" as="geometry" />
        </mxCell>
        <mxCell id="35Z6kdMx8G1nahkrQOwo-70" style="edgeStyle=orthogonalEdgeStyle;rounded=0;orthogonalLoop=1;jettySize=auto;html=1;endSize=12;endArrow=classic;endFill=1;" edge="1" parent="1" source="35Z6kdMx8G1nahkrQOwo-12" target="35Z6kdMx8G1nahkrQOwo-50">
          <mxGeometry relative="1" as="geometry">
            <Array as="points">
              <mxPoint x="1260" y="2970" />
              <mxPoint x="1260" y="2970" />
            </Array>
            <mxPoint x="1309.88" y="2890.3" as="sourcePoint" />
            <mxPoint x="1309.9" y="3258" as="targetPoint" />
          </mxGeometry>
        </mxCell>
        <mxCell id="35Z6kdMx8G1nahkrQOwo-71" value="conforms to" style="edgeLabel;html=1;align=center;verticalAlign=middle;resizable=0;points=[];" vertex="1" connectable="0" parent="35Z6kdMx8G1nahkrQOwo-70">
          <mxGeometry x="0.2832" relative="1" as="geometry">
            <mxPoint x="-2" y="43" as="offset" />
          </mxGeometry>
        </mxCell>
        <mxCell id="35Z6kdMx8G1nahkrQOwo-72" value="" style="triangle;whiteSpace=wrap;html=1;fillColor=#000000;rotation=90;" vertex="1" parent="1">
          <mxGeometry x="1296.5" y="2637" width="9.5" height="10" as="geometry" />
        </mxCell>
        <mxCell id="35Z6kdMx8G1nahkrQOwo-73" value="isProvidedBy" style="edgeLabel;html=1;align=center;verticalAlign=middle;resizable=0;points=[];" vertex="1" connectable="0" parent="1">
          <mxGeometry x="1278" y="2646.995238095238" as="geometry">
            <mxPoint x="-7" y="-55" as="offset" />
          </mxGeometry>
        </mxCell>
        <mxCell id="35Z6kdMx8G1nahkrQOwo-74" value="" style="triangle;whiteSpace=wrap;html=1;fillColor=#000000;rotation=-90;" vertex="1" parent="1">
          <mxGeometry x="1307" y="2587" width="9.5" height="10" as="geometry" />
        </mxCell>
        <mxCell id="35Z6kdMx8G1nahkrQOwo-75" value="" style="triangle;whiteSpace=wrap;html=1;fillColor=#000000;rotation=90;" vertex="1" parent="1">
          <mxGeometry x="1066.5" y="2684" width="9.5" height="10" as="geometry" />
        </mxCell>
        <mxCell id="35Z6kdMx8G1nahkrQOwo-76" value="" style="triangle;whiteSpace=wrap;html=1;fillColor=#000000;rotation=-90;" vertex="1" parent="1">
          <mxGeometry x="1077" y="2781" width="9.5" height="10" as="geometry" />
        </mxCell>
        <mxCell id="35Z6kdMx8G1nahkrQOwo-77" style="edgeStyle=orthogonalEdgeStyle;rounded=1;orthogonalLoop=1;jettySize=auto;html=1;startArrow=none;startFill=0;startSize=12;endArrow=classic;endFill=1;endSize=12;strokeColor=#000000;" edge="1" parent="1" source="35Z6kdMx8G1nahkrQOwo-5" target="35Z6kdMx8G1nahkrQOwo-50">
          <mxGeometry relative="1" as="geometry">
            <Array as="points">
              <mxPoint x="1460" y="2840" />
            </Array>
            <mxPoint x="1480" y="2620" as="sourcePoint" />
            <mxPoint x="1361" y="2704" as="targetPoint" />
          </mxGeometry>
        </mxCell>
        <mxCell id="35Z6kdMx8G1nahkrQOwo-78" value="configures" style="edgeLabel;html=1;align=center;verticalAlign=middle;resizable=0;points=[];" vertex="1" connectable="0" parent="35Z6kdMx8G1nahkrQOwo-77">
          <mxGeometry x="0.3949" y="1" relative="1" as="geometry">
            <mxPoint x="-9" y="11" as="offset" />
          </mxGeometry>
        </mxCell>
        <mxCell id="35Z6kdMx8G1nahkrQOwo-79" value="1" style="text;html=1;align=center;verticalAlign=middle;resizable=0;points=[];autosize=1;" vertex="1" parent="1">
          <mxGeometry x="1442" y="2643" width="20" height="20" as="geometry" />
        </mxCell>
        <mxCell id="35Z6kdMx8G1nahkrQOwo-80" value="1" style="text;html=1;align=center;verticalAlign=middle;resizable=0;points=[];autosize=1;" vertex="1" parent="1">
          <mxGeometry x="1361" y="2842" width="20" height="20" as="geometry" />
        </mxCell>
        <mxCell id="35Z6kdMx8G1nahkrQOwo-81" value="&lt;b&gt;&lt;font style=&quot;font-size: 18px&quot;&gt;See Figure 4.3 for &lt;br&gt;Service Composition &lt;br&gt;Model Diagram&lt;/font&gt;&lt;/b&gt;" style="ellipse;whiteSpace=wrap;html=1;fillColor=#DAE8FC;" vertex="1" parent="1">
          <mxGeometry x="1550" y="2690" width="250" height="160" as="geometry" />
        </mxCell>
        <mxCell id="35Z6kdMx8G1nahkrQOwo-82" value="" style="endArrow=none;dashed=1;html=1;rounded=0;entryX=0.242;entryY=0.067;entryDx=0;entryDy=0;entryPerimeter=0;" edge="1" parent="1" target="35Z6kdMx8G1nahkrQOwo-81">
          <mxGeometry width="50" height="50" relative="1" as="geometry">
            <mxPoint x="1343.5" y="2812" as="sourcePoint" />
            <mxPoint x="1393.5" y="2762" as="targetPoint" />
          </mxGeometry>
        </mxCell>
        <mxCell id="35Z6kdMx8G1nahkrQOwo-83" value="" style="endArrow=none;dashed=1;html=1;rounded=0;exitX=1;exitY=0.5;exitDx=0;exitDy=0;entryX=0.36;entryY=0.983;entryDx=0;entryDy=0;entryPerimeter=0;" edge="1" parent="1" source="35Z6kdMx8G1nahkrQOwo-50" target="35Z6kdMx8G1nahkrQOwo-81">
          <mxGeometry width="50" height="50" relative="1" as="geometry">
            <mxPoint x="1341" y="2856" as="sourcePoint" />
            <mxPoint x="1610" y="2833" as="targetPoint" />
          </mxGeometry>
        </mxCell>
      </root>
    </mxGraphModel>
  </diagram>
</mxfile>
