<mxfile host="Electron" modified="2024-08-23T08:10:32.839Z" agent="Mozilla/5.0 (Macintosh; Intel Mac OS X 10_15_7) AppleWebKit/537.36 (KHTML, like Gecko) draw.io/22.0.2 Chrome/114.0.5735.289 Electron/25.8.4 Safari/537.36" etag="zcIcnIosZ4ncBqWPkQvb" version="22.0.2" type="device">
  <diagram id="R2lEEEUBdFMjLlhIrx00" name="Page-1">
    <mxGraphModel dx="1194" dy="617" grid="0" gridSize="10" guides="1" tooltips="1" connect="1" arrows="1" fold="1" page="1" pageScale="1" pageWidth="1169" pageHeight="827" math="0" shadow="0" extFonts="Permanent Marker^https://fonts.googleapis.com/css?family=Permanent+Marker">
      <root>
        <mxCell id="0" />
        <mxCell id="1" parent="0" />
        <mxCell id="sox7Q45_UDwk4od5wGgl-27" value="" style="whiteSpace=wrap;html=1;aspect=fixed;fontColor=#CC0000;align=left;strokeColor=none;" parent="1" vertex="1">
          <mxGeometry x="853" y="494" width="20" height="20" as="geometry" />
        </mxCell>
        <mxCell id="sox7Q45_UDwk4od5wGgl-12" value="&lt;font style=&quot;font-size: 14px&quot;&gt;Data Holder domain&lt;/font&gt;" style="rounded=0;whiteSpace=wrap;html=1;dashed=1;align=left;labelPosition=center;verticalLabelPosition=top;verticalAlign=bottom;fillColor=none;" parent="1" vertex="1">
          <mxGeometry x="160" y="150" width="480" height="242" as="geometry" />
        </mxCell>
        <mxCell id="6JW0DsT9mkhbRYNr-I8Z-3" value="&lt;font style=&quot;font-size: 14px&quot;&gt;&amp;nbsp; Data Processor Domain&lt;/font&gt;" style="rounded=0;whiteSpace=wrap;html=1;dashed=1;align=left;labelPosition=center;verticalLabelPosition=top;verticalAlign=bottom;fillColor=none;" parent="1" vertex="1">
          <mxGeometry x="680" y="373" width="160" height="180" as="geometry" />
        </mxCell>
        <mxCell id="6JW0DsT9mkhbRYNr-I8Z-2" value="&lt;font style=&quot;font-size: 14px&quot;&gt;Data Producer domain&lt;/font&gt;" style="rounded=0;whiteSpace=wrap;html=1;dashed=1;align=left;labelPosition=center;verticalLabelPosition=top;verticalAlign=bottom;fillColor=none;" parent="1" vertex="1">
          <mxGeometry x="160" y="430" width="480" height="72" as="geometry" />
        </mxCell>
        <mxCell id="6JW0DsT9mkhbRYNr-I8Z-1" value="&lt;font style=&quot;font-size: 14px&quot;&gt;Data Controller domain&lt;/font&gt;" style="rounded=0;whiteSpace=wrap;html=1;dashed=1;align=left;labelPosition=center;verticalLabelPosition=bottom;verticalAlign=top;fillColor=none;" parent="1" vertex="1">
          <mxGeometry x="160" y="542" width="480" height="100" as="geometry" />
        </mxCell>
        <mxCell id="41OGUySgZU15ob5suG2t-27" value="givenFor" style="edgeStyle=none;rounded=0;orthogonalLoop=1;jettySize=auto;html=1;endArrow=block;endFill=1;" parent="1" source="41OGUySgZU15ob5suG2t-1" target="41OGUySgZU15ob5suG2t-10" edge="1">
          <mxGeometry relative="1" as="geometry" />
        </mxCell>
        <mxCell id="41OGUySgZU15ob5suG2t-1" value="Consent" style="whiteSpace=wrap;html=1;align=center;" parent="1" vertex="1">
          <mxGeometry x="200" y="562" width="100" height="40" as="geometry" />
        </mxCell>
        <mxCell id="41OGUySgZU15ob5suG2t-28" value="provides" style="edgeStyle=none;rounded=0;orthogonalLoop=1;jettySize=auto;html=1;endArrow=block;endFill=1;exitX=1;exitY=1;exitDx=0;exitDy=0;entryX=0;entryY=0.5;entryDx=0;entryDy=0;" parent="1" source="41OGUySgZU15ob5suG2t-2" target="41OGUySgZU15ob5suG2t-1" edge="1">
          <mxGeometry relative="1" as="geometry" />
        </mxCell>
        <mxCell id="41OGUySgZU15ob5suG2t-2" value="Data Subject&lt;br&gt;&lt;i&gt;(or delegate)&lt;/i&gt;" style="whiteSpace=wrap;html=1;align=center;" parent="1" vertex="1">
          <mxGeometry x="30" y="502" width="100" height="40" as="geometry" />
        </mxCell>
        <mxCell id="41OGUySgZU15ob5suG2t-29" value="identifies" style="edgeStyle=none;rounded=0;orthogonalLoop=1;jettySize=auto;html=1;endArrow=block;endFill=1;exitX=0;exitY=0.5;exitDx=0;exitDy=0;entryX=1;entryY=0;entryDx=0;entryDy=0;" parent="1" source="41OGUySgZU15ob5suG2t-3" target="41OGUySgZU15ob5suG2t-2" edge="1">
          <mxGeometry relative="1" as="geometry" />
        </mxCell>
        <mxCell id="41OGUySgZU15ob5suG2t-31" value="providedTo" style="edgeStyle=none;rounded=0;orthogonalLoop=1;jettySize=auto;html=1;endArrow=block;endFill=1;exitX=1;exitY=0.5;exitDx=0;exitDy=0;" parent="1" source="6JW0DsT9mkhbRYNr-I8Z-6" target="41OGUySgZU15ob5suG2t-4" edge="1">
          <mxGeometry relative="1" as="geometry">
            <mxPoint x="895" y="552" as="targetPoint" />
          </mxGeometry>
        </mxCell>
        <mxCell id="41OGUySgZU15ob5suG2t-3" value="Personal&lt;br&gt;Data" style="whiteSpace=wrap;html=1;align=center;" parent="1" vertex="1">
          <mxGeometry x="200" y="442" width="100" height="40" as="geometry" />
        </mxCell>
        <mxCell id="41OGUySgZU15ob5suG2t-4" value="Recipient" style="whiteSpace=wrap;html=1;align=center;" parent="1" vertex="1">
          <mxGeometry x="925" y="480" width="100" height="40" as="geometry" />
        </mxCell>
        <mxCell id="41OGUySgZU15ob5suG2t-24" style="edgeStyle=none;rounded=0;orthogonalLoop=1;jettySize=auto;html=1;endArrow=block;endFill=1;exitX=1;exitY=0.5;exitDx=0;exitDy=0;entryX=0;entryY=1;entryDx=0;entryDy=0;" parent="1" source="41OGUySgZU15ob5suG2t-9" target="41OGUySgZU15ob5suG2t-16" edge="1">
          <mxGeometry relative="1" as="geometry">
            <mxPoint x="790" y="752" as="targetPoint" />
          </mxGeometry>
        </mxCell>
        <mxCell id="41OGUySgZU15ob5suG2t-25" value="restricts" style="edgeLabel;html=1;align=center;verticalAlign=middle;resizable=0;points=[];" parent="41OGUySgZU15ob5suG2t-24" vertex="1" connectable="0">
          <mxGeometry x="-0.17" y="-1" relative="1" as="geometry">
            <mxPoint x="-14" y="12" as="offset" />
          </mxGeometry>
        </mxCell>
        <mxCell id="41OGUySgZU15ob5suG2t-9" value="Restrictions" style="whiteSpace=wrap;html=1;align=center;" parent="1" vertex="1">
          <mxGeometry x="510" y="562" width="100" height="40" as="geometry" />
        </mxCell>
        <mxCell id="41OGUySgZU15ob5suG2t-26" value="imposes" style="edgeStyle=none;rounded=0;orthogonalLoop=1;jettySize=auto;html=1;endArrow=block;endFill=1;" parent="1" source="41OGUySgZU15ob5suG2t-10" target="41OGUySgZU15ob5suG2t-9" edge="1">
          <mxGeometry relative="1" as="geometry" />
        </mxCell>
        <mxCell id="41OGUySgZU15ob5suG2t-10" value="Purpose&lt;span style=&quot;color: rgba(0 , 0 , 0 , 0) ; font-family: monospace ; font-size: 0px&quot;&gt;%3CmxGraphModel%3E%3Croot%3E%3CmxCell%20id%3D%220%22%2F%3E%3CmxCell%20id%3D%221%22%20parent%3D%220%22%2F%3E%3CmxCell%20id%3D%222%22%20value%3D%22Consent%22%20style%3D%22whiteSpace%3Dwrap%3Bhtml%3D1%3Balign%3Dcenter%3B%22%20vertex%3D%221%22%20parent%3D%221%22%3E%3CmxGeometry%20x%3D%22160%22%20y%3D%22320%22%20width%3D%22100%22%20height%3D%2240%22%20as%3D%22geometry%22%2F%3E%3C%2FmxCell%3E%3C%2Froot%3E%3C%2FmxGraphModel%3E&lt;/span&gt;" style="whiteSpace=wrap;html=1;align=center;" parent="1" vertex="1">
          <mxGeometry x="370" y="562" width="70" height="40" as="geometry" />
        </mxCell>
        <mxCell id="41OGUySgZU15ob5suG2t-32" value="uses" style="edgeStyle=none;rounded=0;orthogonalLoop=1;jettySize=auto;html=1;entryX=1;entryY=0.5;entryDx=0;entryDy=0;endArrow=block;endFill=1;exitX=0;exitY=0.5;exitDx=0;exitDy=0;" parent="1" source="41OGUySgZU15ob5suG2t-16" target="41OGUySgZU15ob5suG2t-3" edge="1">
          <mxGeometry x="0.7027" y="-2" relative="1" as="geometry">
            <mxPoint as="offset" />
          </mxGeometry>
        </mxCell>
        <mxCell id="6JW0DsT9mkhbRYNr-I8Z-10" value="" style="edgeStyle=orthogonalEdgeStyle;rounded=0;orthogonalLoop=1;jettySize=auto;html=1;fontSize=14;" parent="1" source="41OGUySgZU15ob5suG2t-16" target="6JW0DsT9mkhbRYNr-I8Z-6" edge="1">
          <mxGeometry relative="1" as="geometry" />
        </mxCell>
        <mxCell id="41OGUySgZU15ob5suG2t-16" value="Data Processing" style="whiteSpace=wrap;html=1;align=center;" parent="1" vertex="1">
          <mxGeometry x="705" y="393" width="100" height="40" as="geometry" />
        </mxCell>
        <mxCell id="41OGUySgZU15ob5suG2t-38" value="Data Usage Agreement" style="text;html=1;strokeColor=none;fillColor=none;align=center;verticalAlign=middle;whiteSpace=wrap;rounded=0;fontColor=#3333FF;fontStyle=1" parent="1" vertex="1">
          <mxGeometry x="345" y="612" width="169" height="30" as="geometry" />
        </mxCell>
        <mxCell id="41OGUySgZU15ob5suG2t-39" value="" style="shape=curlyBracket;whiteSpace=wrap;html=1;rounded=1;flipH=1;fontColor=#3333FF;align=left;rotation=90;strokeColor=#0066CC;" parent="1" vertex="1">
          <mxGeometry x="390" y="392" width="30" height="435" as="geometry" />
        </mxCell>
        <mxCell id="41OGUySgZU15ob5suG2t-41" value="Data RIghts Holder" style="text;html=1;strokeColor=none;fillColor=none;align=left;verticalAlign=middle;whiteSpace=wrap;rounded=0;fontColor=#3333FF;fontStyle=1" parent="1" vertex="1">
          <mxGeometry x="20" y="542" width="120" height="30" as="geometry" />
        </mxCell>
        <mxCell id="41OGUySgZU15ob5suG2t-42" value="Data Consumer" style="text;html=1;strokeColor=none;fillColor=none;align=left;verticalAlign=middle;whiteSpace=wrap;rounded=0;fontColor=#3333FF;fontStyle=1" parent="1" vertex="1">
          <mxGeometry x="928" y="459" width="97" height="23" as="geometry" />
        </mxCell>
        <mxCell id="41OGUySgZU15ob5suG2t-43" value="Data Provider" style="text;html=1;strokeColor=none;fillColor=none;align=left;verticalAlign=middle;whiteSpace=wrap;rounded=0;fontColor=#3333FF;fontStyle=1" parent="1" vertex="1">
          <mxGeometry x="691" y="330" width="93" height="30" as="geometry" />
        </mxCell>
        <mxCell id="41OGUySgZU15ob5suG2t-46" value="Data Product" style="text;html=1;strokeColor=none;fillColor=none;align=left;verticalAlign=middle;whiteSpace=wrap;rounded=0;fontColor=#3333FF;fontStyle=1" parent="1" vertex="1">
          <mxGeometry x="750" y="518" width="120" height="30" as="geometry" />
        </mxCell>
        <mxCell id="41OGUySgZU15ob5suG2t-47" value="Data Producer" style="text;html=1;strokeColor=none;fillColor=none;align=left;verticalAlign=middle;whiteSpace=wrap;rounded=0;fontColor=#3333FF;fontStyle=1" parent="1" vertex="1">
          <mxGeometry x="307.5" y="402" width="145" height="30" as="geometry" />
        </mxCell>
        <mxCell id="6JW0DsT9mkhbRYNr-I8Z-6" value="(Personal) Data" style="whiteSpace=wrap;html=1;align=center;" parent="1" vertex="1">
          <mxGeometry x="705" y="483" width="100" height="40" as="geometry" />
        </mxCell>
        <mxCell id="6JW0DsT9mkhbRYNr-I8Z-7" value="relatesTo" style="edgeStyle=none;rounded=0;orthogonalLoop=1;jettySize=auto;html=1;endArrow=block;endFill=1;exitX=0.5;exitY=0;exitDx=0;exitDy=0;entryX=0.5;entryY=1;entryDx=0;entryDy=0;" parent="1" source="41OGUySgZU15ob5suG2t-1" target="41OGUySgZU15ob5suG2t-3" edge="1">
          <mxGeometry relative="1" as="geometry">
            <mxPoint x="217.5" y="492" as="sourcePoint" />
            <mxPoint x="132.5" y="532" as="targetPoint" />
            <mxPoint as="offset" />
          </mxGeometry>
        </mxCell>
        <mxCell id="6JW0DsT9mkhbRYNr-I8Z-8" style="edgeStyle=none;rounded=0;orthogonalLoop=1;jettySize=auto;html=1;endArrow=block;endFill=1;entryX=0.5;entryY=0;entryDx=0;entryDy=0;" parent="1" source="41OGUySgZU15ob5suG2t-16" target="6JW0DsT9mkhbRYNr-I8Z-6" edge="1">
          <mxGeometry relative="1" as="geometry">
            <mxPoint x="575" y="603" as="sourcePoint" />
            <mxPoint x="715" y="433" as="targetPoint" />
          </mxGeometry>
        </mxCell>
        <mxCell id="6JW0DsT9mkhbRYNr-I8Z-9" value="resultsIn" style="edgeLabel;html=1;align=center;verticalAlign=middle;resizable=0;points=[];" parent="6JW0DsT9mkhbRYNr-I8Z-8" vertex="1" connectable="0">
          <mxGeometry x="-0.17" y="-1" relative="1" as="geometry">
            <mxPoint as="offset" />
          </mxGeometry>
        </mxCell>
        <mxCell id="6JW0DsT9mkhbRYNr-I8Z-12" value="Data Usage Agreement Trust Anchor" style="text;html=1;strokeColor=none;fillColor=none;align=left;verticalAlign=middle;whiteSpace=wrap;rounded=0;fontColor=#3333FF;fontStyle=3" parent="1" vertex="1">
          <mxGeometry x="445" y="636" width="239" height="30" as="geometry" />
        </mxCell>
        <mxCell id="6JW0DsT9mkhbRYNr-I8Z-13" style="edgeStyle=orthogonalEdgeStyle;rounded=0;orthogonalLoop=1;jettySize=auto;html=1;endArrow=block;endFill=1;entryX=0.5;entryY=1;entryDx=0;entryDy=0;fillColor=#0050ef;strokeColor=#001DBC;exitX=0.5;exitY=1;exitDx=0;exitDy=0;" parent="1" source="sox7Q45_UDwk4od5wGgl-27" target="41OGUySgZU15ob5suG2t-38" edge="1">
          <mxGeometry relative="1" as="geometry">
            <mxPoint x="860" y="500" as="sourcePoint" />
            <mxPoint x="620" y="592" as="targetPoint" />
          </mxGeometry>
        </mxCell>
        <mxCell id="6JW0DsT9mkhbRYNr-I8Z-14" value="Respects the Data Usage Agreement, &lt;br&gt;which is signed&amp;nbsp;by the Data Consumer" style="edgeLabel;html=1;align=center;verticalAlign=middle;resizable=0;points=[];fontColor=#0000FF;" parent="6JW0DsT9mkhbRYNr-I8Z-13" vertex="1" connectable="0">
          <mxGeometry x="-0.17" y="-1" relative="1" as="geometry">
            <mxPoint x="4" y="-1" as="offset" />
          </mxGeometry>
        </mxCell>
        <mxCell id="sox7Q45_UDwk4od5wGgl-1" value="givenFor" style="edgeStyle=none;rounded=0;orthogonalLoop=1;jettySize=auto;html=1;endArrow=block;endFill=1;" parent="1" source="sox7Q45_UDwk4od5wGgl-2" target="sox7Q45_UDwk4od5wGgl-6" edge="1">
          <mxGeometry relative="1" as="geometry" />
        </mxCell>
        <mxCell id="sox7Q45_UDwk4od5wGgl-2" value="Permission&lt;br&gt;or Authorisation" style="whiteSpace=wrap;html=1;align=center;" parent="1" vertex="1">
          <mxGeometry x="199" y="210" width="100" height="40" as="geometry" />
        </mxCell>
        <mxCell id="sox7Q45_UDwk4od5wGgl-3" value="Non-personal Data" style="whiteSpace=wrap;html=1;align=center;" parent="1" vertex="1">
          <mxGeometry x="200" y="339" width="100" height="40" as="geometry" />
        </mxCell>
        <mxCell id="sox7Q45_UDwk4od5wGgl-4" value="Restrictions" style="whiteSpace=wrap;html=1;align=center;" parent="1" vertex="1">
          <mxGeometry x="509" y="210" width="100" height="40" as="geometry" />
        </mxCell>
        <mxCell id="sox7Q45_UDwk4od5wGgl-5" value="imposes" style="edgeStyle=none;rounded=0;orthogonalLoop=1;jettySize=auto;html=1;endArrow=block;endFill=1;" parent="1" source="sox7Q45_UDwk4od5wGgl-6" target="sox7Q45_UDwk4od5wGgl-4" edge="1">
          <mxGeometry relative="1" as="geometry" />
        </mxCell>
        <mxCell id="sox7Q45_UDwk4od5wGgl-6" value="Purpose&lt;span style=&quot;color: rgba(0 , 0 , 0 , 0) ; font-family: monospace ; font-size: 0px&quot;&gt;%3CmxGraphModel%3E%3Croot%3E%3CmxCell%20id%3D%220%22%2F%3E%3CmxCell%20id%3D%221%22%20parent%3D%220%22%2F%3E%3CmxCell%20id%3D%222%22%20value%3D%22Consent%22%20style%3D%22whiteSpace%3Dwrap%3Bhtml%3D1%3Balign%3Dcenter%3B%22%20vertex%3D%221%22%20parent%3D%221%22%3E%3CmxGeometry%20x%3D%22160%22%20y%3D%22320%22%20width%3D%22100%22%20height%3D%2240%22%20as%3D%22geometry%22%2F%3E%3C%2FmxCell%3E%3C%2Froot%3E%3C%2FmxGraphModel%3E&lt;/span&gt;" style="whiteSpace=wrap;html=1;align=center;" parent="1" vertex="1">
          <mxGeometry x="369" y="210" width="70" height="40" as="geometry" />
        </mxCell>
        <mxCell id="sox7Q45_UDwk4od5wGgl-7" value="Data Usage Agreement" style="text;html=1;strokeColor=none;fillColor=none;align=center;verticalAlign=middle;whiteSpace=wrap;rounded=0;fontColor=#3333FF;fontStyle=1" parent="1" vertex="1">
          <mxGeometry x="320" y="160" width="190" height="30" as="geometry" />
        </mxCell>
        <mxCell id="sox7Q45_UDwk4od5wGgl-8" value="" style="shape=curlyBracket;whiteSpace=wrap;html=1;rounded=1;flipH=1;fontColor=#3333FF;align=left;rotation=270;strokeColor=#0066CC;" parent="1" vertex="1">
          <mxGeometry x="380" y="-21" width="30" height="435" as="geometry" />
        </mxCell>
        <mxCell id="sox7Q45_UDwk4od5wGgl-9" value="relatesTo" style="edgeStyle=none;rounded=0;orthogonalLoop=1;jettySize=auto;html=1;endArrow=block;endFill=1;exitX=0.5;exitY=1;exitDx=0;exitDy=0;entryX=0.5;entryY=0;entryDx=0;entryDy=0;" parent="1" source="sox7Q45_UDwk4od5wGgl-2" target="sox7Q45_UDwk4od5wGgl-3" edge="1">
          <mxGeometry relative="1" as="geometry">
            <mxPoint x="192.5" y="140" as="sourcePoint" />
            <mxPoint x="107.5" y="180" as="targetPoint" />
          </mxGeometry>
        </mxCell>
        <mxCell id="sox7Q45_UDwk4od5wGgl-10" value="uses" style="edgeStyle=none;rounded=0;orthogonalLoop=1;jettySize=auto;html=1;entryX=1;entryY=0.5;entryDx=0;entryDy=0;endArrow=block;endFill=1;exitX=0;exitY=0.5;exitDx=0;exitDy=0;" parent="1" source="41OGUySgZU15ob5suG2t-16" target="sox7Q45_UDwk4od5wGgl-3" edge="1">
          <mxGeometry x="0.683" y="1" relative="1" as="geometry">
            <mxPoint x="715" y="472" as="sourcePoint" />
            <mxPoint x="310" y="472" as="targetPoint" />
            <mxPoint as="offset" />
          </mxGeometry>
        </mxCell>
        <mxCell id="sox7Q45_UDwk4od5wGgl-13" value="User&lt;br&gt;&lt;i&gt;(or delegate)&lt;/i&gt;" style="whiteSpace=wrap;html=1;align=center;" parent="1" vertex="1">
          <mxGeometry x="20" y="250" width="100" height="40" as="geometry" />
        </mxCell>
        <mxCell id="sox7Q45_UDwk4od5wGgl-15" value="uses" style="edgeStyle=none;rounded=0;orthogonalLoop=1;jettySize=auto;html=1;endArrow=block;endFill=1;exitX=0.5;exitY=1;exitDx=0;exitDy=0;entryX=0.5;entryY=0;entryDx=0;entryDy=0;" parent="1" source="sox7Q45_UDwk4od5wGgl-13" target="sox7Q45_UDwk4od5wGgl-16" edge="1">
          <mxGeometry relative="1" as="geometry">
            <mxPoint x="100" y="355" as="sourcePoint" />
            <mxPoint x="80" y="360" as="targetPoint" />
          </mxGeometry>
        </mxCell>
        <mxCell id="sox7Q45_UDwk4od5wGgl-16" value="Product / Service" style="whiteSpace=wrap;html=1;align=center;" parent="1" vertex="1">
          <mxGeometry x="20" y="339" width="100" height="40" as="geometry" />
        </mxCell>
        <mxCell id="sox7Q45_UDwk4od5wGgl-17" value="creates" style="edgeStyle=none;rounded=0;orthogonalLoop=1;jettySize=auto;html=1;endArrow=block;endFill=1;entryX=0;entryY=0.5;entryDx=0;entryDy=0;exitX=1;exitY=0.5;exitDx=0;exitDy=0;" parent="1" source="sox7Q45_UDwk4od5wGgl-16" target="sox7Q45_UDwk4od5wGgl-3" edge="1">
          <mxGeometry relative="1" as="geometry">
            <mxPoint x="80" y="440" as="sourcePoint" />
            <mxPoint x="90" y="370" as="targetPoint" />
          </mxGeometry>
        </mxCell>
        <mxCell id="sox7Q45_UDwk4od5wGgl-18" value="provides" style="edgeStyle=none;rounded=0;orthogonalLoop=1;jettySize=auto;html=1;endArrow=block;endFill=1;exitX=1;exitY=0.5;exitDx=0;exitDy=0;entryX=0;entryY=0.5;entryDx=0;entryDy=0;" parent="1" source="sox7Q45_UDwk4od5wGgl-13" target="sox7Q45_UDwk4od5wGgl-2" edge="1">
          <mxGeometry relative="1" as="geometry">
            <mxPoint x="140" y="552" as="sourcePoint" />
            <mxPoint x="210" y="592" as="targetPoint" />
          </mxGeometry>
        </mxCell>
        <mxCell id="sox7Q45_UDwk4od5wGgl-19" style="edgeStyle=orthogonalEdgeStyle;rounded=0;orthogonalLoop=1;jettySize=auto;html=1;endArrow=block;endFill=1;entryX=0.5;entryY=0;entryDx=0;entryDy=0;fillColor=#0050ef;strokeColor=#001DBC;exitX=0.5;exitY=0;exitDx=0;exitDy=0;" parent="1" source="sox7Q45_UDwk4od5wGgl-27" target="sox7Q45_UDwk4od5wGgl-12" edge="1">
          <mxGeometry relative="1" as="geometry">
            <mxPoint x="850" y="490" as="sourcePoint" />
            <mxPoint x="415" y="652" as="targetPoint" />
          </mxGeometry>
        </mxCell>
        <mxCell id="sox7Q45_UDwk4od5wGgl-20" value="Respects the Data Usage Agreement, &lt;br&gt;which is signed by the Data Consumer" style="edgeLabel;html=1;align=center;verticalAlign=middle;resizable=0;points=[];fontColor=#0000FF;" parent="sox7Q45_UDwk4od5wGgl-19" vertex="1" connectable="0">
          <mxGeometry x="-0.17" y="-1" relative="1" as="geometry">
            <mxPoint x="-124" y="-16" as="offset" />
          </mxGeometry>
        </mxCell>
        <mxCell id="sox7Q45_UDwk4od5wGgl-21" style="edgeStyle=none;rounded=0;orthogonalLoop=1;jettySize=auto;html=1;endArrow=block;endFill=1;entryX=0;entryY=0;entryDx=0;entryDy=0;exitX=1;exitY=0.5;exitDx=0;exitDy=0;" parent="1" source="sox7Q45_UDwk4od5wGgl-4" target="41OGUySgZU15ob5suG2t-16" edge="1">
          <mxGeometry relative="1" as="geometry">
            <mxPoint x="715" y="492" as="targetPoint" />
            <mxPoint x="720" y="210" as="sourcePoint" />
          </mxGeometry>
        </mxCell>
        <mxCell id="sox7Q45_UDwk4od5wGgl-22" value="restricts" style="edgeLabel;html=1;align=center;verticalAlign=middle;resizable=0;points=[];" parent="sox7Q45_UDwk4od5wGgl-21" vertex="1" connectable="0">
          <mxGeometry x="-0.17" y="-1" relative="1" as="geometry">
            <mxPoint y="-19" as="offset" />
          </mxGeometry>
        </mxCell>
        <mxCell id="sox7Q45_UDwk4od5wGgl-25" value="Data Right Holder" style="text;html=1;strokeColor=none;fillColor=none;align=left;verticalAlign=middle;whiteSpace=wrap;rounded=0;fontColor=#3333FF;fontStyle=1" parent="1" vertex="1">
          <mxGeometry x="13" y="222" width="120" height="30" as="geometry" />
        </mxCell>
        <mxCell id="sox7Q45_UDwk4od5wGgl-26" value="Data Producer" style="text;html=1;strokeColor=none;fillColor=none;align=left;verticalAlign=middle;whiteSpace=wrap;rounded=0;fontColor=#3333FF;fontStyle=1" parent="1" vertex="1">
          <mxGeometry x="295" y="129" width="93" height="25" as="geometry" />
        </mxCell>
        <mxCell id="sox7Q45_UDwk4od5wGgl-29" value="Data Usage Contract" style="whiteSpace=wrap;html=1;align=center;fillColor=none;fontColor=#0000FF;strokeColor=#001DBC;fontStyle=1" parent="1" vertex="1">
          <mxGeometry x="904" y="325" width="100" height="40" as="geometry" />
        </mxCell>
        <mxCell id="sox7Q45_UDwk4od5wGgl-30" style="edgeStyle=none;rounded=0;orthogonalLoop=1;jettySize=auto;html=1;endArrow=block;endFill=1;entryX=0.5;entryY=1;entryDx=0;entryDy=0;exitX=0.5;exitY=0;exitDx=0;exitDy=0;strokeColor=#0000FF;" parent="1" source="59zXBYbeoGSG76_93cE8-1" target="sox7Q45_UDwk4od5wGgl-29" edge="1">
          <mxGeometry relative="1" as="geometry">
            <mxPoint x="715" y="403" as="targetPoint" />
            <mxPoint x="764" y="240" as="sourcePoint" />
          </mxGeometry>
        </mxCell>
        <mxCell id="sox7Q45_UDwk4od5wGgl-32" style="edgeStyle=orthogonalEdgeStyle;rounded=0;orthogonalLoop=1;jettySize=auto;html=1;endArrow=none;endFill=0;entryX=1;entryY=0.5;entryDx=0;entryDy=0;strokeColor=#0000FF;exitX=1;exitY=0.5;exitDx=0;exitDy=0;" parent="1" source="41OGUySgZU15ob5suG2t-42" target="sox7Q45_UDwk4od5wGgl-29" edge="1">
          <mxGeometry relative="1" as="geometry">
            <mxPoint x="944" y="276" as="targetPoint" />
            <mxPoint x="883" y="504" as="sourcePoint" />
          </mxGeometry>
        </mxCell>
        <mxCell id="sox7Q45_UDwk4od5wGgl-35" style="edgeStyle=orthogonalEdgeStyle;rounded=0;orthogonalLoop=1;jettySize=auto;html=1;endArrow=none;endFill=0;strokeColor=#0000FF;exitX=0;exitY=0.5;exitDx=0;exitDy=0;entryX=1;entryY=0.5;entryDx=0;entryDy=0;" parent="1" source="sox7Q45_UDwk4od5wGgl-29" target="41OGUySgZU15ob5suG2t-43" edge="1">
          <mxGeometry relative="1" as="geometry">
            <mxPoint x="1020" y="117" as="targetPoint" />
            <mxPoint x="1007" y="480.5" as="sourcePoint" />
          </mxGeometry>
        </mxCell>
        <mxCell id="sox7Q45_UDwk4od5wGgl-36" value="Data Usage Agreement Trust Anchor" style="text;html=1;strokeColor=none;fillColor=none;align=left;verticalAlign=middle;whiteSpace=wrap;rounded=0;fontColor=#3333FF;fontStyle=3" parent="1" vertex="1">
          <mxGeometry x="429" y="126.5" width="228" height="30" as="geometry" />
        </mxCell>
        <mxCell id="59zXBYbeoGSG76_93cE8-1" value="Data Usage" style="text;html=1;strokeColor=none;fillColor=none;align=left;verticalAlign=middle;whiteSpace=wrap;rounded=0;fontColor=#3333FF;fontStyle=1" parent="1" vertex="1">
          <mxGeometry x="852" y="470" width="78" height="30" as="geometry" />
        </mxCell>
      </root>
    </mxGraphModel>
  </diagram>
</mxfile>
