<mxfile host="Electron" modified="2024-10-21T14:29:31.839Z" agent="Mozilla/5.0 (Macintosh; Intel Mac OS X 10_15_7) AppleWebKit/537.36 (KHTML, like Gecko) draw.io/22.0.2 Chrome/114.0.5735.289 Electron/25.8.4 Safari/537.36" etag="BR3KnGbPKHjeqI23yC9_" version="22.0.2" type="device">
  <diagram id="kgpKYQtTHZ0yAKxKKP6v" name="Page-1">
    <mxGraphModel dx="3070" dy="617" grid="1" gridSize="10" guides="1" tooltips="1" connect="1" arrows="1" fold="1" page="1" pageScale="1" pageWidth="827" pageHeight="1169" math="0" shadow="0">
      <root>
        <mxCell id="0" />
        <mxCell id="1" parent="0" />
        <mxCell id="3nuBFxr9cyL0pnOWT2aG-5" value="Data Consumer" style="shape=umlLifeline;perimeter=lifelinePerimeter;container=0;collapsible=0;recursiveResize=0;rounded=0;shadow=0;strokeWidth=1;" parent="1" vertex="1">
          <mxGeometry x="-1360" y="120" width="110" height="580" as="geometry" />
        </mxCell>
        <mxCell id="iz6BomqZgV8wwgHXzJbM-1" value="Data Rights&#xa;Holder" style="shape=umlLifeline;perimeter=lifelinePerimeter;container=1;collapsible=0;recursiveResize=0;rounded=0;shadow=0;strokeWidth=1;dashed=1;" parent="1" vertex="1">
          <mxGeometry x="-170" y="120" width="90" height="520" as="geometry" />
        </mxCell>
        <mxCell id="iz6BomqZgV8wwgHXzJbM-14" value="Data Product &#xa;Catalogue" style="shape=umlLifeline;perimeter=lifelinePerimeter;container=1;collapsible=0;recursiveResize=0;rounded=0;shadow=0;strokeWidth=1;" parent="1" vertex="1">
          <mxGeometry x="-765" y="120" width="100" height="520" as="geometry" />
        </mxCell>
        <mxCell id="U-6X4x7XQ1GgIeE6C5EA-62" value="" style="html=1;verticalAlign=bottom;endArrow=open;dashed=1;endSize=8;rounded=0;fontSize=11;strokeColor=#000000;exitX=0.51;exitY=0.286;exitDx=0;exitDy=0;exitPerimeter=0;entryX=1.2;entryY=0.117;entryDx=0;entryDy=0;entryPerimeter=0;" parent="iz6BomqZgV8wwgHXzJbM-14" target="U-6X4x7XQ1GgIeE6C5EA-59" edge="1">
          <mxGeometry relative="1" as="geometry">
            <mxPoint x="46.5" y="120.00000000000003" as="sourcePoint" />
            <mxPoint x="-545" y="120.00000000000003" as="targetPoint" />
          </mxGeometry>
        </mxCell>
        <mxCell id="Q1D0G7eRB52qDg4FpoUs-1" value="Data Product Self Description (DPD)" style="edgeLabel;html=1;align=center;verticalAlign=middle;resizable=0;points=[];" parent="U-6X4x7XQ1GgIeE6C5EA-62" vertex="1" connectable="0">
          <mxGeometry x="0.2584" y="1" relative="1" as="geometry">
            <mxPoint x="256" y="4" as="offset" />
          </mxGeometry>
        </mxCell>
        <mxCell id="iz6BomqZgV8wwgHXzJbM-66" value="DUA &lt;br&gt;Trust Anchor" style="shape=umlLifeline;perimeter=lifelinePerimeter;whiteSpace=wrap;html=1;container=1;collapsible=0;recursiveResize=0;outlineConnect=0;dashed=1;fontSize=12;" parent="1" vertex="1">
          <mxGeometry x="-479" y="120" width="100" height="520" as="geometry" />
        </mxCell>
        <mxCell id="RN6gnvtAF0V6DGEFLZ67-1" value="" style="group" parent="1" vertex="1" connectable="0">
          <mxGeometry x="-320" y="120" width="90" height="520" as="geometry" />
        </mxCell>
        <mxCell id="3nuBFxr9cyL0pnOWT2aG-1" value="Data Producer" style="shape=umlLifeline;perimeter=lifelinePerimeter;container=0;collapsible=0;recursiveResize=0;rounded=0;shadow=0;strokeWidth=1;dashed=1;" parent="RN6gnvtAF0V6DGEFLZ67-1" vertex="1">
          <mxGeometry width="90" height="520" as="geometry" />
        </mxCell>
        <mxCell id="iz6BomqZgV8wwgHXzJbM-5" value="Data Provider" style="shape=umlLifeline;perimeter=lifelinePerimeter;container=0;collapsible=0;recursiveResize=0;rounded=0;shadow=0;strokeWidth=1;" parent="1" vertex="1">
          <mxGeometry x="-1040" y="120" width="100" height="580" as="geometry" />
        </mxCell>
        <mxCell id="U-6X4x7XQ1GgIeE6C5EA-10" value="&amp;nbsp; &amp;nbsp;Case 2a : Controlled usage right - direct access" style="whiteSpace=wrap;html=1;shape=mxgraph.basic.cloud_rect;strokeColor=#CC0000;align=left;" parent="1" vertex="1">
          <mxGeometry x="-1320" y="40" width="370" height="50" as="geometry" />
        </mxCell>
        <mxCell id="U-6X4x7XQ1GgIeE6C5EA-14" value="Data Product&#xa;Usage Contract&#xa;store" style="shape=umlLifeline;perimeter=lifelinePerimeter;container=1;collapsible=0;recursiveResize=0;rounded=0;shadow=0;strokeWidth=1;" parent="1" vertex="1">
          <mxGeometry x="-604" y="120" width="100" height="520" as="geometry" />
        </mxCell>
        <mxCell id="U-6X4x7XQ1GgIeE6C5EA-59" value="" style="points=[];perimeter=orthogonalPerimeter;rounded=0;shadow=0;strokeWidth=1;glass=0;fillColor=none;" parent="1" vertex="1">
          <mxGeometry x="-1310" y="210" width="10" height="190" as="geometry" />
        </mxCell>
        <mxCell id="U-6X4x7XQ1GgIeE6C5EA-60" value="Configure the service, start negotiation" style="verticalAlign=bottom;endArrow=block;shadow=0;strokeWidth=1;startArrow=block;startFill=1;entryX=-0.067;entryY=0.127;entryDx=0;entryDy=0;entryPerimeter=0;exitX=1.183;exitY=0.624;exitDx=0;exitDy=0;exitPerimeter=0;" parent="1" source="U-6X4x7XQ1GgIeE6C5EA-59" target="U-6X4x7XQ1GgIeE6C5EA-65" edge="1">
          <mxGeometry relative="1" as="geometry">
            <mxPoint x="-1290" y="330" as="sourcePoint" />
            <mxPoint x="-1000.5" y="324.96000000000004" as="targetPoint" />
          </mxGeometry>
        </mxCell>
        <mxCell id="U-6X4x7XQ1GgIeE6C5EA-61" value="Query Catalogue for appropriate Data Products" style="verticalAlign=bottom;endArrow=block;shadow=0;strokeWidth=1;exitX=0.9;exitY=0.075;exitDx=0;exitDy=0;exitPerimeter=0;" parent="1" source="U-6X4x7XQ1GgIeE6C5EA-59" target="iz6BomqZgV8wwgHXzJbM-14" edge="1">
          <mxGeometry x="-0.4834" relative="1" as="geometry">
            <mxPoint x="-1038.9966666666664" y="470.00199999999995" as="sourcePoint" />
            <mxPoint x="-725.4999999999995" y="228" as="targetPoint" />
            <mxPoint as="offset" />
          </mxGeometry>
        </mxCell>
        <mxCell id="U-6X4x7XQ1GgIeE6C5EA-63" value="notarise DPUC (optional)" style="verticalAlign=bottom;endArrow=block;shadow=0;strokeWidth=1;entryX=0.483;entryY=0.496;entryDx=0;entryDy=0;entryPerimeter=0;exitX=1.017;exitY=0.882;exitDx=0;exitDy=0;exitPerimeter=0;" parent="1" source="U-6X4x7XQ1GgIeE6C5EA-59" target="U-6X4x7XQ1GgIeE6C5EA-14" edge="1">
          <mxGeometry x="0.1045" y="-2" relative="1" as="geometry">
            <mxPoint x="-1260" y="380" as="sourcePoint" />
            <mxPoint x="-555.36" y="379.5000000000001" as="targetPoint" />
            <mxPoint as="offset" />
          </mxGeometry>
        </mxCell>
        <mxCell id="U-6X4x7XQ1GgIeE6C5EA-64" value="close negotiation, sign Data Usage Contract (DUC) " style="verticalAlign=bottom;endArrow=block;shadow=0;strokeWidth=1;startArrow=block;startFill=1;exitX=0.919;exitY=0.834;exitDx=0;exitDy=0;exitPerimeter=0;entryX=0.267;entryY=0.377;entryDx=0;entryDy=0;entryPerimeter=0;" parent="1" target="U-6X4x7XQ1GgIeE6C5EA-65" edge="1">
          <mxGeometry relative="1" as="geometry">
            <mxPoint x="-1300" y="350.0000000000001" as="sourcePoint" />
            <mxPoint x="-989.69" y="350.0000000000001" as="targetPoint" />
          </mxGeometry>
        </mxCell>
        <mxCell id="U-6X4x7XQ1GgIeE6C5EA-65" value="" style="points=[];perimeter=orthogonalPerimeter;rounded=0;shadow=0;strokeWidth=1;glass=0;fillColor=none;" parent="1" vertex="1">
          <mxGeometry x="-995" y="320" width="10" height="80" as="geometry" />
        </mxCell>
        <mxCell id="U-6X4x7XQ1GgIeE6C5EA-66" value="Review DPD&amp;nbsp;" style="edgeStyle=orthogonalEdgeStyle;html=1;align=left;spacingLeft=2;endArrow=block;rounded=0;elbow=vertical;exitX=1;exitY=0.233;exitDx=0;exitDy=0;exitPerimeter=0;" parent="1" source="U-6X4x7XQ1GgIeE6C5EA-59" edge="1">
          <mxGeometry x="-0.4217" y="-10" relative="1" as="geometry">
            <mxPoint x="-1276.166666666667" y="280" as="sourcePoint" />
            <Array as="points">
              <mxPoint x="-1160" y="266" />
              <mxPoint x="-1160" y="290" />
            </Array>
            <mxPoint x="-1305" y="290" as="targetPoint" />
            <mxPoint as="offset" />
          </mxGeometry>
        </mxCell>
        <mxCell id="U-6X4x7XQ1GgIeE6C5EA-73" value="Request Data Usage Agreement" style="verticalAlign=bottom;endArrow=block;shadow=0;strokeWidth=1;exitX=1.183;exitY=0.171;exitDx=0;exitDy=0;exitPerimeter=0;" parent="1" source="jwNM-UIAMUdtAWqzEVvh-1" target="iz6BomqZgV8wwgHXzJbM-1" edge="1">
          <mxGeometry x="-0.8155" y="4" relative="1" as="geometry">
            <mxPoint x="-920" y="336" as="sourcePoint" />
            <mxPoint x="-135.5" y="341.0400000000002" as="targetPoint" />
            <mxPoint as="offset" />
            <Array as="points" />
          </mxGeometry>
        </mxCell>
        <mxCell id="U-6X4x7XQ1GgIeE6C5EA-78" value="" style="html=1;verticalAlign=bottom;endArrow=open;dashed=1;endSize=8;rounded=0;fontSize=11;strokeColor=#000000;entryX=1.2;entryY=0.423;entryDx=0;entryDy=0;entryPerimeter=0;exitX=0.5;exitY=0.681;exitDx=0;exitDy=0;exitPerimeter=0;" parent="1" source="iz6BomqZgV8wwgHXzJbM-1" target="jwNM-UIAMUdtAWqzEVvh-1" edge="1">
          <mxGeometry relative="1" as="geometry">
            <mxPoint x="-210" y="470" as="sourcePoint" />
            <mxPoint x="-1250" y="470" as="targetPoint" />
          </mxGeometry>
        </mxCell>
        <mxCell id="U-6X4x7XQ1GgIeE6C5EA-79" value="DUA Signed by Data Rights Holder" style="edgeLabel;html=1;align=center;verticalAlign=middle;resizable=0;points=[];" parent="U-6X4x7XQ1GgIeE6C5EA-78" vertex="1" connectable="0">
          <mxGeometry x="0.1852" relative="1" as="geometry">
            <mxPoint x="582" as="offset" />
          </mxGeometry>
        </mxCell>
        <mxCell id="U-6X4x7XQ1GgIeE6C5EA-72" value="notarise DPUC (optional)" style="verticalAlign=bottom;endArrow=block;shadow=0;strokeWidth=1;" parent="1" edge="1">
          <mxGeometry x="-0.2343" y="-18" relative="1" as="geometry">
            <mxPoint x="-990.3333333333335" y="390" as="sourcePoint" />
            <mxPoint x="-554.5" y="390" as="targetPoint" />
            <mxPoint as="offset" />
          </mxGeometry>
        </mxCell>
        <mxCell id="jwNM-UIAMUdtAWqzEVvh-1" value="" style="points=[];perimeter=orthogonalPerimeter;rounded=0;shadow=0;strokeWidth=1;glass=0;fillColor=none;" parent="1" vertex="1">
          <mxGeometry x="-1310" y="420" width="10" height="130" as="geometry" />
        </mxCell>
        <mxCell id="U-6X4x7XQ1GgIeE6C5EA-75" value="Notarise signed DUA " style="verticalAlign=bottom;endArrow=block;shadow=0;strokeWidth=1;startArrow=none;exitX=0.489;exitY=0.648;exitDx=0;exitDy=0;exitPerimeter=0;" parent="1" source="iz6BomqZgV8wwgHXzJbM-1" target="iz6BomqZgV8wwgHXzJbM-66" edge="1">
          <mxGeometry x="0.0808" y="3" relative="1" as="geometry">
            <mxPoint x="-154.51000000000022" y="460" as="sourcePoint" />
            <mxPoint x="-390" y="460" as="targetPoint" />
            <mxPoint as="offset" />
          </mxGeometry>
        </mxCell>
        <mxCell id="jwNM-UIAMUdtAWqzEVvh-2" value="Counter-sign the DUA and notarize it" style="verticalAlign=bottom;endArrow=block;shadow=0;strokeWidth=1;startArrow=none;exitX=0.9;exitY=0.925;exitDx=0;exitDy=0;exitPerimeter=0;align=left;" parent="1" source="jwNM-UIAMUdtAWqzEVvh-1" target="iz6BomqZgV8wwgHXzJbM-66" edge="1">
          <mxGeometry x="-0.9518" relative="1" as="geometry">
            <mxPoint x="-116" y="456" as="sourcePoint" />
            <mxPoint x="-419" y="456" as="targetPoint" />
            <mxPoint as="offset" />
          </mxGeometry>
        </mxCell>
        <mxCell id="jwNM-UIAMUdtAWqzEVvh-3" style="rounded=0;orthogonalLoop=1;jettySize=auto;html=1;exitX=1.1;exitY=0.204;exitDx=0;exitDy=0;exitPerimeter=0;" parent="1" source="jwNM-UIAMUdtAWqzEVvh-6" edge="1">
          <mxGeometry relative="1" as="geometry">
            <mxPoint x="-959.4000000000001" y="603" as="sourcePoint" />
            <mxPoint x="-429.5" y="598.972" as="targetPoint" />
          </mxGeometry>
        </mxCell>
        <mxCell id="jwNM-UIAMUdtAWqzEVvh-4" value="Check DUA status" style="edgeLabel;html=1;align=center;verticalAlign=middle;resizable=0;points=[];" parent="jwNM-UIAMUdtAWqzEVvh-3" vertex="1" connectable="0">
          <mxGeometry x="-0.1674" y="-1" relative="1" as="geometry">
            <mxPoint x="-2" y="-11" as="offset" />
          </mxGeometry>
        </mxCell>
        <mxCell id="jwNM-UIAMUdtAWqzEVvh-5" value="Request Data Access (providing DUA)" style="verticalAlign=bottom;endArrow=block;shadow=0;strokeWidth=1;startArrow=none;exitX=1.143;exitY=0.294;exitDx=0;exitDy=0;exitPerimeter=0;" parent="1" target="jwNM-UIAMUdtAWqzEVvh-6" edge="1">
          <mxGeometry relative="1" as="geometry">
            <mxPoint x="-1298.57" y="584.76" as="sourcePoint" />
            <mxPoint x="-964.9000000000001" y="584.76" as="targetPoint" />
          </mxGeometry>
        </mxCell>
        <mxCell id="jwNM-UIAMUdtAWqzEVvh-6" value="" style="points=[];perimeter=orthogonalPerimeter;rounded=0;shadow=0;strokeWidth=1;glass=0;fillColor=none;" parent="1" vertex="1">
          <mxGeometry x="-995" y="580" width="10" height="93" as="geometry" />
        </mxCell>
        <mxCell id="jwNM-UIAMUdtAWqzEVvh-7" value="" style="points=[];perimeter=orthogonalPerimeter;rounded=0;shadow=0;strokeWidth=1;glass=0;fillColor=none;" parent="1" vertex="1">
          <mxGeometry x="-1310" y="580" width="10" height="93" as="geometry" />
        </mxCell>
        <mxCell id="jwNM-UIAMUdtAWqzEVvh-8" value="" style="html=1;verticalAlign=bottom;endArrow=open;dashed=1;endSize=8;rounded=0;fontSize=11;strokeColor=#000000;entryX=1;entryY=0.86;entryDx=0;entryDy=0;entryPerimeter=0;" parent="1" target="jwNM-UIAMUdtAWqzEVvh-7" edge="1">
          <mxGeometry relative="1" as="geometry">
            <mxPoint x="-990.5" y="659.98" as="sourcePoint" />
            <mxPoint x="-1305" y="626" as="targetPoint" />
          </mxGeometry>
        </mxCell>
        <mxCell id="jwNM-UIAMUdtAWqzEVvh-9" value="&amp;nbsp;Deliver Data Access" style="edgeLabel;html=1;align=center;verticalAlign=middle;resizable=0;points=[];" parent="jwNM-UIAMUdtAWqzEVvh-8" vertex="1" connectable="0">
          <mxGeometry x="0.2019" y="1" relative="1" as="geometry">
            <mxPoint as="offset" />
          </mxGeometry>
        </mxCell>
        <mxCell id="jwNM-UIAMUdtAWqzEVvh-10" value="Check DUA &lt;br&gt;validity &amp;amp;applicability" style="edgeStyle=orthogonalEdgeStyle;html=1;align=right;spacingLeft=2;endArrow=block;rounded=0;elbow=vertical;entryX=1.14;entryY=0.742;entryDx=0;entryDy=0;entryPerimeter=0;" parent="1" target="jwNM-UIAMUdtAWqzEVvh-6" edge="1">
          <mxGeometry x="0.0203" y="-6" relative="1" as="geometry">
            <mxPoint x="-990.5" y="613" as="sourcePoint" />
            <Array as="points">
              <mxPoint x="-844" y="613" />
              <mxPoint x="-844" y="649" />
            </Array>
            <mxPoint x="-840" y="713" as="targetPoint" />
            <mxPoint as="offset" />
          </mxGeometry>
        </mxCell>
        <mxCell id="jwNM-UIAMUdtAWqzEVvh-11" value="Check DUA validity" style="edgeStyle=orthogonalEdgeStyle;html=1;align=right;spacingLeft=2;endArrow=block;rounded=0;elbow=vertical;entryX=1.1;entryY=0.738;entryDx=0;entryDy=0;entryPerimeter=0;exitX=1.3;exitY=0.554;exitDx=0;exitDy=0;exitPerimeter=0;" parent="1" source="jwNM-UIAMUdtAWqzEVvh-1" target="jwNM-UIAMUdtAWqzEVvh-1" edge="1">
          <mxGeometry x="-0.0094" relative="1" as="geometry">
            <mxPoint x="-980.5" y="623" as="sourcePoint" />
            <Array as="points">
              <mxPoint x="-1160" y="492" />
              <mxPoint x="-1160" y="516" />
            </Array>
            <mxPoint x="-974" y="659" as="targetPoint" />
            <mxPoint as="offset" />
          </mxGeometry>
        </mxCell>
        <mxCell id="jwNM-UIAMUdtAWqzEVvh-12" value="Request Data Usage Agreement" style="verticalAlign=bottom;endArrow=block;shadow=0;strokeWidth=1;entryX=0.2;entryY=0.288;entryDx=0;entryDy=0;entryPerimeter=0;exitX=0.95;exitY=0.275;exitDx=0;exitDy=0;exitPerimeter=0;" parent="1" source="jwNM-UIAMUdtAWqzEVvh-13" target="jwNM-UIAMUdtAWqzEVvh-15" edge="1">
          <mxGeometry x="-0.73" y="-1" relative="1" as="geometry">
            <mxPoint x="-1288" y="452" as="sourcePoint" />
            <mxPoint x="-115" y="452" as="targetPoint" />
            <mxPoint as="offset" />
          </mxGeometry>
        </mxCell>
        <mxCell id="jwNM-UIAMUdtAWqzEVvh-13" value="" style="points=[];perimeter=orthogonalPerimeter;rounded=0;shadow=0;strokeWidth=1;glass=0;fillColor=none;" parent="1" vertex="1">
          <mxGeometry x="-995" y="420" width="10" height="80" as="geometry" />
        </mxCell>
        <mxCell id="RN6gnvtAF0V6DGEFLZ67-1" value="" style="group" parent="1" vertex="1" connectable="0">
          <mxGeometry x="-320" y="120" width="90" height="520" as="geometry" />
        </mxCell>
        <mxCell id="3nuBFxr9cyL0pnOWT2aG-1" value="Data Producer" style="shape=umlLifeline;perimeter=lifelinePerimeter;container=0;collapsible=0;recursiveResize=0;rounded=0;shadow=0;strokeWidth=1;dashed=1;" parent="RN6gnvtAF0V6DGEFLZ67-1" vertex="1">
          <mxGeometry width="90" height="520" as="geometry" />
        </mxCell>
        <mxCell id="jwNM-UIAMUdtAWqzEVvh-15" value="" style="points=[];perimeter=orthogonalPerimeter;rounded=0;shadow=0;strokeWidth=1;glass=0;fillColor=none;" parent="RN6gnvtAF0V6DGEFLZ67-1" vertex="1">
          <mxGeometry x="40.00000000000004" y="300" width="10" height="80" as="geometry" />
        </mxCell>
        <mxCell id="jwNM-UIAMUdtAWqzEVvh-17" value="notarise DPUC (optional)" style="verticalAlign=bottom;endArrow=block;shadow=0;strokeWidth=1;exitX=0.95;exitY=0.905;exitDx=0;exitDy=0;exitPerimeter=0;entryX=0.475;entryY=0.504;entryDx=0;entryDy=0;entryPerimeter=0;" parent="1" source="U-6X4x7XQ1GgIeE6C5EA-59" target="U-6X4x7XQ1GgIeE6C5EA-14" edge="1">
          <mxGeometry x="-0.703" relative="1" as="geometry">
            <mxPoint x="-980.3333333333335" y="400" as="sourcePoint" />
            <mxPoint x="-544.5" y="400" as="targetPoint" />
            <mxPoint x="1" as="offset" />
          </mxGeometry>
        </mxCell>
        <mxCell id="jwNM-UIAMUdtAWqzEVvh-18" value="Request Data Usage Agreement" style="verticalAlign=bottom;endArrow=block;shadow=0;strokeWidth=1;entryX=0.528;entryY=0.621;entryDx=0;entryDy=0;entryPerimeter=0;exitX=1.05;exitY=0.263;exitDx=0;exitDy=0;exitPerimeter=0;" parent="1" source="jwNM-UIAMUdtAWqzEVvh-15" target="iz6BomqZgV8wwgHXzJbM-1" edge="1">
          <mxGeometry x="0.2255" y="-1" relative="1" as="geometry">
            <mxPoint x="-975" y="452" as="sourcePoint" />
            <mxPoint x="-268" y="453" as="targetPoint" />
            <mxPoint as="offset" />
            <Array as="points" />
          </mxGeometry>
        </mxCell>
        <mxCell id="jwNM-UIAMUdtAWqzEVvh-19" value="" style="html=1;verticalAlign=bottom;endArrow=open;dashed=1;endSize=8;rounded=0;fontSize=11;strokeColor=#000000;exitX=-0.3;exitY=0.75;exitDx=0;exitDy=0;exitPerimeter=0;entryX=1.1;entryY=0.75;entryDx=0;entryDy=0;entryPerimeter=0;" parent="1" source="jwNM-UIAMUdtAWqzEVvh-15" target="jwNM-UIAMUdtAWqzEVvh-13" edge="1">
          <mxGeometry relative="1" as="geometry">
            <mxPoint x="-115" y="484" as="sourcePoint" />
            <mxPoint x="-260" y="484" as="targetPoint" />
          </mxGeometry>
        </mxCell>
        <mxCell id="jwNM-UIAMUdtAWqzEVvh-20" value="DUA Signed by Data Rights Holder" style="edgeLabel;html=1;align=center;verticalAlign=middle;resizable=0;points=[];" parent="jwNM-UIAMUdtAWqzEVvh-19" vertex="1" connectable="0">
          <mxGeometry x="0.1852" relative="1" as="geometry">
            <mxPoint x="308" as="offset" />
          </mxGeometry>
        </mxCell>
        <mxCell id="jwNM-UIAMUdtAWqzEVvh-23" value="" style="html=1;verticalAlign=bottom;endArrow=open;dashed=1;endSize=8;rounded=0;fontSize=11;strokeColor=#000000;exitX=0.511;exitY=0.688;exitDx=0;exitDy=0;exitPerimeter=0;entryX=1.2;entryY=0.462;entryDx=0;entryDy=0;entryPerimeter=0;" parent="1" target="jwNM-UIAMUdtAWqzEVvh-1" edge="1">
          <mxGeometry relative="1" as="geometry">
            <mxPoint x="-995" y="480" as="sourcePoint" />
            <mxPoint x="-1141" y="480" as="targetPoint" />
          </mxGeometry>
        </mxCell>
        <mxCell id="jwNM-UIAMUdtAWqzEVvh-24" value="DUA Signed by Data Rights Holder" style="edgeLabel;html=1;align=center;verticalAlign=middle;resizable=0;points=[];" parent="jwNM-UIAMUdtAWqzEVvh-23" vertex="1" connectable="0">
          <mxGeometry x="0.1852" relative="1" as="geometry">
            <mxPoint x="85" as="offset" />
          </mxGeometry>
        </mxCell>
        <mxCell id="D2DZIZltzpRoX3Qwux3s-1" value="" style="points=[];perimeter=orthogonalPerimeter;rounded=0;shadow=0;strokeWidth=1;glass=0;fillColor=none;" vertex="1" parent="1">
          <mxGeometry x="-1310" y="690" width="10" height="93" as="geometry" />
        </mxCell>
        <mxCell id="D2DZIZltzpRoX3Qwux3s-2" value="Check DUA status" style="edgeStyle=orthogonalEdgeStyle;html=1;align=right;spacingLeft=2;endArrow=block;rounded=0;elbow=vertical;entryX=1.2;entryY=0.317;entryDx=0;entryDy=0;entryPerimeter=0;" edge="1" parent="1" target="D2DZIZltzpRoX3Qwux3s-1">
          <mxGeometry x="0.0203" y="25" relative="1" as="geometry">
            <mxPoint x="-1300" y="700" as="sourcePoint" />
            <Array as="points">
              <mxPoint x="-1185" y="700" />
              <mxPoint x="-1185" y="720" />
            </Array>
            <mxPoint x="-1298.6" y="736" as="targetPoint" />
            <mxPoint as="offset" />
          </mxGeometry>
        </mxCell>
        <mxCell id="D2DZIZltzpRoX3Qwux3s-3" value="Perform Data Usage" style="edgeStyle=elbowEdgeStyle;html=1;align=right;spacingLeft=2;endArrow=block;rounded=0;entryX=1.14;entryY=0.742;entryDx=0;entryDy=0;entryPerimeter=0;exitX=1;exitY=0.64;exitDx=0;exitDy=0;exitPerimeter=0;" edge="1" parent="1">
          <mxGeometry x="0.0114" y="50" relative="1" as="geometry">
            <mxPoint x="-1300" y="736.52" as="sourcePoint" />
            <Array as="points">
              <mxPoint x="-1230" y="757" />
            </Array>
            <mxPoint x="-1298.6" y="763" as="targetPoint" />
            <mxPoint as="offset" />
          </mxGeometry>
        </mxCell>
      </root>
    </mxGraphModel>
  </diagram>
</mxfile>
