<?xml version="1.0" encoding="UTF-8" standalone="no"?>
<!-- Created with Inkscape (http://www.inkscape.org/) -->
<svg
   xmlns:svg="http://www.w3.org/2000/svg"
   xmlns="http://www.w3.org/2000/svg"
   version="1.0"
   width="744.80316"
   height="389.76376"
   id="svg2657">
  <defs
     id="defs2659" />
  <path
     d="M 188.34683,372.04724 L 208.89263,372.04724 L 208.89263,255.9703 L 188.34683,255.9703 L 188.34683,372.04724 z "
     style="fill:#f7d100;fill-opacity:1;fill-rule:nonzero;stroke:none"
     id="path11797" />
  <path
     d="M 188.34683,255.9703 L 208.89263,255.9703 L 208.89263,139.48705 L 188.34683,139.48705 L 188.34683,255.9703 z "
     style="fill:#e3001b;fill-opacity:1;fill-rule:nonzero;stroke:none"
     id="path11799" />
  <path
     d="M 188.34683,139.89335 L 208.89263,139.89335 L 208.89263,23.81637 L 188.34683,23.81637 L 188.34683,139.89335 z "
     style="fill:#000000;fill-rule:nonzero;stroke:none"
     id="path11801" />
  <path
     d="M 70.91183,139.92815 L 70.91183,139.92815 z M 70.91783,139.97458 L 70.91783,139.97458 z M 70.90623,139.98621 L 70.90623,139.98621 z M 70.90623,139.90494 L 70.90623,139.90494 z M 124.18563,43.45661 C 124.18563,36.84599 119.37963,31.61096 117.68493,30.13675 L 116.46613,30.41536 C 118.26553,32.61499 121.44003,36.28883 121.44003,41.16408 C 121.44003,50.75205 111.30663,59.09217 99.73393,59.24885 C 99.82653,60.22972 99.82093,61.10028 99.82093,61.84897 C 99.82093,63.21869 99.72793,64.5652 99.56553,65.86524 C 112.69383,65.62729 124.18563,54.95402 124.18563,43.45661 z M 106.08903,122.87067 C 100.48243,122.87067 99.26973,122.28448 97.78943,122.28448 C 96.83763,122.28448 95.93793,122.37152 95.93793,123.71803 C 95.93793,124.65242 96.98883,126.01051 97.93463,126.7244 C 99.25203,125.41274 101.06303,125.13413 103.98213,125.13413 C 105.35213,125.13413 107.20923,125.40111 108.03353,125.5114 C 107.92323,126.31815 107.75483,127.35702 107.75483,128.82541 C 107.75483,129.60313 107.78373,130.49691 107.78373,131.44875 C 107.78373,134.75694 107.30223,136.51547 106.14713,137.83877 C 106.39653,137.98968 107.05843,138.12896 107.45293,138.12896 C 109.60033,138.12896 110.15153,137.03203 110.15153,131.46033 C 110.15153,129.77725 110.28503,128.22177 110.28503,127.82133 C 113.28603,130.10805 116.34423,134.18814 116.34423,137.14232 C 117.31933,136.64317 118.47433,135.1632 118.47433,134.04886 C 118.47433,132.04071 115.11383,129.04596 111.55043,125.43013 C 112.04393,125.31407 113.36703,124.93102 114.45833,124.93102 C 117.25553,124.93102 119.51923,125.40111 120.83663,126.95077 C 121.35903,126.38197 121.78843,124.68145 121.78843,123.71221 C 121.78843,122.0349 120.82503,122.09873 120.12863,122.09873 C 117.14533,122.09873 113.46563,122.55722 110.82513,122.99251 C 109.86733,121.71568 103.75603,113.45101 102.17163,109.04589 C 101.71893,108.88339 101.36493,108.74988 100.61043,108.74988 C 99.14173,108.74988 98.75893,109.77717 98.38163,111.18169 C 101.74783,115.2676 104.98653,119.71334 106.08903,122.87067 z M 72.62983,111.18169 C 72.25253,109.77717 71.88133,108.74988 70.40703,108.74988 C 69.65253,108.74988 69.29853,108.88339 68.85143,109.04589 C 67.25533,113.45101 61.14963,121.71568 60.18623,122.99251 C 57.56303,122.55722 53.86613,122.09873 50.88883,122.09873 C 50.18643,122.09873 49.22853,122.0349 49.22853,123.71221 C 49.22853,124.68145 49.65233,126.38197 50.18033,126.95077 C 51.49223,125.40111 53.76143,124.93102 56.55913,124.93102 C 57.65603,124.93102 58.96743,125.31407 59.46663,125.43013 C 55.90323,129.04596 52.54263,132.04071 52.54263,134.04886 C 52.54263,135.1632 53.69773,136.64317 54.67833,137.14232 C 54.67833,134.18814 57.73703,130.10805 60.72633,127.82133 C 60.72633,128.22177 60.87153,129.77725 60.87153,131.46033 C 60.87153,137.03203 61.41673,138.12896 63.56403,138.12896 C 63.95293,138.12896 64.62053,137.98968 64.87593,137.83877 C 63.72083,136.51547 63.23333,134.75694 63.23333,131.44875 C 63.23333,130.49691 63.26823,129.60313 63.26823,128.82541 C 63.26823,127.35702 63.09423,126.31815 62.98393,125.5114 C 63.80223,125.40111 65.67093,125.13413 67.03483,125.13413 C 69.95443,125.13413 71.76503,125.41274 73.08843,126.7244 C 74.03423,126.01051 75.07903,124.65242 75.07903,123.71803 C 75.07903,122.37152 74.17933,122.28448 73.22753,122.28448 C 71.74773,122.28448 70.54063,122.87067 64.92803,122.87067 C 66.03093,119.71334 69.26363,115.2676 72.62983,111.18169 z M 49.57703,41.16408 C 49.57703,36.28883 52.75153,32.61499 54.54533,30.41536 L 53.33763,30.13675 C 51.63733,31.61096 46.83183,36.84599 46.83183,43.45661 C 46.83183,55.03529 58.48593,65.78401 71.73613,65.87105 C 71.59663,64.61163 71.50963,63.27675 71.50963,61.84897 C 71.50963,60.95519 71.55053,60.07881 71.62593,59.25466 C 59.91923,59.25466 49.57703,50.8449 49.57703,41.16408 z M 85.18353,32.24934 C 85.78743,30.86227 86.59403,29.21394 86.59403,27.39735 C 86.59403,22.377 82.43243,19.98585 76.86073,19.98585 C 73.99983,19.98585 72.55443,20.90866 72.55443,21.83728 C 72.55443,22.76586 73.50063,24.80305 73.86023,25.43567 C 74.89343,24.97712 76.75053,24.43159 77.83023,24.43159 C 81.65503,24.43159 84.51043,28.72065 85.18353,32.24934 z M 87.91703,25.83029 C 91.17903,26.46291 93.39613,22.30155 90.30253,21.55868 C 90.73193,22.93417 88.64833,23.90345 88.64833,23.90345 C 88.64833,23.90345 87.85333,22.0636 88.88043,21.0131 C 86.98853,20.08452 86.50703,21.21625 86.47213,22.38282 C 87.21503,23.38108 87.70263,24.54184 87.91703,25.83029 z M 98.46253,54.34461 C 98.98503,54.37946 99.47853,54.40844 100.00103,54.40844 C 109.17093,54.40844 118.26553,48.47691 118.26553,40.87389 C 118.26553,36.82278 116.44333,33.99053 114.19133,30.85064 C 112.87393,31.07119 111.66673,31.19307 110.72053,31.19307 C 106.56493,31.19307 104.31293,28.97018 104.15053,26.78213 C 104.15053,24.80882 105.75223,23.32303 108.23633,23.32303 C 112.09003,23.32303 119.12473,26.93304 126.20503,26.93304 C 125.50863,27.46117 124.35403,28.01834 122.95513,28.53489 C 127.10473,32.27837 129.87913,37.28709 130.94113,42.64405 L 141.79423,60.0208 C 143.61683,62.92269 147.47613,68.6279 153.28033,73.07945 C 146.26333,73.07945 141.59693,73.24194 135.66523,63.85131 L 130.09963,54.94821 C 129.69353,56.09738 129.17663,57.22334 128.58493,58.32027 L 139.65293,76.0394 C 141.49833,78.97032 145.30553,84.6291 151.14413,89.10387 C 144.11593,89.10387 139.46683,89.27218 133.52393,79.87573 L 123.99953,64.62321 C 123.28593,65.37771 122.53693,66.12063 121.73633,66.83447 L 135.18373,88.34937 C 137.03523,91.29192 140.83073,96.92744 146.67553,101.40802 C 139.65293,101.40802 134.99813,101.57633 129.05483,92.17411 L 115.94973,71.2048 C 115.08493,71.75034 114.20293,72.27271 113.29723,72.77763 L 129.28693,98.37262 C 131.13283,101.31517 134.92273,106.95069 140.77263,111.43127 C 133.75603,111.43127 129.08973,111.59958 123.16403,102.19737 L 106.69283,75.84206 C 105.71773,76.21934 104.71943,76.57335 103.71513,76.89257 L 122.33413,106.68953 C 124.14463,109.57402 128.03323,115.30245 133.81423,119.74237 C 126.79113,119.74237 122.13083,119.90486 116.19953,110.50846 L 96.36173,78.75558 L 95.75843,78.86588 C 95.21833,80.5838 94.84703,82.18566 94.84703,83.78752 C 94.84703,93.75853 101.39373,102.56878 109.25233,109.37092 C 108.74713,109.58565 107.87073,109.67269 107.05843,109.67269 C 105.44473,109.67269 104.39433,109.57402 103.65133,109.45214 C 105.47963,113.59029 109.38583,118.92986 111.36483,121.69829 C 113.93593,121.23979 117.67933,120.87414 120.12863,120.87414 C 122.68813,120.87414 122.97233,122.37152 122.97233,123.71221 C 122.97233,126.03954 121.88703,127.90837 120.62773,128.94148 C 120.15183,127.74006 119.19403,126.14984 114.45833,126.14984 L 113.97643,126.17305 C 115.36923,127.71685 119.69923,131.22238 119.69923,134.04886 C 119.69923,135.91188 117.65053,138.71515 114.94583,138.71515 C 115.11383,138.11156 115.08493,137.5544 115.08493,137.14232 C 115.08493,134.85561 113.05953,132.18585 111.35313,130.31697 C 111.39363,130.87414 111.37643,130.81613 111.37643,131.46033 C 111.37643,136.86372 110.88893,139.34777 107.45293,139.34777 C 105.77543,139.34777 104.60923,138.42496 104.21423,138.15217 C 106.43743,136.09182 106.55933,134.47833 106.55933,131.44875 L 106.53603,128.82541 C 106.53003,128.13474 106.54163,127.22356 106.65193,126.55609 C 105.42143,126.38197 104.93393,126.38779 103.98213,126.38779 C 103.98213,126.38779 99.10683,126.00474 97.93463,128.54099 C 96.61153,127.33381 94.69593,125.62165 94.69593,123.71803 C 94.69593,122.47018 95.28253,121.05985 97.78943,121.05985 C 98.74123,121.05985 101.73613,121.64604 104.23753,121.64604 C 103.56993,120.14862 100.56943,115.77253 97.98673,112.59203 C 97.58663,113.82247 96.97113,115.16312 95.61323,116.24847 C 95.42713,114.1997 94.23163,107.7458 91.03383,103.97911 C 90.66263,106.52699 90.15743,109.14455 90.15743,114.6582 C 90.15743,128.08831 93.39013,138.00708 100.24473,139.89912 C 99.35673,141.46618 97.47033,142.8533 95.51463,142.8533 C 93.00723,142.8533 91.63773,140.01524 90.24443,137.33966 C 89.52473,139.31874 87.52253,144.14757 85.50873,144.14757 C 83.50053,144.14757 81.49823,139.31874 80.77253,137.33966 C 79.37973,140.01524 78.01583,142.8533 75.50283,142.8533 C 73.54673,142.8533 71.66083,141.46618 70.77273,139.89912 C 77.62133,138.00708 80.85403,128.08831 80.85403,114.6582 C 80.85403,109.14455 80.35483,106.52699 79.97753,103.97911 C 76.79143,107.7458 75.58983,114.1997 75.40423,116.24847 C 74.04583,115.16312 73.43083,113.82247 73.03633,112.59203 C 70.44753,115.77253 67.45263,120.14862 66.77943,121.64604 C 69.28693,121.64604 72.27573,121.05985 73.22753,121.05985 C 75.73493,121.05985 76.32673,122.47018 76.32673,123.71803 C 76.32673,125.62165 74.39983,127.33381 73.08843,128.54099 C 71.91013,126.00474 67.03483,126.38779 67.03483,126.38779 C 66.08913,126.38779 65.60163,126.38197 64.37113,126.55609 C 64.46983,127.22356 64.49303,128.13474 64.47533,128.82541 L 64.46373,131.44875 C 64.46373,134.47833 64.57403,136.09182 66.80883,138.15217 C 66.40823,138.42496 65.24153,139.34777 63.56403,139.34777 C 60.12853,139.34777 59.64103,136.86372 59.64103,131.46033 C 59.64103,130.81613 59.61783,130.87414 59.66993,130.31697 C 57.95193,132.18585 55.93813,134.85561 55.93813,137.14232 C 55.93813,137.5544 55.90883,138.11156 56.07163,138.71515 C 53.37253,138.71515 51.32383,135.91188 51.32383,134.04886 C 51.32383,131.22238 55.65943,127.71685 57.04063,126.17305 L 56.55913,126.14984 C 51.82903,126.14984 50.85953,127.74006 50.39523,128.94148 C 49.12993,127.90837 48.03903,126.03954 48.03903,123.71221 C 48.03903,122.37152 48.32933,120.87414 50.88883,120.87414 C 53.34373,120.87414 57.08153,121.23979 59.65823,121.69829 C 61.62553,118.92986 65.53183,113.59029 67.36003,109.45214 C 66.62873,109.57402 65.58393,109.67269 63.95903,109.67269 C 63.15233,109.67269 62.26983,109.58565 61.77073,109.37092 C 69.62373,102.56878 76.17043,93.75853 76.17043,83.78752 C 76.17043,82.18566 75.79873,80.5838 75.25903,78.86588 L 74.66133,78.75558 L 54.81793,110.50846 C 48.88623,119.90486 44.22583,119.74237 37.20323,119.74237 C 42.98373,115.30245 46.87233,109.57402 48.68333,106.68953 L 67.30193,76.89257 C 66.29803,76.57335 65.31133,76.21934 64.33023,75.84206 L 47.85903,102.19737 C 41.92173,111.59958 37.26143,111.43127 30.24993,111.43127 C 36.09473,106.95069 39.88463,101.31517 41.73003,98.37262 L 57.72533,72.77763 C 56.80843,72.27271 55.93203,71.75034 55.06723,71.2048 L 41.96223,92.17411 C 36.01933,101.57633 31.37013,101.40802 24.34203,101.40802 C 30.18623,96.92744 33.98783,91.29192 35.83323,88.34937 L 49.27513,66.83447 C 48.48563,66.12063 47.73153,65.37771 47.02303,64.62321 L 37.49353,79.87573 C 31.55023,89.27218 26.89543,89.10387 19.87893,89.10387 C 25.71153,84.6291 29.52473,78.97032 31.37013,76.0394 L 42.42643,58.32027 C 41.84033,57.22334 41.32953,56.09738 40.91783,54.94821 L 35.35173,63.85131 C 29.41443,73.24194 24.75413,73.07945 17.73713,73.07945 C 23.54653,68.6279 27.40063,62.92269 29.22283,60.0208 L 40.08193,42.64405 C 41.13833,37.28709 43.91233,32.27837 48.06233,28.53489 C 46.67513,28.01834 45.50843,27.46117 44.81203,26.93304 C 51.89833,26.93304 58.92143,23.32884 62.78063,23.32884 C 65.27043,23.32884 66.86643,24.80882 66.86643,26.78213 C 66.71013,28.97018 64.45213,31.19307 60.29093,31.19307 C 59.35073,31.19307 58.14913,31.07119 56.82013,30.85064 C 54.57413,33.99053 52.75153,36.82278 52.75153,40.87389 C 52.75153,48.47691 61.84653,54.40844 71.02203,54.40844 C 71.53893,54.40844 72.03203,54.37946 72.55443,54.34461 C 74.37103,48.18672 78.23633,44.14724 81.32983,40.19484 C 77.62133,38.84833 73.49463,35.3254 73.49463,33.73513 C 73.95883,33.46239 81.06283,35.69105 81.79973,35.8942 C 81.94483,35.929 82.10163,35.94063 82.27003,35.8942 C 83.13483,35.63299 83.86003,34.36775 83.86003,34.2401 C 83.09993,34.11241 78.64853,33.5378 75.60143,32.42928 C 73.28573,31.58193 72.11903,30.04971 72.11903,29.46933 C 72.85633,29.34745 75.67683,30.82743 79.80913,30.82743 C 81.33543,30.82743 81.63733,30.7636 83.15813,30.57785 C 82.09003,28.03578 80.08223,25.88835 77.83023,25.88835 C 76.91893,25.88835 74.93393,26.45714 73.27403,27.28705 C 72.12503,25.49368 71.10343,23.12574 71.10343,21.83728 C 71.10343,20.31665 72.61253,18.52909 76.86073,18.52909 C 78.05073,18.52909 79.15323,18.63353 80.19243,18.82505 C 81.01633,18.98177 81.71273,19.16748 82.46733,19.46348 C 82.40913,19.359 82.37473,19.13268 82.37473,18.92371 C 82.37473,18.33752 82.90273,17.71653 84.90493,17.71653 C 88.39903,17.71653 91.98003,18.8657 96.37943,18.8657 C 97.51683,18.8657 98.28863,18.82505 98.95013,18.54649 C 98.66583,19.42287 97.42983,20.71132 96.29803,21.76183 C 96.99443,22.71367 98.81103,25.01778 98.81103,28.73804 C 98.81103,34.716 94.87033,39.65508 94.87033,45.70267 C 94.87033,49.28947 97.63873,52.45838 98.46253,54.34461"
     style="fill:#000000;fill-rule:evenodd;stroke:none"
     id="path11805" />
  <path
     d="M 250.53513,70.26455 L 250.53513,23.33466 L 265.81073,23.33466 C 272.31143,23.33466 274.52253,25.5401 276.27533,28.14022 C 277.90023,30.67652 278.16173,33.47397 278.16173,34.37938 C 278.16173,40.23545 276.14743,44.13566 270.09983,45.49957 L 270.09983,45.82455 C 276.79773,46.60227 279.72293,50.63593 279.72293,57.07243 C 279.72293,69.09221 270.94743,70.26455 265.61353,70.26455 L 250.53513,70.26455 z M 256.51893,43.09097 L 265.22463,43.09097 C 269.90863,43.0271 272.18353,40.16582 272.18353,35.61559 C 272.18353,31.71539 269.97243,28.53489 264.96923,28.53489 L 256.51893,28.53489 L 256.51893,43.09097 z M 256.51893,65.06431 L 264.96923,65.06431 C 271.33633,65.06431 273.61113,60.51409 273.61113,57.07243 C 273.61113,49.59124 268.99733,48.29121 262.88563,48.29121 L 256.51893,48.29121 L 256.51893,65.06431"
     style="fill:#000000;fill-rule:nonzero;stroke:none"
     id="path11809" />
  <path
     d="M 303.96563,37.438 L 309.29913,37.438 L 309.29913,63.43924 C 309.29913,65.71438 309.42703,67.98946 309.61823,70.26455 L 303.96563,70.26455 L 303.96563,66.30052 L 303.77403,66.30052 C 302.01553,69.28955 298.89873,70.91461 295.45123,70.91461 C 289.73443,70.91461 286.61203,68.05329 286.61203,62.46419 L 286.61203,37.438 L 291.93993,37.438 L 291.93993,60.1891 C 291.93993,64.15313 293.76203,66.81708 297.52873,66.81708 C 300.39013,66.81708 303.96563,64.67545 303.96563,59.21405 L 303.96563,37.438"
     style="fill:#000000;fill-rule:nonzero;stroke:none"
     id="path11813" />
  <path
     d="M 336.01443,70.26455 L 336.01443,47.51349 C 336.01443,44.00215 334.77793,41.14087 330.22783,41.14087 C 324.37753,41.14087 323.53043,46.3411 323.53043,50.8275 L 323.53043,70.26455 L 318.20203,70.26455 L 318.20203,44.26335 C 318.20203,41.98822 318.07463,39.71313 317.87733,37.438 L 323.53043,37.438 L 323.53043,41.66319 L 323.79143,41.66319 C 325.87503,37.96037 328.34143,36.78798 332.56683,36.78798 C 339.58943,36.78798 341.34233,41.01317 341.34233,47.51349 L 341.34233,70.26455 L 336.01443,70.26455"
     style="fill:#000000;fill-rule:nonzero;stroke:none"
     id="path11817" />
  <path
     d="M 367.01833,23.33466 L 372.35223,23.33466 L 372.35223,70.26455 L 367.01833,70.26455 L 367.01833,66.36439 L 366.89083,66.36439 C 365.06823,69.4172 362.79343,70.91461 359.35143,70.91461 C 354.08723,70.91461 348.75383,68.831 348.75383,54.40267 C 348.75383,46.21341 349.01473,36.78798 359.60683,36.78798 C 362.72923,36.78798 365.00453,38.15189 366.82713,40.75201 L 367.01833,40.75201 L 367.01833,23.33466 z M 360.84333,41.14087 C 355.12653,41.14087 354.34873,45.6969 354.34873,54.4665 C 354.34873,59.40557 354.34873,66.56173 361.04053,66.56173 C 367.01833,66.56173 367.01833,59.15018 367.01833,52.51639 C 367.01833,48.16351 366.76293,41.14087 360.84333,41.14087"
     style="fill:#000000;fill-rule:nonzero;stroke:none"
     id="path11821" />
  <path
     d="M 385.86943,55.57501 C 385.86943,64.73932 388.34193,66.56173 392.50313,66.56173 C 396.14233,66.56173 398.02833,63.63076 398.21993,60.32257 L 404.07023,60.32257 C 404.00653,67.6006 399.52013,70.91461 392.63063,70.91461 C 385.67223,70.91461 380.15263,68.831 380.15263,54.3388 C 380.15263,44.72185 381.25513,36.78798 392.63063,36.78798 C 401.99223,36.78798 404.33123,41.9244 404.33123,52.77756 L 404.33123,55.57501 L 385.86943,55.57501 z M 398.67863,51.54134 C 398.67863,41.98822 396.01443,40.81583 392.10863,40.81583 C 388.73043,40.81583 385.93323,42.4409 385.86943,51.54134 L 398.67863,51.54134"
     style="fill:#000000;fill-rule:nonzero;stroke:none"
     id="path11825" />
  <path
     d="M 422.27103,70.91461 C 415.18473,70.91461 410.76763,67.79213 410.95933,60.25293 L 417.00693,60.25293 C 417.00693,62.1392 417.07063,66.56173 422.46833,66.56173 C 425.65483,66.56173 428.12133,64.93085 428.12133,61.55301 C 428.12133,55.70271 411.74273,55.57501 411.74273,45.76073 C 411.74273,42.31325 413.82073,36.78798 423.05443,36.78798 C 428.90473,36.78798 433.90793,39.58544 433.45523,46.07994 L 427.53523,46.07994 C 427.60493,42.63824 425.78233,40.81583 422.40453,40.81583 C 419.53753,40.81583 417.33203,42.37708 417.33203,45.23836 C 417.33203,51.02484 433.71623,50.89714 433.71623,60.90295 C 433.71623,68.11716 428.77123,70.91461 422.27103,70.91461"
     style="fill:#000000;fill-rule:nonzero;stroke:none"
     id="path11829" />
  <path
     d="M 456.85043,70.26455 L 456.85043,47.51349 C 456.85043,44.19948 455.94513,41.14087 451.65603,41.14087 C 450.02513,41.14087 447.81963,42.11592 447.04183,43.35213 C 446.06673,44.9772 445.80573,46.9273 445.80573,48.16351 L 445.80573,70.26455 L 440.47183,70.26455 L 440.47183,44.26335 C 440.47183,41.98822 440.33833,39.71313 440.14713,37.438 L 445.80573,37.438 L 445.80573,41.53554 L 445.93323,41.53554 C 447.49443,38.02419 450.28603,36.78798 454.12253,36.78798 C 457.11143,36.78798 460.55903,38.02419 461.79543,41.01317 C 463.61203,37.50187 466.60653,36.78798 469.58983,36.78798 C 473.03743,36.78798 478.56253,37.5657 478.56253,45.30223 L 478.56253,70.26455 L 473.23463,70.26455 L 473.23463,47.51349 C 473.23463,44.19948 472.32333,41.14087 468.03423,41.14087 C 466.01483,41.14087 465.43423,41.21051 464.00653,42.37708 C 462.44533,43.67716 462.18393,46.9273 462.18393,48.16351 L 462.18393,70.26455 L 456.85043,70.26455"
     style="fill:#000000;fill-rule:nonzero;stroke:none"
     id="path11833" />
  <path
     d="M 486.49083,29.03982 L 492.46863,29.03982 L 492.46863,23.35205 L 486.49083,23.35205 L 486.49083,29.03982 z M 492.12023,37.4554 L 486.83883,37.4554 L 486.83883,70.24715 L 492.12023,70.24715 L 492.12023,37.4554 z "
     style="fill:#000000;fill-rule:nonzero;stroke:none"
     id="path11835" />
  <path
     d="M 518.46983,70.26455 L 518.46983,47.51349 C 518.46983,44.00215 517.23943,41.14087 512.68933,41.14087 C 506.83903,41.14087 505.99143,46.3411 505.99143,50.8275 L 505.99143,70.26455 L 500.66353,70.26455 L 500.66353,44.26335 C 500.66353,41.98822 500.53003,39.71313 500.33883,37.438 L 505.99143,37.438 L 505.99143,41.66319 L 506.25283,41.66319 C 508.33043,37.96037 510.80293,36.78798 515.03393,36.78798 C 522.05093,36.78798 523.80373,41.01317 523.80373,47.51349 L 523.80373,70.26455 L 518.46983,70.26455"
     style="fill:#000000;fill-rule:nonzero;stroke:none"
     id="path11839" />
  <path
     d="M 531.99263,29.03982 L 537.97083,29.03982 L 537.97083,23.35205 L 531.99263,23.35205 L 531.99263,29.03982 z M 537.68053,37.4554 L 532.34103,37.4554 L 532.34103,70.24715 L 537.68053,70.24715 L 537.68053,37.4554 z "
     style="fill:#000000;fill-rule:nonzero;stroke:none"
     id="path11841" />
  <path
     d="M 555.85253,70.91461 C 548.76573,70.91461 544.34353,67.79213 544.54083,60.25293 L 550.58833,60.25293 C 550.58833,62.1392 550.64653,66.56173 556.04413,66.56173 C 559.23033,66.56173 561.70283,64.93085 561.70283,61.55301 C 561.70283,55.70271 545.31863,55.57501 545.31863,45.76073 C 545.31863,42.31325 547.40223,36.78798 556.63033,36.78798 C 562.48063,36.78798 567.48943,39.58544 567.03073,46.07994 L 561.11663,46.07994 C 561.18043,42.63824 559.35773,40.81583 555.97993,40.81583 C 553.11903,40.81583 550.90743,42.37708 550.90743,45.23836 C 550.90743,51.02484 567.28613,50.89714 567.28613,60.90295 C 567.28613,68.11716 562.35273,70.91461 555.85253,70.91461"
     style="fill:#000000;fill-rule:nonzero;stroke:none"
     id="path11845" />
  <path
     d="M 574.89483,37.438 L 574.89483,31.13501 L 580.22273,28.72641 L 580.22273,37.438 L 587.37323,37.438 L 587.37323,41.47167 L 580.22273,41.47167 L 580.22273,61.55301 C 580.22273,63.63076 580.22273,66.30052 585.10403,66.30052 C 585.48693,66.30052 586.34003,66.16706 587.50673,66.03936 L 587.50673,70.1369 C 585.74783,70.26455 583.99543,70.65341 582.24263,70.65341 C 577.17013,70.65341 574.89483,68.57566 574.89483,64.80315 L 574.89483,41.47167 L 569.49713,41.47167 L 569.49713,37.438 L 574.89483,37.438"
     style="fill:#000000;fill-rule:nonzero;stroke:none"
     id="path11849" />
  <path
     d="M 596.86233,55.57501 C 596.86233,64.73932 599.33483,66.56173 603.49603,66.56173 C 607.14083,66.56173 609.02163,63.63076 609.21883,60.32257 L 615.06913,60.32257 C 614.99943,67.6006 610.51913,70.91461 603.62393,70.91461 C 596.67113,70.91461 591.14553,68.831 591.14553,54.3388 C 591.14553,44.72185 592.24853,36.78798 603.62393,36.78798 C 612.98553,36.78798 615.33013,41.9244 615.33013,52.77756 L 615.33013,55.57501 L 596.86233,55.57501 z M 609.67153,51.54134 C 609.67153,41.98822 607.00783,40.81583 603.10753,40.81583 C 599.72373,40.81583 596.93213,42.4409 596.86233,51.54134 L 609.67153,51.54134"
     style="fill:#000000;fill-rule:nonzero;stroke:none"
     id="path11853" />
  <path
     d="M 628.65613,42.37708 L 628.78363,42.37708 C 630.99463,37.37417 633.72263,36.78798 638.92303,36.78798 L 638.92303,42.31325 C 638.47033,42.24938 637.94793,42.18556 637.48923,42.11592 C 637.03663,42.05204 636.58403,41.98822 636.06163,41.98822 C 630.15313,41.98822 628.65613,46.47462 628.65613,50.89714 L 628.65613,70.26455 L 623.32223,70.26455 L 623.32223,37.438 L 628.65613,37.438 L 628.65613,42.37708"
     style="fill:#000000;fill-rule:nonzero;stroke:none"
     id="path11857" />
  <path
     d="M 643.60103,23.35205 L 649.57883,23.35205 L 649.57883,29.03982 L 643.60103,29.03982 L 643.60103,23.35205 z M 649.23033,70.24715 L 643.94903,70.24715 L 643.94903,37.4554 L 649.23033,37.4554 L 649.23033,70.24715 z "
     style="fill:#000000;fill-rule:nonzero;stroke:none"
     id="path11859" />
  <path
     d="M 674.99943,37.438 L 680.32773,37.438 L 680.32773,63.43924 C 680.32773,65.71438 680.45523,67.98946 680.65853,70.26455 L 674.99943,70.26455 L 674.99943,66.30052 L 674.80213,66.30052 C 673.04933,69.28955 669.92693,70.91461 666.47983,70.91461 C 660.76303,70.91461 657.64623,68.05329 657.64623,62.46419 L 657.64623,37.438 L 662.97413,37.438 L 662.97413,60.1891 C 662.97413,64.15313 664.79073,66.81708 668.56293,66.81708 C 671.42443,66.81708 674.99943,64.67545 674.99943,59.21405 L 674.99943,37.438"
     style="fill:#000000;fill-rule:nonzero;stroke:none"
     id="path11863" />
  <path
     d="M 705.35953,70.26455 L 705.35953,47.51349 C 705.35953,44.19948 704.44263,41.14087 700.15353,41.14087 C 698.52853,41.14087 696.32303,42.11592 695.53973,43.35213 C 694.56463,44.9772 694.30323,46.9273 694.30323,48.16351 L 694.30323,70.26455 L 688.97533,70.26455 L 688.97533,44.26335 C 688.97533,41.98822 688.84783,39.71313 688.65013,37.438 L 694.30323,37.438 L 694.30323,41.53554 L 694.43673,41.53554 C 695.99233,38.02419 698.78953,36.78798 702.62603,36.78798 C 705.61493,36.78798 709.05643,38.02419 710.29293,41.01317 C 712.11503,37.50187 715.10443,36.78798 718.09893,36.78798 C 721.54083,36.78798 727.06603,37.5657 727.06603,45.30223 L 727.06603,70.26455 L 721.73813,70.26455 L 721.73813,47.51349 C 721.73813,44.19948 720.82683,41.14087 716.53213,41.14087 C 714.52383,41.14087 713.93773,41.21051 712.50403,42.37708 C 710.94283,43.67716 710.68743,46.9273 710.68743,48.16351 L 710.68743,70.26455 L 705.35953,70.26455"
     style="fill:#000000;fill-rule:nonzero;stroke:none"
     id="path11867" />
  <path
     d="M 250.34343,107.0842 L 250.34343,100.71734 C 250.34343,94.08356 255.02143,92.78352 259.76323,92.78352 C 260.87173,92.78352 261.52213,92.84735 262.29943,92.98081 L 262.29943,96.81137 C 256.64683,96.42252 255.67183,98.83111 255.67183,101.49506 L 255.67183,107.0842 L 262.29943,107.0842 L 262.29943,111.11787 L 255.67183,111.11787 L 255.67183,139.91075 L 250.34343,139.91075 L 250.34343,111.11787 L 245.27093,111.11787 L 245.27093,107.0842 L 250.34343,107.0842"
     style="fill:#000000;fill-rule:nonzero;stroke:none"
     id="path11871" />
  <path
     d="M 284.27303,107.0842 L 289.60093,107.0842 L 289.60093,133.08544 C 289.60093,135.36053 289.73443,137.63562 289.92603,139.91075 L 284.27303,139.91075 L 284.27303,135.94672 L 284.07573,135.94672 C 282.32293,138.9357 279.20053,140.56077 275.75853,140.56077 C 270.03613,140.56077 266.91933,137.69949 266.91933,132.11039 L 266.91933,107.0842 L 272.24723,107.0842 L 272.24723,129.83526 C 272.24723,133.79929 274.06383,136.46328 277.83653,136.46328 C 280.69793,136.46328 284.27303,134.32166 284.27303,128.86021 L 284.27303,107.0842 z M 275.62543,101.55893 L 269.51373,101.55893 L 269.51373,94.79745 L 275.62543,94.79745 L 275.62543,101.55893 z M 287.06463,101.55893 L 280.95333,101.55893 L 280.95333,94.79745 L 287.06463,94.79745 L 287.06463,101.55893 z "
     style="fill:#000000;fill-rule:nonzero;stroke:none"
     id="path11875" />
  <path
     d="M 303.83773,112.02328 L 303.96563,112.02328 C 306.17673,107.02033 308.90463,106.43414 314.10463,106.43414 L 314.10463,111.95941 C 313.65193,111.89558 313.12953,111.83171 312.67693,111.76207 C 312.22433,111.69825 311.77163,111.63438 311.24923,111.63438 C 305.33523,111.63438 303.83773,116.12077 303.83773,120.5433 L 303.83773,139.91075 L 298.50383,139.91075 L 298.50383,107.0842 L 303.83773,107.0842 L 303.83773,112.02328"
     style="fill:#000000;fill-rule:nonzero;stroke:none"
     id="path11879" />
  <path
     d="M 328.66663,92.98081 L 335.03933,92.98081 L 343.87853,133.67159 L 344.00603,133.67159 L 353.43183,92.98081 L 361.16803,92.98081 L 369.68253,133.67159 L 369.81603,133.67159 L 379.36883,92.98081 L 385.60803,92.98081 L 373.19383,139.91075 L 365.91583,139.91075 L 357.01243,99.21997 L 356.87893,99.21997 L 347.38983,139.91075 L 340.10583,139.91075 L 328.66663,92.98081"
     style="fill:#000000;fill-rule:nonzero;stroke:none"
     id="path11883" />
  <path
     d="M 389.33423,98.68602 L 395.31203,98.68602 L 395.31203,92.99826 L 389.33423,92.99826 L 389.33423,98.68602 z M 394.96403,107.1016 L 389.62453,107.1016 L 389.62453,139.89335 L 394.96403,139.89335 L 394.96403,107.1016 z "
     style="fill:#000000;fill-rule:nonzero;stroke:none"
     id="path11885" />
  <path
     d="M 409.00923,112.02328 L 409.13713,112.02328 C 411.34823,107.02033 414.08173,106.43414 419.27613,106.43414 L 419.27613,111.95941 C 418.82343,111.89558 418.30713,111.83171 417.84843,111.76207 C 417.39583,111.69825 416.94313,111.63438 416.42073,111.63438 C 410.50673,111.63438 409.00923,116.12077 409.00923,120.5433 L 409.00923,139.91075 L 403.68133,139.91075 L 403.68133,107.0842 L 409.00923,107.0842 L 409.00923,112.02328"
     style="fill:#000000;fill-rule:nonzero;stroke:none"
     id="path11889" />
  <path
     d="M 426.94903,107.0842 L 426.94903,100.78122 L 432.28253,98.37262 L 432.28253,107.0842 L 439.42743,107.0842 L 439.42743,111.11787 L 432.28253,111.11787 L 432.28253,131.19917 C 432.28253,133.27697 432.28253,135.94672 437.15223,135.94672 C 437.54663,135.94672 438.38823,135.81321 439.56093,135.68556 L 439.56093,139.78306 C 437.80813,139.91075 436.04923,140.29961 434.29073,140.29961 C 429.22433,140.29961 426.94903,138.22181 426.94903,134.44931 L 426.94903,111.11787 L 421.55143,111.11787 L 421.55143,107.0842 L 426.94903,107.0842"
     style="fill:#000000;fill-rule:nonzero;stroke:none"
     id="path11893" />
  <path
     d="M 454.37793,140.56077 C 447.29723,140.56077 442.87453,137.43833 443.07223,129.89913 L 449.11373,129.89913 C 449.11373,131.78536 449.18353,136.20789 454.58123,136.20789 C 457.76173,136.20789 460.22823,134.577 460.22823,131.19917 C 460.22823,125.34891 443.84963,125.22121 443.84963,115.40688 C 443.84963,111.95941 445.92763,106.43414 455.16133,106.43414 C 461.01163,106.43414 466.01483,109.23159 465.56213,115.7261 L 459.64213,115.7261 C 459.71183,112.28444 457.89523,110.46204 454.51143,110.46204 C 451.65603,110.46204 449.44453,112.02328 449.44453,114.88456 C 449.44453,120.67099 465.82313,120.5433 465.82313,130.54915 C 465.82313,137.76331 460.87813,140.56077 454.37793,140.56077"
     style="fill:#000000;fill-rule:nonzero;stroke:none"
     id="path11897" />
  <path
     d="M 488.37673,117.61238 C 488.50473,112.22057 485.84053,110.78702 483.82673,110.78702 C 479.73483,110.78702 476.93763,112.73712 476.93763,121.70987 C 476.93763,132.37155 478.30153,136.20789 483.82673,136.20789 C 485.06273,136.20789 488.76563,134.90785 488.57403,128.98791 L 494.16333,128.98791 C 494.35503,138.22181 487.47153,140.56077 483.82673,140.56077 C 476.86783,140.56077 471.34273,138.4772 471.34273,123.985 C 471.34273,114.36801 472.45123,106.43414 483.82673,106.43414 C 490.39103,106.43414 494.22703,110.27051 493.90233,117.61238 L 488.37673,117.61238"
     style="fill:#000000;fill-rule:nonzero;stroke:none"
     id="path11901" />
  <path
     d="M 518.86433,139.91075 L 518.86433,117.6762 C 518.86433,113.64835 517.56453,110.78702 513.01403,110.78702 C 507.68053,110.78702 506.32263,115.0819 506.32263,120.60717 L 506.32263,139.91075 L 500.98873,139.91075 L 500.98873,92.98081 L 506.32263,92.98081 L 506.32263,111.30939 L 506.57753,111.30939 C 508.72533,107.47306 511.19183,106.43414 515.48653,106.43414 C 521.07583,106.43414 524.19823,109.23159 524.19823,116.63733 L 524.19823,139.91075 L 518.86433,139.91075"
     style="fill:#000000;fill-rule:nonzero;stroke:none"
     id="path11905" />
  <path
     d="M 548.43493,135.16901 L 548.30753,135.16901 C 546.68813,138.9357 544.14583,140.56077 540.05443,140.56077 C 533.10113,140.56077 531.08173,136.07442 531.08173,129.77143 C 531.08173,119.82364 540.83783,119.37091 548.30753,119.56825 C 548.43493,115.20955 548.50473,110.46204 542.78793,110.46204 C 539.21293,110.46204 537.32093,112.87063 537.65173,116.31811 L 531.86513,116.31811 C 532.12613,108.97043 536.02633,106.43414 542.97963,106.43414 C 551.42993,106.43414 553.64093,110.78702 553.64093,116.31811 L 553.64093,132.11039 C 553.64093,134.71051 553.90243,137.37446 554.29133,139.91075 L 548.43493,139.91075 L 548.43493,135.16901 z M 536.41523,130.16029 C 536.41523,133.34661 537.97643,136.20789 541.55193,136.20789 C 544.79623,136.20789 548.82993,134.19396 548.30753,123.59615 C 543.24063,123.65997 536.41523,123.20729 536.41523,130.16029"
     style="fill:#000000;fill-rule:nonzero;stroke:none"
     id="path11909" />
  <path
     d="M 563.65293,107.0842 L 563.65293,100.71734 C 563.65293,94.08356 568.33093,92.78352 573.07823,92.78352 C 574.18123,92.78352 574.83113,92.84735 575.60893,92.98081 L 575.60893,96.81137 C 569.95583,96.42252 568.98083,98.83111 568.98083,101.49506 L 568.98083,107.0842 L 575.60893,107.0842 L 575.60893,111.11787 L 568.98083,111.11787 L 568.98083,139.91075 L 563.65293,139.91075 L 563.65293,111.11787 L 558.58043,111.11787 L 558.58043,107.0842 L 563.65293,107.0842"
     style="fill:#000000;fill-rule:nonzero;stroke:none"
     id="path11913" />
  <path
     d="M 580.61163,107.0842 L 580.61163,100.78122 L 585.94553,98.37262 L 585.94553,107.0842 L 593.09563,107.0842 L 593.09563,111.11787 L 585.94553,111.11787 L 585.94553,131.19917 C 585.94553,133.27697 585.94553,135.94672 590.82083,135.94672 C 591.21533,135.94672 592.05683,135.81321 593.22353,135.68556 L 593.22353,139.78306 C 591.47073,139.91075 589.71783,140.29961 587.95943,140.29961 C 582.89253,140.29961 580.61163,138.22181 580.61163,134.44931 L 580.61163,111.11787 L 575.22563,111.11787 L 575.22563,107.0842 L 580.61163,107.0842"
     style="fill:#000000;fill-rule:nonzero;stroke:none"
     id="path11917" />
  <path
     d="M 266.91933,176.73036 L 272.24723,176.73036 L 272.24723,202.7316 C 272.24723,205.00669 272.37513,207.28182 272.57243,209.55691 L 266.91933,209.55691 L 266.91933,205.58711 L 266.72213,205.58711 C 264.96923,208.58186 261.84683,210.20697 258.39923,210.20697 C 252.67693,210.20697 249.56003,207.34565 249.56003,201.75655 L 249.56003,176.73036 L 254.88793,176.73036 L 254.88793,199.48146 C 254.88793,203.44549 256.71063,206.10943 260.48283,206.10943 C 263.33873,206.10943 266.91933,203.96781 266.91933,198.50641 L 266.91933,176.73036"
     style="fill:#000000;fill-rule:nonzero;stroke:none"
     id="path11921" />
  <path
     d="M 298.50383,209.55691 L 298.50383,186.80585 C 298.50383,183.29451 297.27383,180.43322 292.72323,180.43322 C 286.87293,180.43322 286.02583,185.63346 286.02583,190.11981 L 286.02583,209.55691 L 280.69793,209.55691 L 280.69793,183.55567 C 280.69793,181.28058 280.57003,179.00545 280.37283,176.73036 L 286.02583,176.73036 L 286.02583,180.95555 L 286.28683,180.95555 C 288.36483,177.25273 290.83693,176.08034 295.06233,176.08034 C 302.08493,176.08034 303.83773,180.30553 303.83773,186.80585 L 303.83773,209.55691 L 298.50383,209.55691"
     style="fill:#000000;fill-rule:nonzero;stroke:none"
     id="path11925" />
  <path
     d="M 329.64173,162.62701 L 334.97563,162.62701 L 334.97563,209.55691 L 329.64173,209.55691 L 329.64173,205.65675 L 329.51373,205.65675 C 327.69163,208.70955 325.41633,210.20697 321.97483,210.20697 C 316.71063,210.20697 311.37713,208.12918 311.37713,193.69498 C 311.37713,185.50577 311.63813,176.08034 322.23573,176.08034 C 325.35263,176.08034 327.62783,177.44425 329.45003,180.04437 L 329.64173,180.04437 L 329.64173,162.62701 z M 323.46623,180.43322 C 317.74943,180.43322 316.97213,184.98921 316.97213,193.75885 C 316.97213,198.69793 316.97213,205.84827 323.66393,205.84827 C 329.64173,205.84827 329.64173,198.44254 329.64173,191.80875 C 329.64173,187.45587 329.38633,180.43322 323.46623,180.43322"
     style="fill:#000000;fill-rule:nonzero;stroke:none"
     id="path11929" />
  <path
     d="M 383.07783,162.62701 L 383.07783,167.82725 L 370.72733,167.82725 L 370.72733,209.55691 L 364.74353,209.55691 L 364.74353,167.82725 L 352.39253,167.82725 L 352.39253,162.62701 L 383.07783,162.62701"
     style="fill:#000000;fill-rule:nonzero;stroke:none"
     id="path11933" />
  <path
     d="M 386.32763,194.86737 C 386.32763,204.03164 388.79463,205.84827 392.95583,205.84827 C 396.59503,205.84827 398.48093,202.92312 398.67863,199.61493 L 404.52893,199.61493 C 404.45913,206.89296 399.97843,210.20697 393.08373,210.20697 C 386.13043,210.20697 380.60533,208.12918 380.60533,193.63116 C 380.60533,184.01421 381.70783,176.08034 393.08373,176.08034 C 402.44533,176.08034 404.78383,181.21675 404.78383,192.06991 L 404.78383,194.86737 L 386.32763,194.86737 z M 399.13123,190.8337 C 399.13123,181.28058 396.46713,180.10819 392.56693,180.10819 C 389.18353,180.10819 386.39183,181.73326 386.32763,190.8337 L 399.13123,190.8337"
     style="fill:#000000;fill-rule:nonzero;stroke:none"
     id="path11937" />
  <path
     d="M 428.77123,187.25853 C 428.90473,181.86677 426.24103,180.43322 424.22113,180.43322 C 420.12923,180.43322 417.33203,182.38333 417.33203,191.35607 C 417.33203,202.01771 418.70163,205.84827 424.22113,205.84827 C 425.45713,205.84827 429.16613,204.55401 428.96293,198.63406 L 434.55783,198.63406 C 434.75503,207.86801 427.86033,210.20697 424.22113,210.20697 C 417.26833,210.20697 411.74273,208.12918 411.74273,193.63116 C 411.74273,184.01421 412.84573,176.08034 424.22113,176.08034 C 430.78553,176.08034 434.62153,179.91667 434.29683,187.25853 L 428.77123,187.25853"
     style="fill:#000000;fill-rule:nonzero;stroke:none"
     id="path11941" />
  <path
     d="M 459.90303,209.55691 L 459.90303,187.3224 C 459.90303,183.29451 458.60893,180.43322 454.05883,180.43322 C 448.73093,180.43322 447.36093,184.72805 447.36093,190.25332 L 447.36093,209.55691 L 442.03303,209.55691 L 442.03303,162.62701 L 447.36093,162.62701 L 447.36093,180.95555 L 447.62233,180.95555 C 449.76413,177.11922 452.23613,176.08034 456.52523,176.08034 C 462.11463,176.08034 465.23703,178.8778 465.23703,186.28348 L 465.23703,209.55691 L 459.90303,209.55691"
     style="fill:#000000;fill-rule:nonzero;stroke:none"
     id="path11945" />
  <path
     d="M 491.69683,209.55691 L 491.69683,186.80585 C 491.69683,183.29451 490.46043,180.43322 485.91033,180.43322 C 480.06003,180.43322 479.21843,185.63346 479.21843,190.11981 L 479.21843,209.55691 L 473.88453,209.55691 L 473.88453,183.55567 C 473.88453,181.28058 473.75103,179.00545 473.55983,176.73036 L 479.21843,176.73036 L 479.21843,180.95555 L 479.47943,180.95555 C 481.55743,177.25273 484.02393,176.08034 488.24933,176.08034 C 495.27193,176.08034 497.02473,180.30553 497.02473,186.80585 L 497.02473,209.55691 L 491.69683,209.55691"
     style="fill:#000000;fill-rule:nonzero;stroke:none"
     id="path11949" />
  <path
     d="M 504.76093,193.63116 C 504.76093,184.01421 505.86393,176.08034 517.23943,176.08034 C 528.61483,176.08034 529.72343,184.01421 529.72343,193.63116 C 529.72343,208.12918 524.19823,210.20697 517.23943,210.20697 C 510.28653,210.20697 504.76093,208.12918 504.76093,193.63116 z M 524.13453,191.35607 C 524.13453,182.38333 521.33683,180.43322 517.23943,180.43322 C 513.14193,180.43322 510.35033,182.38333 510.35033,191.35607 C 510.35033,202.01771 511.71423,205.84827 517.23943,205.84827 C 522.77053,205.84827 524.13453,202.01771 524.13453,191.35607"
     style="fill:#000000;fill-rule:nonzero;stroke:none"
     id="path11953" />
  <path
     d="M 537.33263,209.53951 L 542.67213,209.53951 L 542.67213,162.64441 L 537.33263,162.64441 L 537.33263,209.53951 z "
     style="fill:#000000;fill-rule:nonzero;stroke:none"
     id="path11955" />
  <path
     d="M 550.12963,193.63116 C 550.12963,184.01421 551.23823,176.08034 562.61413,176.08034 C 573.98953,176.08034 575.09213,184.01421 575.09213,193.63116 C 575.09213,208.12918 569.56693,210.20697 562.61413,210.20697 C 555.66083,210.20697 550.12963,208.12918 550.12963,193.63116 z M 569.50323,191.35607 C 569.50323,182.38333 566.71163,180.43322 562.61413,180.43322 C 558.51623,180.43322 555.71903,182.38333 555.71903,191.35607 C 555.71903,202.01771 557.08853,205.84827 562.61413,205.84827 C 568.13923,205.84827 569.50323,202.01771 569.50323,191.35607"
     style="fill:#000000;fill-rule:nonzero;stroke:none"
     id="path11959" />
  <path
     d="M 600.05453,176.73036 L 605.38843,176.73036 L 605.38843,212.87092 C 605.38843,220.21859 600.50713,221.97717 593.29283,221.97717 C 587.83753,221.97717 582.89253,219.24354 583.35113,213.19595 L 589.32893,213.19595 C 589.39263,216.24875 591.41253,217.93769 594.33773,217.93769 C 598.04063,217.93769 600.05453,215.66837 600.05453,212.29054 L 600.05453,205.45942 L 599.86283,205.45942 C 598.49333,208.05954 595.50443,209.55691 592.64903,209.55691 C 583.73403,209.55691 581.98723,201.88425 581.98723,192.13379 C 581.98723,177.05539 589.59043,176.08034 592.25413,176.08034 C 595.70163,176.08034 598.42953,177.57771 599.92703,180.76403 L 600.05453,180.76403 L 600.05453,176.73036 z M 593.81533,180.50286 C 587.76773,180.50286 587.57613,187.7809 587.57613,192.13379 C 587.57613,202.66778 589.97933,205.13438 593.94323,205.13438 C 600.37963,205.13438 600.18243,197.53136 600.18243,192.98114 C 600.18243,188.10589 600.50713,180.50286 593.81533,180.50286"
     style="fill:#000000;fill-rule:nonzero;stroke:none"
     id="path11963" />
  <path
     d="M 613.82713,162.64441 L 619.80483,162.64441 L 619.80483,168.33218 L 613.82713,168.33218 L 613.82713,162.64441 z M 619.51503,209.53951 L 614.17553,209.53951 L 614.17553,176.74776 L 619.51503,176.74776 L 619.51503,209.53951 z "
     style="fill:#000000;fill-rule:nonzero;stroke:none"
     id="path11965" />
  <path
     d="M 632.88103,194.86737 C 632.88103,204.03164 635.34803,205.84827 639.50913,205.84827 C 643.15393,205.84827 645.03433,202.92312 645.23153,199.61493 L 651.08183,199.61493 C 651.01253,206.89296 646.53173,210.20697 639.63663,210.20697 C 632.68383,210.20697 627.15863,208.12918 627.15863,193.63116 C 627.15863,184.01421 628.26123,176.08034 639.63663,176.08034 C 649.00423,176.08034 651.34323,181.21675 651.34323,192.06991 L 651.34323,194.86737 L 632.88103,194.86737 z M 645.68463,190.8337 C 645.68463,181.28058 643.02043,180.10819 639.12023,180.10819 C 635.73643,180.10819 632.94483,181.73326 632.88103,190.8337 L 645.68463,190.8337"
     style="fill:#000000;fill-rule:nonzero;stroke:none"
     id="path11969" />
</svg>
