{
  "@context": [
	"https://www.w3.org/2018/credentials/v1",
	"https://registry.lab.gaia-x.eu/development/api/trusted-shape-registry/v1/shapes/jsonld/trustframework#"		
  ],
  "type": "VerifiablePresentation",
  "verifiableCredential": [
    {
      "@context": [
        "https://www.w3.org/2018/credentials/v1",
        "https://registry.lab.gaia-x.eu/development/api/trusted-shape-registry/v1/shapes/jsonld/trustframework#"		
      ],
      "type": "VerifiableCredential",
      "id": "https://arlabdevelopments.com/.well-known/soDatacenterEs_2210.json",
      "issuer": "did:web:arlabdevelopments.com",
      "issuanceDate": "2023-04-17T00:00:00.000Z",
      "credentialSubject": {
        "id": "https://arlabdevelopments.com/.well-known/soDatacenterEs_2210.json",
        "type": ["gx:ServiceOffering", "gx:PhysicalResource"],
        "gx:providedBy": {
          "id": "did:web:arlabdevelopments.com"
        },
		"gx:termsAndConditions": [
			{
			  "gx:URL": "https://www.arsys.net/legal",
			  "gx:hash": "70cf73cbb47217865004ae15949348f65272dda4da862e54c6b83615e8256809"
			}
		],
		"gx:policy": "default:allow",		
		"gx:dataAccountExport": [
			{
				"gx:requestType": "email",
				"gx:accessType": "digital",
				"gx:formatType": "text/html"
			},
			{
				"gx:requestType": "supportCenter",
				"gx:accessType": "physical",
				"gx:formatType": "text/html"
			}
		],
		"gx:name": "Datacenter Logroño (Spain)",
		"gx:description": "Arsys Internet datacenter located at La Portalada, Logroño (Spain)",
        "gx:maintainedBy": {
          "id": "did:web:arlabdevelopments.com"
        },		
		"gx:locationAddress": {
			"gx:countrySubdivisionCode": "ES-RI"
		},
		"gx:location": [
			{
			  "gx:gps": "42.45754783585222, -2.3976922306120074"
			}
		],
		"gx:environmentalImpactReport": "https://www.arsys.net/about/sustainability"
      }
    }
  ]
}