{
  "@context": [
    "https://www.w3.org/2018/credentials/v1",
    "https://registry.lab.gaia-x.eu/development/api/trusted-shape-registry/v1/shapes/jsonld/termsandconditions#",
    "https://registry.lab.gaia-x.eu/development/api/trusted-shape-registry/v1/shapes/jsonld/participant#"
  ],
  "type": "VerifiablePresentation",
  "verifiableCredential": [
    {
      "@context": [
        "https://www.w3.org/2018/credentials/v1",
        "https://registry.lab.gaia-x.eu/development/api/trusted-shape-registry/v1/shapes/jsonld/termsandconditions#",
        "https://registry.lab.gaia-x.eu/development/api/trusted-shape-registry/v1/shapes/jsonld/participant#"
      ],
      "type": "VerifiableCredential",
      "id": "https://arlabdevelopments.com/.well-known/participantArsysInternet_2210.json",
      "issuer": "did:web:arlabdevelopments.com",
      "issuanceDate": "2023-04-17T00:00:00.000Z",
      "credentialSubject": {
        "id": "did:web:arlabdevelopments.com",
        "type": "gx:LegalParticipant",
        "gx:legalName": "Arsys Internet S.L.U.",
		"gx:webAddress": "https://www.arsys.net",	
        "gx:legalRegistrationNumber": {
          "gx:EUID": "ES26010.000059252",
          "gx:local": "B-85294916"		  
        },
        "gx:headquarterAddress": {
          "gx:countrySubdivisionCode": "ES-RI"
        },
        "gx:legalAddress": {
          "gx:countrySubdivisionCode": "ES-RI"
        },
        "gx:termsAndConditions": "70c1d713215f95191a11d38fe2341faed27d19e083917bc8732ca4fea4976700"		
      }
    }
  ]
} 