{
    "@context": "https://www.w3.org/2018/credentials/v1",
    "type": "VerifiablePresentation",
    "verifiableCredential": [
        {
            "@context": [
                "https://www.w3.org/2018/credentials/v1",
                "https://registry.lab.gaia-x.eu/development/api/trusted-shape-registry/v1/shapes/jsonld/trustframework#"
            ],
            "type": [
                "VerifiableCredential"
            ],
            "id": "did:web:raw.githubusercontent.com:egavard:payload-sign:master",
            "issuer": "did:web:raw.githubusercontent.com:egavard:payload-sign:master",
            "issuanceDate": "2023-03-21T12:00:00.148Z",
            "credentialSubject": {
                "id": "did:web:raw.githubusercontent.com:egavard:payload-sign:master",
                "type": "gx:LegalParticipant",
                "gx:legalName": "Gaia-X European Association for Data and Cloud AISBL",
                "gx:legalRegistrationNumber": {
                    "@id": "http://participantID",
                    "@type": "gx:legalRegistrationNumber"
                },
                "gx:headquarterAddress": {
                    "gx:countrySubdivisionCode": "BE-BRU"
                },
                "gx:legalAddress": {
                    "gx:countrySubdivisionCode": "BE-BRU"
                },
                "gx-terms-and-conditions:gaiaxTermsAndConditions": "70c1d713215f95191a11d38fe2341faed27d19e083917bc8732ca4fea4976700"
            },
            "proof": {
                "type": "JsonWebSignature2020",
                "created": "2023-02-09T16:00:15.219Z",
                "proofPurpose": "assertionMethod",
                "verificationMethod": "did:web:raw.githubusercontent.com:egavard:payload-sign:master",
                "jws": "eyJhbGciOiJQUzI1NiIsImI2NCI6ZmFsc2UsImNyaXQiOlsiYjY0Il19..O9V86bQ1WWfd_LCaTxHpMsbqlSbf2hxESSU4Av1t9M2rfhpj7MoTYmvYGqJECrTRzVqNa_vnAM3bI4QISCbLUAjSfoUkDrjI6KM6-OT8JSUPEf8_dObhHX_zmfYz-Fsn5lXUN4ZCGIQvRKzQI48m0PTJTjahMMJ3XAOaBdxn2jPjZw7uVS1syzDmA7KjwMkSNvB_OjvnwAmXdjc7CQ7qZJrlu0JJLOUfAe_H5diFF_l21ChQSHe_XK0qfPXceEFibRfAU2NUQoiPoCwuI0L8frBqDizdwTjoU1jj6IV8V19fUYJe2qOQGnmzN_uR1BAQ5L_VViUlggYEas1FSGAL9A"
            }
        },
        {
            "@context": "https://www.w3.org/2018/credentials/v1",
            "type": "VerifiableCredential",
            "id": "http://participantID/registrationNumber/1664629337488/data.json",
            "credentialSubject": {
                "@context": "https://registry.lab.gaia-x.eu/development/api/trusted-shape-registry/v1/shapes/jsonld/trustframework#",
                "type": "gx:legalRegistrationNumber",
                "id": "http://participantID",
                "gx:vatID": "FR63533150041"
            },
            "proof": {
                "type": "JsonWebSignature2020",
                "created": "2023-02-09T16:00:15.219Z",
                "proofPurpose": "assertionMethod",
                "verificationMethod": "did:web:raw.githubusercontent.com:egavard:payload-sign:master",
                "jws": "eyJhbGciOiJQUzI1NiIsImI2NCI6ZmFsc2UsImNyaXQiOlsiYjY0Il19..aeEvPnmZyhBS00Hy9lzVe8CUypzdf-0I6jPYRNXPN2bLuMlhqeRdI4OimAySJOoWdtYHSfs4t-_CWshXHwXiRZ2Vfi9UJAFh4bOdlkob2XhjCpoCy0WVgR1NXQF9GceKKcs7YCiXKBq1s9AA2-A8uaux3QQKWr1Tggw0s94OHMyLaaqoWPdTC-XY6lV1nz1jgYzYRJs3SNvfaSY31gQWjo_EDFaA7vhnJVswwrEBEC6KqtlIp7_PUWW36UzmOEmnfA4HdMuThxAsevHsc0943iw20h9uZnNUYScEmY_wD6B95cgr9ckJCfiv-TtSy7i3QmzsKyFWGIVxepXVYHhf6g"
            }
        }
    ]
}