{

  "@context": [

    "https://www.w3.org/2018/credentials/v1",

    "https://registry.lab.gaia-x.eu/development/api/trusted-shape-registry/v1/shapes/jsonld/termsandconditions#",

    "https://registry.lab.gaia-x.eu/development/api/trusted-shape-registry/v1/shapes/jsonld/participant#"

  ],

  "type": "VerifiablePresentation",

  "verifiableCredential": [

    {

      "@context": [

        "https://www.w3.org/2018/credentials/v1",

        "https://registry.lab.gaia-x.eu/development/api/trusted-shape-registry/v1/shapes/jsonld/termsandconditions#",

        "https://registry.lab.gaia-x.eu/development/api/trusted-shape-registry/v1/shapes/jsonld/participant#"

      ],

      "type": "VerifiableCredential",

      "id": "https://hodeix.digital.tecnalia.dev/.well-known/participantTecnalia_raw.json",

      "issuer": "did:web:hodeix.digital.tecnalia.dev",

      "issuanceDate": "2023-04-17T00:00:00.000Z",

      "credentialSubject": {

        "id": "did:web:hodeix.digital.tecnalia.dev",

        "type": "gx:LegalParticipant",

        "gx:legalName": "Fundacion Tecnalia Research & Innovation",

		"gx:webAddress": "https://www.tecnalia.com",	

        "gx:legalRegistrationNumber": {

          "gx:vatID": "ESG48975767"	  

        },

        "gx:headquarterAddress": {

          "gx:countrySubdivisionCode": "ES-PV"

        },

        "gx:legalAddress": {

          "gx:countrySubdivisionCode": "ES-PV"

        },

        "gx:termsAndConditions": "70c1d713215f95191a11d38fe2341faed27d19e083917bc8732ca4fea4976700"		

      }

    }

  ]

} 
