{
  "selfDescriptionCredential": {
    "@context": [
      "http://www.w3.org/ns/shacl#",
      "http://www.w3.org/2001/XMLSchema#",
      "http://w3id.org/gaia-x/resource#",
      "http://w3id.org/gaia-x/participant#",
      "http://w3id.org/gaia-x/service-offering#"
    ],
    "@id": "https://arlabdevelopments.com/.well-known/infrastructure/AdvancedCloudM.json",
    "@type": [
      "VerifiableCredential",
      "ServiceOfferingExperimental"
    ],
    "credentialSubject": {
      "id": "https://arlabdevelopments.com/.well-known/infrastructure/AdvancedCloudM.json",
      "gx-service-offering:providedBy": {
        "@type": "xsd:string",
        "@value": "https://arlabdevelopments.com/.well-known/ArsysLab.json"
      },
      "gx-service-offering:name": {
        "@value": "Advanced Cloud M",
        "@type": "xsd:string"
      },
      "gx-service-offering:description": {
        "@value": "Arsys Advanced Cloud Server - Preconfigured Model (M)",
        "@type": "xsd:string"
      },
      "gx-service-offering:ramsize": {
        "@type": "gx-service-offering:measure",
        "gx-service-offering:Value": {
          "@value": "4",
          "@type": "xsd:int"
        },
        "gx-service-offering:Unit": {
          "@value": "GB",
          "@type": "xsd:string"
        }
      },
      "gx-service-offering:disk": {
        "@type": "gx-service-offering:measure",
        "gx-service-offering:Value": {
          "@value": "40",
          "@type": "xsd:int"
        },
        "gx-service-offering:Unit": {
          "@value": "GB",
          "@type": "xsd:string"
        },
        "gx-service-offering:description": {
          "@value": "SSD (Solid State Drives)",
          "@type": "xsd:string"
        }
      },
      "gx-service-offering:cpu": {
        "@type": "gx-service-offering:measure",
        "gx-service-offering:Value": {
          "@value": "2",
          "@type": "xsd:int"
        },
        "gx-service-offering:description": {
          "@value": "vCPU Intel Xeon",
          "@type": "xsd:string"
        }
      },
      "gx-service-offering:ipv4": {
        "@type": "gx-service-offering:measure",
        "gx-service-offering:Value": {
          "@value": "1",
          "@type": "xsd:int"
        }
      },
      "gx-service-offering:termsAndConditions": [
        {
          "@type": "gx-service-offering:TermsAndConditions",
          "gx-service-offering:url": "https://www.arsys.es/terms/condiciones-30-cloud-pro-o-cloud-avanzado",
          "gx-service-offering:hash": "A24A957D8B3146606CB3DC65801BEBB0C5C3203AEC3259BD0533B48BD557D170"
        }
      ],
      "gx-service-offering:webAddress": {
        "@value": "https://www.arsys.es/servidores/cloud",
        "@type": "xsd:anyURI"
      },
      "gx-service-offering:hostedOn": [
        {
          "@type": "xsd:string",
          "@value": "https://arlabdevelopments.com/.well-known/datacenter/serviceDatacenterEs.json"
        }
      ],
      "gx-service-offering:gdpr": [
        {
          "@type": "xsd:anyURI",
          "gx-service-offering:imprint": "https://www.arsys.es/legal"
        },
        {
          "@type": "xsd:anyURI",
          "gx-service-offering:privacyPolicy": "https://www.arsys.net/terms/personal-data-protection"
        }
      ]
    },
    "proof": {
      "type": "JsonWebKey2020",
      "created": "2022-07-25T11:52:54.080Z",
      "proofPurpose": "assertionMethod",
      "verificationMethod": "did:web:arlabdevelopments.com",
      "jws": "eyJhbGciOiJQUzI1NiIsImI2NCI6ZmFsc2UsImNyaXQiOlsiYjY0Il19..hWcmRdB5gqAEpaN7oAWt9pyh0pVMKgqjZIxUdyq7x1gYATUzJv98s0aawBaNPpK-oMzVO18MrJJr2ttehzhAMa6qVWhFYLjUPVtO8x7gUwtnihLjW9tZ3bOgfochycB8Nt0VWupyqMy60m2PZHfpbfDONVRlU5EgQzjbQN5TlWZHzxsxN9p1g81E1XQvwPrLJdAZBklWezTHadQISzUBthuM7ZrvxrsznOVGqThEDibW_NzZ2zD9LDBZGJJFmJN1Wb60f6732988a78Pn6OuGHa8n8qn3ilEZFhg8lT9l_irMHWBhIU-0qqPV0C4d_NOfB7q8axOCBubuPtxyRzNDw"
    }
  },
  "complianceCredential": {
    "@context": [
      "https://www.w3.org/2018/credentials/v1"
    ],
    "@type": [
      "VerifiableCredential",
      "ServiceOfferingCredentialExperimental"
    ],
    "id": "https://catalogue.gaia-x.eu/credentials/ServiceOfferingCredentialExperimental/1658749979977",
    "issuer": "did:web:compliance.gaia-x.eu",
    "issuanceDate": "2022-07-25T11:52:59.977Z",
    "credentialSubject": {
      "id": "https://arlabdevelopments.com/.well-known/infrastructure/AdvancedCloudM.json",
      "hash": "12c96daea214707dbfd9c4d67f2cd62035a790cd3611b0a4ba1b4385947d7388"
    },
    "proof": {
      "type": "JsonWebKey2020",
      "created": "2022-07-25T11:52:59.977Z",
      "proofPurpose": "assertionMethod",
      "jws": "eyJhbGciOiJQUzI1NiIsImI2NCI6ZmFsc2UsImNyaXQiOlsiYjY0Il19..sfIbEXYl1A_Yij52KXqx_cd74CkZ3J-Qo86faXR5z5WsdEiQo0R-vee3iH2hi8cb1wqmZ6hGqMZQBLAIqvfEDPAzmun226B6j1iGOhqs83W-bJUH0BcFVVUb7s5yMWDX4r5d_phb7qZAungQhTbA6MU33mnQ5nwlWU4pU_zMTI4ledgPjH6KxuX5EGoZsouN7qXNcJtCM8HtCBiw3pAtIBUIf38t8hIAWzHn6dc-ePDKkh-r6WPc9Quv5zAuH5t8LLzyVmp_e4Z06dHSLdyzcm2hVexMvbBKDOlDqPkEVn37zoCOC1FMOIHb8Vm5btx9nP2h4QCLhQzc6K0_uTGlOg",
      "verificationMethod": "did:web:compliance.gaia-x.eu"
    }
  }
}