{
  "@context": {
    "gax-participant": "http://w3id.org/gaia-x/participant#",
    "gax-service": "http://w3id.org/gaia-x/service#",
    "dct": "http://purl.org/dc/terms/",
    "sh": "http://www.w3.org/ns/shacl#",
    "xsd": "http://www.w3.org/2001/XMLSchema#",
    "gax-validation": "http://w3id.org/gaia-x/validation#",
    "gax-node": "http://w3id.org/gaia-x/node#",
    "vcard": "http://www.w3.org/2006/vcard/ns#",
    "dcat": "http://www.w3.org/ns/dcat#",
    "gax-resource": "http://w3id.org/gaia-x/resource#",
    "gax-core": "http://w3id.org/gaia-x/core#"
  },
  "@id": "http://example.org/Storage-kmn7xalgwtffdpa93t4khu",
  "@type": "gax-service:Storage",
  "gax-resource:hasName": {
    "@value": "Cinder",
    "@type": "xsd:string"
  }
}