{
  "$schema": "http://json-schema.org/draft-04/schema#",
  "type": "object",
  "properties": {
    "@context": {
      "type": "array",
      "items": [
        {
          "type": "string"
        },
        {
          "type": "string"
        }
      ]
    },
    "credentialSubject": {
      "type": "object",
      "properties": {
        "degree": {
          "type": "object",
          "properties": {
            "name": {
              "type": "string"
            },
            "type": {
              "type": "string"
            }
          },
          "required": [
            "name",
            "type"
          ]
        },
        "id": {
          "type": "string"
        }
      },
      "required": [
        "degree",
        "id"
      ]
    },
    "id": {
      "type": "string"
    },
    "issuanceDate": {
      "type": "string"
    },
    "issuer": {
      "type": "string"
    },
    "proof": {
      "type": "object",
      "properties": {
        "created": {
          "type": "string"
        },
        "jws": {
          "type": "string"
        },
        "proofPurpose": {
          "type": "string"
        },
        "type": {
          "type": "string"
        },
        "verificationMethod": {
          "type": "string"
        }
      },
      "required": [
        "created",
        "jws",
        "proofPurpose",
        "type",
        "verificationMethod"
      ]
    },
    "type": {
      "type": "array",
      "items": [
        {
          "type": "string"
        },
        {
          "type": "string"
        }
      ]
    }
  },
  "required": [
    "@context",
    "credentialSubject",
    "id",
    "issuanceDate",
    "issuer",
    "proof",
    "type"
  ]
}