{
  "empty_token": {
    "token": "",
    "useruuid": "80e41b47-d8cc-44a2-b696-59a0e1d19a60"
  },
  "empty_uuid": {
    "token": "9hcVHdjEaLZoABH7BVmMkVqUTCW93w7eoa5TauNwIoaklCuG_b9PZ1v9r6_k5y6Wkr9TsLuFcF1BS6v4-kZ1rsiOlKHjvgkIz0KwQRaHpY2vdO3_UXB4dGpTDPtGcmnjOYbDmSjwTV33MeIP8aKXwdr77q47GcEc92gZe2tkDbb05cfe58ga7cBfl9l1vhS6pjJnYw5R25Rkb9PEzyg77_N1tnJWgCC-Rs78mGfRcgrurSxXxul8vY8f_xZ8qWyRZhicTt081H4TOfh_GZrScJR2qc1NIJ6bI0qfmk1KHmvC6kfDv5oZitAIFETpnPA7Oi8862GGcGZD0NSU4gmiYg==",
    "useruuid": ""
  },
  "missing_token": {
    "useruuid": "80e41b47-d8cc-44a2-b696-59a0e1d19a60"
  },
  "missing_uuid": {
    "token": "9hcVHdjEaLZoABH7BVmMkVqUTCW93w7eoa5TauNwIoaklCuG_b9PZ1v9r6_k5y6Wkr9TsLuFcF1BS6v4-kZ1rsiOlKHjvgkIz0KwQRaHpY2vdO3_UXB4dGpTDPtGcmnjOYbDmSjwTV33MeIP8aKXwdr77q47GcEc92gZe2tkDbb05cfe58ga7cBfl9l1vhS6pjJnYw5R25Rkb9PEzyg77_N1tnJWgCC-Rs78mGfRcgrurSxXxul8vY8f_xZ8qWyRZhicTt081H4TOfh_GZrScJR2qc1NIJ6bI0qfmk1KHmvC6kfDv5oZitAIFETpnPA7Oi8862GGcGZD0NSU4gmiYg=="
  }
}