{
  "empty_claim": {
    "claim": "",
    "tag":"ageValue",
    "entityuuid": "d5a7c5c4-75cc-43ae-95d0-c2d0eead21d8"
  },
  "empty_entityuuid": {
    "claim": "age",
    "tag":"ageValue",
    "entityuuid": ""
  },
  "missing_claim": {
    "tag":"ageValue",
    "entityuuid": "d5a7c5c4-75cc-43ae-95d0-c2d0eead21d8"
  },
  "missing_entityuuid": {
    "tag":"ageValue",
    "claim": "age"
  },
  "empty_tag": {
    "claim": "age",
    "tag":"",
    "entityuuid": "d5a7c5c4-75cc-43ae-95d0-c2d0eead21d8"
  },
  "missing_tag": {
    "claim": "age",
    "entityuuid": "d5a7c5c4-75cc-43ae-95d0-c2d0eead21d8"
  }
}