{
  "missing_guardian": {
    "entityUUID": "80e41b47-d8cc-44a2-b696-59a0e1d19a60"
  },
  "empty_guardian": {
    "guardianUUID": "",
    "entityUUID": "80e41b47-d8cc-44a2-b696-59a0e1d19a60"
  },
  "invalid_uuid_guardian": {
    "guardianUUID": "80e41b47-d8cc-44a2-b696",
    "entityUUID": "80e41b47-d8cc-44a2-b696-59a0e1d19a60"
  },
  "missing_entityuuid": {
    "guardianUUID": "80e41b47-d8cc-44a2-b696-59a0e1d19a60"
  },
  "empty_entityuuid": {
    "guardianUUID": "80e41b47-d8cc-44a2-b696-59a0e1d19a60",
    "entityUUID": ""
  },
  "invalid_uuid_entityuuid": {
    "guardianUUID": "80e41b47-d8cc-44a2-b696-59a0e1d19a60",
    "entityUUID": "80e41b47-d8cc-44a2-b696"
  }
}