{
  "successful_creation": {
    "comment": "Created",
    "attributes": [
      {
        "name": "fName",
        "value": "test_fname_3"
      },
      {
        "name": "lName",
        "value": "test_lname_3"
      },
      {
        "name": "gender",
        "value": "test_gender_3"
      }
    ],
    "autoAcceptCredential": "never"
  }
}