{
  "empty_type": {
    "type": "",
    "uuid": "80e41b47-d8cc-44a2-b696-59a0e1d19a60"
  },
  "missing_type": {
    "uuid": "80e41b47-d8cc-44a2-b696-59a0e1d19a60"
  },
  "type_7": {
    "type": 7,
    "uuid": "80e41b47-d8cc-44a2-b696-59a0e1d19a60"
  }
}