{
  "successful_creation": {
    "name": "automation_testing_schema1-01",
    "attributes": [
      "fName",
      "lName",
      "gender"
    ],
    "createdBy": "2344789247389"
  },
  "missing_name": {
    "attributes": [
      "fName",
      "lName",
      "gender"
    ],
    "createdBy": "2344789247389"
  },
  "missing_attributes": {
    "name": "automation_testing_schema1-01",
    "createdBy": "2344789247389"
  },
  "missing_createdBy": {
    "name": "automation_testing_schema1-01",
    "attributes": [
      "fName",
      "lName",
      "gender"
    ]
  },
  "empty_name": {
    "name": "",
    "attributes": [
      "fName",
      "lName",
      "gender"
    ],
    "createdBy": "2344789247389"
  },
  "empty_attributes": {
    "name": "automation_testing_schema1-01",
    "attributes": [
    ],
    "createdBy": "2344789247389"
  },
  "empty_createdBy": {
    "name": "automation_testing_schema1-01",
    "attributes": [
      "fName",
      "lName",
      "gender"
    ],
    "createdBy": ""
  },
  "empty_version": {
    "name": "automation_testing_schema1-01",
    "attributes": [
      "fName",
      "lName",
      "gender"
    ],
    "createdBy": "2344789247389",
    "version": ""
  },
  "missing_version": {
    "name": "automation_testing_schema1-01",
    "attributes": [
      "fName",
      "lName",
      "gender"
    ],
    "createdBy": "2344789247389"
  },
  "wrong_format_version": {
    "name": "automation_testing_schema1-01",
    "attributes": [
      "fName",
      "lName",
      "gender"
    ],
    "createdBy": "2344789247389",
    "version": "1123131"
  }
}