[ {
  "line" : 20,
  "elements" : [ {
    "line" : 25,
    "name" : "",
    "description" : "",
    "type" : "background",
    "keyword" : "Background",
    "steps" : [ {
      "result" : {
        "duration" : 751632952,
        "status" : "passed"
      },
      "line" : 26,
      "name" : "we are testing the OCM Api",
      "match" : {
        "location" : "RestGeneralStepDefinitions.we_are_testing_the_OCM_api()"
      },
      "keyword" : "Given "
    } ]
  }, {
    "start_timestamp" : "2022-06-17T14:00:11.677Z",
    "before" : [ {
      "result" : {
        "duration" : 638774050,
        "status" : "passed"
      },
      "match" : {
        "location" : "GeneralStepDefinitions.beforeScenario(Scenario)"
      }
    } ],
    "line" : 41,
    "name" : "OCM - Creating a new process connection with alias member- Positive",
    "description" : "",
    "id" : "api---ocm---connection---v1---invitation-url-post;ocm---creating-a-new-process-connection-with-alias-<alias>--positive;;2",
    "after" : [ {
      "result" : {
        "duration" : 1203084,
        "status" : "passed"
      },
      "match" : {
        "location" : "GeneralStepDefinitions.afterScenario()"
      }
    } ],
    "type" : "scenario",
    "keyword" : "Scenario Outline",
    "steps" : [ {
      "result" : {
        "duration" : 1876304116,
        "status" : "passed"
      },
      "line" : 31,
      "name" : "an administrator generates a QR code by creating a connection with alias {member} via OCM api",
      "match" : {
        "arguments" : [ {
          "val" : "member",
          "offset" : 74
        } ],
        "location" : "ConnectionStepDefinitions.an_administrator_generates_a_QR_code_by_creating_a_connection_with_alias_via_OCM_api(String)"
      },
      "keyword" : "Given "
    }, {
      "result" : {
        "duration" : 46725649,
        "status" : "passed"
      },
      "line" : 32,
      "name" : "the field {statusCode} contains the value {200}",
      "match" : {
        "arguments" : [ {
          "val" : "statusCode",
          "offset" : 11
        }, {
          "val" : "200",
          "offset" : 43
        } ],
        "location" : "GeneralStepDefinitions.the_field_contains_the_value_(String,String)"
      },
      "keyword" : "Then "
    }, {
      "result" : {
        "duration" : 159731,
        "status" : "passed"
      },
      "line" : 33,
      "name" : "the status code should be {201}",
      "match" : {
        "arguments" : [ {
          "val" : "201",
          "offset" : 27
        } ],
        "location" : "GeneralStepDefinitions.the_status_code_should_be(int)"
      },
      "keyword" : "And "
    }, {
      "result" : {
        "duration" : 397009841,
        "status" : "passed"
      },
      "line" : 34,
      "name" : "the response is valid according to the {Connection_POST_invitationURL.json} REST schema",
      "match" : {
        "arguments" : [ {
          "val" : "Connection_POST_invitationURL.json",
          "offset" : 40
        } ],
        "location" : "RestGeneralStepDefinitions.the_response_is_valid_according_to_the_REST_schema(String)"
      },
      "keyword" : "And "
    }, {
      "result" : {
        "duration" : 431821,
        "status" : "passed"
      },
      "line" : 35,
      "name" : "the field {message} contains the value {Connection created successfully}",
      "match" : {
        "arguments" : [ {
          "val" : "message",
          "offset" : 11
        }, {
          "val" : "Connection created successfully",
          "offset" : 40
        } ],
        "location" : "GeneralStepDefinitions.the_field_contains_the_value_(String,String)"
      },
      "keyword" : "Then "
    }, {
      "result" : {
        "duration" : 1911683,
        "status" : "passed"
      },
      "line" : 36,
      "name" : "the field {$..state} contains the value {invited}",
      "match" : {
        "arguments" : [ {
          "val" : "$..state",
          "offset" : 11
        }, {
          "val" : "invited",
          "offset" : 41
        } ],
        "location" : "GeneralStepDefinitions.the_field_contains_the_value_(String,String)"
      },
      "keyword" : "And "
    }, {
      "result" : {
        "duration" : 608999,
        "status" : "passed"
      },
      "line" : 37,
      "name" : "the field {$..role} contains the value {inviter}",
      "match" : {
        "arguments" : [ {
          "val" : "$..role",
          "offset" : 11
        }, {
          "val" : "inviter",
          "offset" : 40
        } ],
        "location" : "GeneralStepDefinitions.the_field_contains_the_value_(String,String)"
      },
      "keyword" : "And "
    }, {
      "result" : {
        "duration" : 564553,
        "status" : "passed"
      },
      "line" : 38,
      "name" : "the field {$..alias} contains the value {member}",
      "match" : {
        "arguments" : [ {
          "val" : "$..alias",
          "offset" : 11
        }, {
          "val" : "member",
          "offset" : 41
        } ],
        "location" : "GeneralStepDefinitions.the_field_contains_the_value_(String,String)"
      },
      "keyword" : "And "
    } ],
    "tags" : [ {
      "name" : "@rest"
    }, {
      "name" : "@all"
    }, {
      "name" : "@ocm"
    }, {
      "name" : "@connection"
    } ]
  } ],
  "name" : "API - OCM - connection - v1 - invitation-url POST",
  "description" : "  It is used to create the connection invitation URL to establish the peer to peer connection,\n  between two aeries agents or the participant user and the principal user.",
  "id" : "api---ocm---connection---v1---invitation-url-post",
  "keyword" : "Feature",
  "uri" : "file:src/test/resources/features/ocm/connection/v1/invitation-url/POST.feature",
  "tags" : [ {
    "name" : "@rest",
    "type" : "Tag",
    "location" : {
      "line" : 19,
      "column" : 1
    }
  }, {
    "name" : "@all",
    "type" : "Tag",
    "location" : {
      "line" : 19,
      "column" : 7
    }
  }, {
    "name" : "@ocm",
    "type" : "Tag",
    "location" : {
      "line" : 19,
      "column" : 12
    }
  } ]
} , {
  "line" : 20,
  "elements" : [ {
    "line" : 25,
    "name" : "",
    "description" : "",
    "type" : "background",
    "keyword" : "Background",
    "steps" : [ {
      "result" : {
        "duration" : 3836891461,
        "status" : "passed"
      },
      "line" : 26,
      "name" : "we are testing the OCM Api",
      "match" : {
        "location" : "RestGeneralStepDefinitions.we_are_testing_the_OCM_api()"
      },
      "keyword" : "Given "
    } ]
  }, {
    "start_timestamp" : "2022-06-17T13:59:55.739Z",
    "before" : [ {
      "result" : {
        "duration" : 2822369102,
        "status" : "passed"
      },
      "match" : {
        "location" : "GeneralStepDefinitions.beforeScenario(Scenario)"
      }
    } ],
    "line" : 54,
    "name" : "OCM - Trying to create a new member process connection with invalid alias dsadasd - Negative",
    "description" : "",
    "id" : "api---ocm---connection---v1---invitation-url-post;ocm---trying-to-create-a-new-member-process-connection-with-invalid-alias-<alias>---negative;;2",
    "after" : [ {
      "result" : {
        "duration" : 885096,
        "status" : "passed"
      },
      "match" : {
        "location" : "GeneralStepDefinitions.afterScenario()"
      }
    } ],
    "type" : "scenario",
    "keyword" : "Scenario Outline",
    "steps" : [ {
      "result" : {
        "duration" : 6894076521,
        "status" : "passed"
      },
      "line" : 47,
      "name" : "an administrator generates a QR code by creating a connection with alias {dsadasd} via OCM api",
      "match" : {
        "arguments" : [ {
          "val" : "dsadasd",
          "offset" : 74
        } ],
        "location" : "ConnectionStepDefinitions.an_administrator_generates_a_QR_code_by_creating_a_connection_with_alias_via_OCM_api(String)"
      },
      "keyword" : "Given "
    }, {
      "result" : {
        "duration" : 178052459,
        "status" : "passed"
      },
      "line" : 48,
      "name" : "the field {statusCode} contains the value {400}",
      "match" : {
        "arguments" : [ {
          "val" : "statusCode",
          "offset" : 11
        }, {
          "val" : "400",
          "offset" : 43
        } ],
        "location" : "GeneralStepDefinitions.the_field_contains_the_value_(String,String)"
      },
      "keyword" : "Then "
    }, {
      "result" : {
        "duration" : 158425,
        "status" : "passed"
      },
      "line" : 49,
      "name" : "the status code should be {400}",
      "match" : {
        "arguments" : [ {
          "val" : "400",
          "offset" : 27
        } ],
        "location" : "GeneralStepDefinitions.the_status_code_should_be(int)"
      },
      "keyword" : "And "
    }, {
      "result" : {
        "duration" : 242798,
        "status" : "passed"
      },
      "line" : 50,
      "name" : "the field {message} contains the value {Alias must be provided}",
      "match" : {
        "arguments" : [ {
          "val" : "message",
          "offset" : 11
        }, {
          "val" : "Alias must be provided",
          "offset" : 40
        } ],
        "location" : "GeneralStepDefinitions.the_field_contains_the_value_(String,String)"
      },
      "keyword" : "Then "
    }, {
      "result" : {
        "duration" : 46249,
        "status" : "passed"
      },
      "line" : 51,
      "name" : "I clear the request body",
      "match" : {
        "location" : "GeneralStepDefinitions.I_clear_the_request_body()"
      },
      "keyword" : "And "
    } ],
    "tags" : [ {
      "name" : "@rest"
    }, {
      "name" : "@all"
    }, {
      "name" : "@ocm"
    }, {
      "name" : "@connection"
    }, {
      "name" : "@negative"
    } ]
  } ],
  "name" : "API - OCM - connection - v1 - invitation-url POST",
  "description" : "  It is used to create the connection invitation URL to establish the peer to peer connection,\n  between two aeries agents or the participant user and the principal user.",
  "id" : "api---ocm---connection---v1---invitation-url-post",
  "keyword" : "Feature",
  "uri" : "file:src/test/resources/features/ocm/connection/v1/invitation-url/POST.feature",
  "tags" : [ {
    "name" : "@rest",
    "type" : "Tag",
    "location" : {
      "line" : 19,
      "column" : 1
    }
  }, {
    "name" : "@all",
    "type" : "Tag",
    "location" : {
      "line" : 19,
      "column" : 7
    }
  }, {
    "name" : "@ocm",
    "type" : "Tag",
    "location" : {
      "line" : 19,
      "column" : 12
    }
  } ]
} , {
  "line" : 20,
  "elements" : [ {
    "line" : 25,
    "name" : "",
    "description" : "",
    "type" : "background",
    "keyword" : "Background",
    "steps" : [ {
      "result" : {
        "duration" : 795176724,
        "status" : "passed"
      },
      "line" : 26,
      "name" : "we are testing the OCM Api",
      "match" : {
        "location" : "RestGeneralStepDefinitions.we_are_testing_the_OCM_api()"
      },
      "keyword" : "Given "
    } ]
  }, {
    "start_timestamp" : "2022-06-17T14:00:11.655Z",
    "before" : [ {
      "result" : {
        "duration" : 685027247,
        "status" : "passed"
      },
      "match" : {
        "location" : "GeneralStepDefinitions.beforeScenario(Scenario)"
      }
    } ],
    "line" : 42,
    "name" : "OCM - Creating a new process connection with alias subscriber- Positive",
    "description" : "",
    "id" : "api---ocm---connection---v1---invitation-url-post;ocm---creating-a-new-process-connection-with-alias-<alias>--positive;;3",
    "after" : [ {
      "result" : {
        "duration" : 996490,
        "status" : "passed"
      },
      "match" : {
        "location" : "GeneralStepDefinitions.afterScenario()"
      }
    } ],
    "type" : "scenario",
    "keyword" : "Scenario Outline",
    "steps" : [ {
      "result" : {
        "duration" : 1910812301,
        "status" : "passed"
      },
      "line" : 31,
      "name" : "an administrator generates a QR code by creating a connection with alias {subscriber} via OCM api",
      "match" : {
        "arguments" : [ {
          "val" : "subscriber",
          "offset" : 74
        } ],
        "location" : "ConnectionStepDefinitions.an_administrator_generates_a_QR_code_by_creating_a_connection_with_alias_via_OCM_api(String)"
      },
      "keyword" : "Given "
    }, {
      "result" : {
        "duration" : 35234747,
        "status" : "passed"
      },
      "line" : 32,
      "name" : "the field {statusCode} contains the value {200}",
      "match" : {
        "arguments" : [ {
          "val" : "statusCode",
          "offset" : 11
        }, {
          "val" : "200",
          "offset" : 43
        } ],
        "location" : "GeneralStepDefinitions.the_field_contains_the_value_(String,String)"
      },
      "keyword" : "Then "
    }, {
      "result" : {
        "duration" : 106129,
        "status" : "passed"
      },
      "line" : 33,
      "name" : "the status code should be {201}",
      "match" : {
        "arguments" : [ {
          "val" : "201",
          "offset" : 27
        } ],
        "location" : "GeneralStepDefinitions.the_status_code_should_be(int)"
      },
      "keyword" : "And "
    }, {
      "result" : {
        "duration" : 391012930,
        "status" : "passed"
      },
      "line" : 34,
      "name" : "the response is valid according to the {Connection_POST_invitationURL.json} REST schema",
      "match" : {
        "arguments" : [ {
          "val" : "Connection_POST_invitationURL.json",
          "offset" : 40
        } ],
        "location" : "RestGeneralStepDefinitions.the_response_is_valid_according_to_the_REST_schema(String)"
      },
      "keyword" : "And "
    }, {
      "result" : {
        "duration" : 463729,
        "status" : "passed"
      },
      "line" : 35,
      "name" : "the field {message} contains the value {Connection created successfully}",
      "match" : {
        "arguments" : [ {
          "val" : "message",
          "offset" : 11
        }, {
          "val" : "Connection created successfully",
          "offset" : 40
        } ],
        "location" : "GeneralStepDefinitions.the_field_contains_the_value_(String,String)"
      },
      "keyword" : "Then "
    }, {
      "result" : {
        "duration" : 3986024,
        "status" : "passed"
      },
      "line" : 36,
      "name" : "the field {$..state} contains the value {invited}",
      "match" : {
        "arguments" : [ {
          "val" : "$..state",
          "offset" : 11
        }, {
          "val" : "invited",
          "offset" : 41
        } ],
        "location" : "GeneralStepDefinitions.the_field_contains_the_value_(String,String)"
      },
      "keyword" : "And "
    }, {
      "result" : {
        "duration" : 2900990,
        "status" : "passed"
      },
      "line" : 37,
      "name" : "the field {$..role} contains the value {inviter}",
      "match" : {
        "arguments" : [ {
          "val" : "$..role",
          "offset" : 11
        }, {
          "val" : "inviter",
          "offset" : 40
        } ],
        "location" : "GeneralStepDefinitions.the_field_contains_the_value_(String,String)"
      },
      "keyword" : "And "
    }, {
      "result" : {
        "duration" : 647760,
        "status" : "passed"
      },
      "line" : 38,
      "name" : "the field {$..alias} contains the value {subscriber}",
      "match" : {
        "arguments" : [ {
          "val" : "$..alias",
          "offset" : 11
        }, {
          "val" : "subscriber",
          "offset" : 41
        } ],
        "location" : "GeneralStepDefinitions.the_field_contains_the_value_(String,String)"
      },
      "keyword" : "And "
    } ],
    "tags" : [ {
      "name" : "@rest"
    }, {
      "name" : "@all"
    }, {
      "name" : "@ocm"
    }, {
      "name" : "@connection"
    } ]
  } ],
  "name" : "API - OCM - connection - v1 - invitation-url POST",
  "description" : "  It is used to create the connection invitation URL to establish the peer to peer connection,\n  between two aeries agents or the participant user and the principal user.",
  "id" : "api---ocm---connection---v1---invitation-url-post",
  "keyword" : "Feature",
  "uri" : "file:src/test/resources/features/ocm/connection/v1/invitation-url/POST.feature",
  "tags" : [ {
    "name" : "@rest",
    "type" : "Tag",
    "location" : {
      "line" : 19,
      "column" : 1
    }
  }, {
    "name" : "@all",
    "type" : "Tag",
    "location" : {
      "line" : 19,
      "column" : 7
    }
  }, {
    "name" : "@ocm",
    "type" : "Tag",
    "location" : {
      "line" : 19,
      "column" : 12
    }
  } ]
} , {
  "line" : 20,
  "elements" : [ {
    "line" : 25,
    "name" : "",
    "description" : "",
    "type" : "background",
    "keyword" : "Background",
    "steps" : [ {
      "result" : {
        "duration" : 3843509925,
        "status" : "passed"
      },
      "line" : 26,
      "name" : "we are testing the OCM Api",
      "match" : {
        "location" : "RestGeneralStepDefinitions.we_are_testing_the_OCM_api()"
      },
      "keyword" : "Given "
    } ]
  }, {
    "start_timestamp" : "2022-06-17T13:59:55.224Z",
    "before" : [ {
      "result" : {
        "duration" : 2670289329,
        "status" : "passed"
      },
      "match" : {
        "location" : "GeneralStepDefinitions.beforeScenario(Scenario)"
      }
    } ],
    "line" : 55,
    "name" : "OCM - Trying to create a new member process connection with invalid alias  - Negative",
    "description" : "",
    "id" : "api---ocm---connection---v1---invitation-url-post;ocm---trying-to-create-a-new-member-process-connection-with-invalid-alias-<alias>---negative;;3",
    "after" : [ {
      "result" : {
        "duration" : 23928420,
        "status" : "passed"
      },
      "match" : {
        "location" : "GeneralStepDefinitions.afterScenario()"
      }
    } ],
    "type" : "scenario",
    "keyword" : "Scenario Outline",
    "steps" : [ {
      "result" : {
        "duration" : 7223932600,
        "status" : "passed"
      },
      "line" : 47,
      "name" : "an administrator generates a QR code by creating a connection with alias {} via OCM api",
      "match" : {
        "arguments" : [ {
          "val" : "",
          "offset" : 74
        } ],
        "location" : "ConnectionStepDefinitions.an_administrator_generates_a_QR_code_by_creating_a_connection_with_alias_via_OCM_api(String)"
      },
      "keyword" : "Given "
    }, {
      "result" : {
        "duration" : 164388832,
        "status" : "passed"
      },
      "line" : 48,
      "name" : "the field {statusCode} contains the value {400}",
      "match" : {
        "arguments" : [ {
          "val" : "statusCode",
          "offset" : 11
        }, {
          "val" : "400",
          "offset" : 43
        } ],
        "location" : "GeneralStepDefinitions.the_field_contains_the_value_(String,String)"
      },
      "keyword" : "Then "
    }, {
      "result" : {
        "duration" : 156019,
        "status" : "passed"
      },
      "line" : 49,
      "name" : "the status code should be {400}",
      "match" : {
        "arguments" : [ {
          "val" : "400",
          "offset" : 27
        } ],
        "location" : "GeneralStepDefinitions.the_status_code_should_be(int)"
      },
      "keyword" : "And "
    }, {
      "result" : {
        "duration" : 241684,
        "status" : "passed"
      },
      "line" : 50,
      "name" : "the field {message} contains the value {Alias must be provided}",
      "match" : {
        "arguments" : [ {
          "val" : "message",
          "offset" : 11
        }, {
          "val" : "Alias must be provided",
          "offset" : 40
        } ],
        "location" : "GeneralStepDefinitions.the_field_contains_the_value_(String,String)"
      },
      "keyword" : "Then "
    }, {
      "result" : {
        "duration" : 47094,
        "status" : "passed"
      },
      "line" : 51,
      "name" : "I clear the request body",
      "match" : {
        "location" : "GeneralStepDefinitions.I_clear_the_request_body()"
      },
      "keyword" : "And "
    } ],
    "tags" : [ {
      "name" : "@rest"
    }, {
      "name" : "@all"
    }, {
      "name" : "@ocm"
    }, {
      "name" : "@connection"
    }, {
      "name" : "@negative"
    } ]
  } ],
  "name" : "API - OCM - connection - v1 - invitation-url POST",
  "description" : "  It is used to create the connection invitation URL to establish the peer to peer connection,\n  between two aeries agents or the participant user and the principal user.",
  "id" : "api---ocm---connection---v1---invitation-url-post",
  "keyword" : "Feature",
  "uri" : "file:src/test/resources/features/ocm/connection/v1/invitation-url/POST.feature",
  "tags" : [ {
    "name" : "@rest",
    "type" : "Tag",
    "location" : {
      "line" : 19,
      "column" : 1
    }
  }, {
    "name" : "@all",
    "type" : "Tag",
    "location" : {
      "line" : 19,
      "column" : 7
    }
  }, {
    "name" : "@ocm",
    "type" : "Tag",
    "location" : {
      "line" : 19,
      "column" : 12
    }
  } ]
} , {
  "line" : 20,
  "elements" : [ {
    "line" : 25,
    "name" : "",
    "description" : "",
    "type" : "background",
    "keyword" : "Background",
    "steps" : [ {
      "result" : {
        "duration" : 3583360893,
        "status" : "passed"
      },
      "line" : 26,
      "name" : "we are testing the OCM Api",
      "match" : {
        "location" : "RestGeneralStepDefinitions.we_are_testing_the_OCM_api()"
      },
      "keyword" : "Given "
    } ]
  }, {
    "start_timestamp" : "2022-06-17T13:59:55.229Z",
    "before" : [ {
      "result" : {
        "duration" : 3125543942,
        "status" : "passed"
      },
      "match" : {
        "location" : "GeneralStepDefinitions.beforeScenario(Scenario)"
      }
    } ],
    "line" : 58,
    "name" : "OCM - Trying to create a new member process connection without alies - Negative",
    "description" : "",
    "id" : "api---ocm---connection---v1---invitation-url-post;ocm---trying-to-create-a-new-member-process-connection-without-alies---negative",
    "after" : [ {
      "result" : {
        "duration" : 5826750,
        "status" : "passed"
      },
      "match" : {
        "location" : "GeneralStepDefinitions.afterScenario()"
      }
    } ],
    "type" : "scenario",
    "keyword" : "Scenario",
    "steps" : [ {
      "result" : {
        "duration" : 7241161222,
        "status" : "passed"
      },
      "line" : 60,
      "name" : "an administrator generates a QR code by creating a connection via OCM api",
      "match" : {
        "location" : "ConnectionStepDefinitions.an_administrator_generates_a_QR_code_by_creating_a_connection_via_OCM_api()"
      },
      "keyword" : "Given "
    }, {
      "result" : {
        "duration" : 185347931,
        "status" : "passed"
      },
      "line" : 61,
      "name" : "the field {statusCode} contains the value {400}",
      "match" : {
        "arguments" : [ {
          "val" : "statusCode",
          "offset" : 11
        }, {
          "val" : "400",
          "offset" : 43
        } ],
        "location" : "GeneralStepDefinitions.the_field_contains_the_value_(String,String)"
      },
      "keyword" : "Then "
    }, {
      "result" : {
        "duration" : 163752,
        "status" : "passed"
      },
      "line" : 62,
      "name" : "the status code should be {400}",
      "match" : {
        "arguments" : [ {
          "val" : "400",
          "offset" : 27
        } ],
        "location" : "GeneralStepDefinitions.the_status_code_should_be(int)"
      },
      "keyword" : "And "
    }, {
      "result" : {
        "duration" : 251050,
        "status" : "passed"
      },
      "line" : 63,
      "name" : "the field {message} contains the value {Alias must be provided}",
      "match" : {
        "arguments" : [ {
          "val" : "message",
          "offset" : 11
        }, {
          "val" : "Alias must be provided",
          "offset" : 40
        } ],
        "location" : "GeneralStepDefinitions.the_field_contains_the_value_(String,String)"
      },
      "keyword" : "Then "
    }, {
      "result" : {
        "duration" : 53120,
        "status" : "passed"
      },
      "line" : 64,
      "name" : "I clear the request body",
      "match" : {
        "location" : "GeneralStepDefinitions.I_clear_the_request_body()"
      },
      "keyword" : "And "
    } ],
    "tags" : [ {
      "name" : "@rest"
    }, {
      "name" : "@all"
    }, {
      "name" : "@ocm"
    }, {
      "name" : "@connection"
    }, {
      "name" : "@negative"
    } ]
  } ],
  "name" : "API - OCM - connection - v1 - invitation-url POST",
  "description" : "  It is used to create the connection invitation URL to establish the peer to peer connection,\n  between two aeries agents or the participant user and the principal user.",
  "id" : "api---ocm---connection---v1---invitation-url-post",
  "keyword" : "Feature",
  "uri" : "file:src/test/resources/features/ocm/connection/v1/invitation-url/POST.feature",
  "tags" : [ {
    "name" : "@rest",
    "type" : "Tag",
    "location" : {
      "line" : 19,
      "column" : 1
    }
  }, {
    "name" : "@all",
    "type" : "Tag",
    "location" : {
      "line" : 19,
      "column" : 7
    }
  }, {
    "name" : "@ocm",
    "type" : "Tag",
    "location" : {
      "line" : 19,
      "column" : 12
    }
  } ]
} , {
  "line" : 20,
  "elements" : [ {
    "line" : 23,
    "name" : "",
    "description" : "",
    "type" : "background",
    "keyword" : "Background",
    "steps" : [ {
      "result" : {
        "duration" : 3371792322,
        "status" : "passed"
      },
      "line" : 24,
      "name" : "we are testing the OCM Api",
      "match" : {
        "location" : "RestGeneralStepDefinitions.we_are_testing_the_OCM_api()"
      },
      "keyword" : "Given "
    } ]
  }, {
    "start_timestamp" : "2022-06-17T13:59:55.103Z",
    "before" : [ {
      "result" : {
        "duration" : 2951246668,
        "status" : "passed"
      },
      "match" : {
        "location" : "GeneralStepDefinitions.beforeScenario(Scenario)"
      }
    } ],
    "line" : 27,
    "name" : "OCM - Attestation - Health check - Positive",
    "description" : "",
    "id" : "api---ocm---attestation---v1---health-get;ocm---attestation---health-check---positive",
    "after" : [ {
      "result" : {
        "duration" : 2414189,
        "status" : "passed"
      },
      "match" : {
        "location" : "GeneralStepDefinitions.afterScenario()"
      }
    } ],
    "type" : "scenario",
    "keyword" : "Scenario",
    "steps" : [ {
      "result" : {
        "duration" : 6823008593,
        "status" : "passed"
      },
      "line" : 28,
      "name" : "we call the health check for attestation manager via OCM api",
      "match" : {
        "location" : "AttestationStepDefinitions.we_call_the_health_check_for_attestation_manager_via_OCM_api()"
      },
      "keyword" : "Given "
    }, {
      "result" : {
        "duration" : 143021558,
        "status" : "passed"
      },
      "line" : 29,
      "name" : "the field {statusCode} contains the value {200}",
      "match" : {
        "arguments" : [ {
          "val" : "statusCode",
          "offset" : 11
        }, {
          "val" : "200",
          "offset" : 43
        } ],
        "location" : "GeneralStepDefinitions.the_field_contains_the_value_(String,String)"
      },
      "keyword" : "Then "
    }, {
      "result" : {
        "duration" : 174895,
        "status" : "passed"
      },
      "line" : 30,
      "name" : "the status code should be {200}",
      "match" : {
        "arguments" : [ {
          "val" : "200",
          "offset" : 27
        } ],
        "location" : "GeneralStepDefinitions.the_status_code_should_be(int)"
      },
      "keyword" : "And "
    }, {
      "result" : {
        "duration" : 263973,
        "status" : "passed"
      },
      "line" : 31,
      "name" : "the field {message} is present and not empty",
      "match" : {
        "arguments" : [ {
          "val" : "message",
          "offset" : 11
        } ],
        "location" : "GeneralStepDefinitions.the_field_is_present_and_not_empty(String)"
      },
      "keyword" : "And "
    }, {
      "result" : {
        "duration" : 45552,
        "status" : "passed"
      },
      "line" : 32,
      "name" : "I clear the request body",
      "match" : {
        "location" : "GeneralStepDefinitions.I_clear_the_request_body()"
      },
      "keyword" : "And "
    } ],
    "tags" : [ {
      "name" : "@rest"
    }, {
      "name" : "@all"
    }, {
      "name" : "@ocm"
    }, {
      "name" : "@attestation"
    }, {
      "name" : "@health"
    } ]
  } ],
  "name" : "API - OCM - attestation - v1 - health GET",
  "description" : "  Attestation manager health check",
  "id" : "api---ocm---attestation---v1---health-get",
  "keyword" : "Feature",
  "uri" : "file:src/test/resources/features/ocm/attestation/v1/health/GET.feature",
  "tags" : [ {
    "name" : "@rest",
    "type" : "Tag",
    "location" : {
      "line" : 19,
      "column" : 1
    }
  }, {
    "name" : "@all",
    "type" : "Tag",
    "location" : {
      "line" : 19,
      "column" : 7
    }
  }, {
    "name" : "@ocm",
    "type" : "Tag",
    "location" : {
      "line" : 19,
      "column" : 12
    }
  }, {
    "name" : "@attestation",
    "type" : "Tag",
    "location" : {
      "line" : 19,
      "column" : 17
    }
  } ]
} , {
  "line" : 20,
  "elements" : [ {
    "line" : 23,
    "name" : "",
    "description" : "",
    "type" : "background",
    "keyword" : "Background",
    "steps" : [ {
      "result" : {
        "duration" : 3335610493,
        "status" : "passed"
      },
      "line" : 24,
      "name" : "we are testing the OCM Api",
      "match" : {
        "location" : "RestGeneralStepDefinitions.we_are_testing_the_OCM_api()"
      },
      "keyword" : "Given "
    } ]
  }, {
    "start_timestamp" : "2022-06-17T13:59:55.322Z",
    "before" : [ {
      "result" : {
        "duration" : 3179736886,
        "status" : "passed"
      },
      "match" : {
        "location" : "GeneralStepDefinitions.beforeScenario(Scenario)"
      }
    } ],
    "line" : 27,
    "name" : "OCM - Proof - Health check - Positive",
    "description" : "",
    "id" : "api---ocm---proof---v1---health-get;ocm---proof---health-check---positive",
    "after" : [ {
      "result" : {
        "duration" : 20516660,
        "status" : "passed"
      },
      "match" : {
        "location" : "GeneralStepDefinitions.afterScenario()"
      }
    } ],
    "type" : "scenario",
    "keyword" : "Scenario",
    "steps" : [ {
      "result" : {
        "duration" : 7042882899,
        "status" : "passed"
      },
      "line" : 28,
      "name" : "we call the health check for proof manager via OCM api",
      "match" : {
        "location" : "ProofStepDefinitions.we_call_the_health_check_for_proof_manager_via_OCM_api()"
      },
      "keyword" : "Given "
    }, {
      "result" : {
        "duration" : 191791827,
        "status" : "passed"
      },
      "line" : 29,
      "name" : "the field {statusCode} contains the value {200}",
      "match" : {
        "arguments" : [ {
          "val" : "statusCode",
          "offset" : 11
        }, {
          "val" : "200",
          "offset" : 43
        } ],
        "location" : "GeneralStepDefinitions.the_field_contains_the_value_(String,String)"
      },
      "keyword" : "Then "
    }, {
      "result" : {
        "duration" : 148390,
        "status" : "passed"
      },
      "line" : 30,
      "name" : "the status code should be {200}",
      "match" : {
        "arguments" : [ {
          "val" : "200",
          "offset" : 27
        } ],
        "location" : "GeneralStepDefinitions.the_status_code_should_be(int)"
      },
      "keyword" : "And "
    }, {
      "result" : {
        "duration" : 242515,
        "status" : "passed"
      },
      "line" : 31,
      "name" : "the field {message} is present and not empty",
      "match" : {
        "arguments" : [ {
          "val" : "message",
          "offset" : 11
        } ],
        "location" : "GeneralStepDefinitions.the_field_is_present_and_not_empty(String)"
      },
      "keyword" : "And "
    }, {
      "result" : {
        "duration" : 42071,
        "status" : "passed"
      },
      "line" : 32,
      "name" : "I clear the request body",
      "match" : {
        "location" : "GeneralStepDefinitions.I_clear_the_request_body()"
      },
      "keyword" : "And "
    } ],
    "tags" : [ {
      "name" : "@rest"
    }, {
      "name" : "@all"
    }, {
      "name" : "@ocm"
    }, {
      "name" : "@proof"
    }, {
      "name" : "@health"
    } ]
  } ],
  "name" : "API - OCM - proof - v1 - health GET",
  "description" : "  proof manager health check",
  "id" : "api---ocm---proof---v1---health-get",
  "keyword" : "Feature",
  "uri" : "file:src/test/resources/features/ocm/proof/v1/health/GET.feature",
  "tags" : [ {
    "name" : "@rest",
    "type" : "Tag",
    "location" : {
      "line" : 19,
      "column" : 1
    }
  }, {
    "name" : "@all",
    "type" : "Tag",
    "location" : {
      "line" : 19,
      "column" : 7
    }
  }, {
    "name" : "@ocm",
    "type" : "Tag",
    "location" : {
      "line" : 19,
      "column" : 12
    }
  }, {
    "name" : "@proof",
    "type" : "Tag",
    "location" : {
      "line" : 19,
      "column" : 17
    }
  } ]
} , {
  "line" : 20,
  "elements" : [ {
    "line" : 23,
    "name" : "",
    "description" : "",
    "type" : "background",
    "keyword" : "Background",
    "steps" : [ {
      "result" : {
        "duration" : 3390634351,
        "status" : "passed"
      },
      "line" : 24,
      "name" : "we are testing the OCM Api",
      "match" : {
        "location" : "RestGeneralStepDefinitions.we_are_testing_the_OCM_api()"
      },
      "keyword" : "Given "
    } ]
  }, {
    "start_timestamp" : "2022-06-17T13:59:55.608Z",
    "before" : [ {
      "result" : {
        "duration" : 2537666959,
        "status" : "passed"
      },
      "match" : {
        "location" : "GeneralStepDefinitions.beforeScenario(Scenario)"
      }
    } ],
    "line" : 27,
    "name" : "OCM - Connection - Health check - Positive",
    "description" : "",
    "id" : "api---ocm---connection---v1---health-get;ocm---connection---health-check---positive",
    "after" : [ {
      "result" : {
        "duration" : 9604639,
        "status" : "passed"
      },
      "match" : {
        "location" : "GeneralStepDefinitions.afterScenario()"
      }
    } ],
    "type" : "scenario",
    "keyword" : "Scenario",
    "steps" : [ {
      "result" : {
        "duration" : 6956407765,
        "status" : "passed"
      },
      "line" : 28,
      "name" : "we call the health check for connection manager via OCM api",
      "match" : {
        "location" : "ConnectionStepDefinitions.we_call_the_health_check_for_connection_manager_via_OCM_api()"
      },
      "keyword" : "Given "
    }, {
      "result" : {
        "duration" : 186833220,
        "status" : "passed"
      },
      "line" : 29,
      "name" : "the field {statusCode} contains the value {200}",
      "match" : {
        "arguments" : [ {
          "val" : "statusCode",
          "offset" : 11
        }, {
          "val" : "200",
          "offset" : 43
        } ],
        "location" : "GeneralStepDefinitions.the_field_contains_the_value_(String,String)"
      },
      "keyword" : "Then "
    }, {
      "result" : {
        "duration" : 152331,
        "status" : "passed"
      },
      "line" : 30,
      "name" : "the status code should be {200}",
      "match" : {
        "arguments" : [ {
          "val" : "200",
          "offset" : 27
        } ],
        "location" : "GeneralStepDefinitions.the_status_code_should_be(int)"
      },
      "keyword" : "And "
    }, {
      "result" : {
        "duration" : 241973,
        "status" : "passed"
      },
      "line" : 31,
      "name" : "the field {message} is present and not empty",
      "match" : {
        "arguments" : [ {
          "val" : "message",
          "offset" : 11
        } ],
        "location" : "GeneralStepDefinitions.the_field_is_present_and_not_empty(String)"
      },
      "keyword" : "And "
    }, {
      "result" : {
        "duration" : 38299,
        "status" : "passed"
      },
      "line" : 32,
      "name" : "I clear the request body",
      "match" : {
        "location" : "GeneralStepDefinitions.I_clear_the_request_body()"
      },
      "keyword" : "And "
    } ],
    "tags" : [ {
      "name" : "@rest"
    }, {
      "name" : "@all"
    }, {
      "name" : "@ocm"
    }, {
      "name" : "@connection"
    }, {
      "name" : "@health"
    } ]
  } ],
  "name" : "API - OCM - connection - v1 - health GET",
  "description" : "  Connection manager health check",
  "id" : "api---ocm---connection---v1---health-get",
  "keyword" : "Feature",
  "uri" : "file:src/test/resources/features/ocm/connection/v1/health/GET.feature",
  "tags" : [ {
    "name" : "@rest",
    "type" : "Tag",
    "location" : {
      "line" : 19,
      "column" : 1
    }
  }, {
    "name" : "@all",
    "type" : "Tag",
    "location" : {
      "line" : 19,
      "column" : 7
    }
  }, {
    "name" : "@ocm",
    "type" : "Tag",
    "location" : {
      "line" : 19,
      "column" : 12
    }
  }, {
    "name" : "@connection",
    "type" : "Tag",
    "location" : {
      "line" : 19,
      "column" : 17
    }
  } ]
} , {
  "line" : 20,
  "elements" : [ {
    "line" : 24,
    "name" : "",
    "description" : "",
    "type" : "background",
    "keyword" : "Background",
    "steps" : [ {
      "result" : {
        "duration" : 3558408145,
        "status" : "passed"
      },
      "line" : 25,
      "name" : "we are testing the OCM Api",
      "match" : {
        "location" : "RestGeneralStepDefinitions.we_are_testing_the_OCM_api()"
      },
      "keyword" : "Given "
    } ]
  }, {
    "start_timestamp" : "2022-06-17T13:59:54.904Z",
    "before" : [ {
      "result" : {
        "duration" : 3064929201,
        "status" : "passed"
      },
      "match" : {
        "location" : "GeneralStepDefinitions.beforeScenario(Scenario)"
      }
    } ],
    "line" : 34,
    "name" : "OCM - Try to get connection by providing invalid connectionID - dasdasdas - Negative",
    "description" : "",
    "id" : "api---ocm---connection---v1---connections---connectionid-get;ocm---try-to-get-connection-by-providing-invalid-connectionid---<connid>---negative;;2",
    "after" : [ {
      "result" : {
        "duration" : 8951771,
        "status" : "passed"
      },
      "match" : {
        "location" : "GeneralStepDefinitions.afterScenario()"
      }
    } ],
    "type" : "scenario",
    "keyword" : "Scenario Outline",
    "steps" : [ {
      "result" : {
        "duration" : 7122406244,
        "status" : "passed"
      },
      "line" : 29,
      "name" : "an administrator fetches connection with connectionId {dasdasdas}",
      "match" : {
        "arguments" : [ {
          "val" : "dasdasdas",
          "offset" : 55
        } ],
        "location" : "ConnectionStepDefinitions.an_administrator_fetches_all_the_connections_via_OCM_api(String)"
      },
      "keyword" : "Given "
    }, {
      "result" : {
        "duration" : 195809434,
        "status" : "passed"
      },
      "line" : 30,
      "name" : "the field {statusCode} contains the value {404}",
      "match" : {
        "arguments" : [ {
          "val" : "statusCode",
          "offset" : 11
        }, {
          "val" : "404",
          "offset" : 43
        } ],
        "location" : "GeneralStepDefinitions.the_field_contains_the_value_(String,String)"
      },
      "keyword" : "Then "
    }, {
      "result" : {
        "duration" : 281301,
        "status" : "passed"
      },
      "line" : 31,
      "name" : "the field {message} contains the value {No Data found}",
      "match" : {
        "arguments" : [ {
          "val" : "message",
          "offset" : 11
        }, {
          "val" : "No Data found",
          "offset" : 40
        } ],
        "location" : "GeneralStepDefinitions.the_field_contains_the_value_(String,String)"
      },
      "keyword" : "Then "
    } ],
    "tags" : [ {
      "name" : "@rest"
    }, {
      "name" : "@all"
    }, {
      "name" : "@ocm"
    }, {
      "name" : "@connection"
    }, {
      "name" : "@connections"
    }, {
      "name" : "@negative"
    } ]
  } ],
  "name" : "API - OCM - connection - v1 - connections - connectionId GET",
  "description" : "  This request is used to fetch connection information for the connection id provided in URL.\n  It also provides state of the connection established.",
  "id" : "api---ocm---connection---v1---connections---connectionid-get",
  "keyword" : "Feature",
  "uri" : "file:src/test/resources/features/ocm/connection/v1/connections/%7BconnectionId%7D/GET.feature",
  "tags" : [ {
    "name" : "@rest",
    "type" : "Tag",
    "location" : {
      "line" : 19,
      "column" : 1
    }
  }, {
    "name" : "@all",
    "type" : "Tag",
    "location" : {
      "line" : 19,
      "column" : 7
    }
  }, {
    "name" : "@ocm",
    "type" : "Tag",
    "location" : {
      "line" : 19,
      "column" : 12
    }
  }, {
    "name" : "@connection",
    "type" : "Tag",
    "location" : {
      "line" : 19,
      "column" : 17
    }
  } ]
} , {
  "line" : 20,
  "elements" : [ {
    "line" : 23,
    "name" : "",
    "description" : "",
    "type" : "background",
    "keyword" : "Background",
    "steps" : [ {
      "result" : {
        "duration" : 3540210953,
        "status" : "passed"
      },
      "line" : 24,
      "name" : "we are testing the OCM Api",
      "match" : {
        "location" : "RestGeneralStepDefinitions.we_are_testing_the_OCM_api()"
      },
      "keyword" : "Given "
    } ]
  }, {
    "start_timestamp" : "2022-06-17T13:59:55.103Z",
    "before" : [ {
      "result" : {
        "duration" : 2764959645,
        "status" : "passed"
      },
      "match" : {
        "location" : "GeneralStepDefinitions.beforeScenario(Scenario)"
      }
    } ],
    "line" : 42,
    "name" : "OCM - GET all connections with pagination out of bounds - negative",
    "description" : "",
    "id" : "api---ocm---connection---v1---connections-get;ocm---get-all-connections-with-pagination-out-of-bounds---negative",
    "after" : [ {
      "result" : {
        "duration" : 1760813,
        "status" : "passed"
      },
      "match" : {
        "location" : "GeneralStepDefinitions.afterScenario()"
      }
    } ],
    "type" : "scenario",
    "keyword" : "Scenario",
    "steps" : [ {
      "result" : {
        "duration" : 7105319891,
        "status" : "passed"
      },
      "line" : 43,
      "name" : "an administrator fetches all the connections with pageSize {9999} and page {9999} via OCM api",
      "match" : {
        "arguments" : [ {
          "val" : "9999",
          "offset" : 60
        }, {
          "val" : "9999",
          "offset" : 76
        } ],
        "location" : "ConnectionStepDefinitions.an_administrator_fetches_all_the_connections_with_pageSize_and_page_via_OCM_api(String,String)"
      },
      "keyword" : "Given "
    }, {
      "result" : {
        "duration" : 187442387,
        "status" : "passed"
      },
      "line" : 44,
      "name" : "the field {statusCode} contains the value {200}",
      "match" : {
        "arguments" : [ {
          "val" : "statusCode",
          "offset" : 11
        }, {
          "val" : "200",
          "offset" : 43
        } ],
        "location" : "GeneralStepDefinitions.the_field_contains_the_value_(String,String)"
      },
      "keyword" : "Then "
    }, {
      "result" : {
        "duration" : 1566165302,
        "status" : "passed"
      },
      "line" : 45,
      "name" : "the response is valid according to the {Connection_GetConnections_schema.json} REST schema",
      "match" : {
        "arguments" : [ {
          "val" : "Connection_GetConnections_schema.json",
          "offset" : 40
        } ],
        "location" : "RestGeneralStepDefinitions.the_response_is_valid_according_to_the_REST_schema(String)"
      },
      "keyword" : "And "
    }, {
      "result" : {
        "duration" : 271468,
        "status" : "passed"
      },
      "line" : 46,
      "name" : "the field {message} contains the value {Connections fetch successfully}",
      "match" : {
        "arguments" : [ {
          "val" : "message",
          "offset" : 11
        }, {
          "val" : "Connections fetch successfully",
          "offset" : 40
        } ],
        "location" : "GeneralStepDefinitions.the_field_contains_the_value_(String,String)"
      },
      "keyword" : "Then "
    }, {
      "result" : {
        "duration" : 11915606,
        "status" : "passed"
      },
      "line" : 47,
      "name" : "the field {$.data.records} contains {0} elements",
      "match" : {
        "arguments" : [ {
          "val" : "$.data.records",
          "offset" : 11
        }, {
          "val" : "0",
          "offset" : 37
        } ],
        "location" : "GeneralStepDefinitions.the_field_contains_elements(String,int)"
      },
      "keyword" : "And "
    } ],
    "tags" : [ {
      "name" : "@rest"
    }, {
      "name" : "@all"
    }, {
      "name" : "@ocm"
    }, {
      "name" : "@connection"
    }, {
      "name" : "@connections"
    }, {
      "name" : "@negative"
    } ]
  } ],
  "name" : "API - OCM - connection - v1 - connections GET",
  "description" : "  This request fetches the connection information against the provided participantDID otherwise all the connections are fetched.",
  "id" : "api---ocm---connection---v1---connections-get",
  "keyword" : "Feature",
  "uri" : "file:src/test/resources/features/ocm/connection/v1/connections/GET.feature",
  "tags" : [ {
    "name" : "@rest",
    "type" : "Tag",
    "location" : {
      "line" : 19,
      "column" : 1
    }
  }, {
    "name" : "@all",
    "type" : "Tag",
    "location" : {
      "line" : 19,
      "column" : 7
    }
  }, {
    "name" : "@ocm",
    "type" : "Tag",
    "location" : {
      "line" : 19,
      "column" : 12
    }
  }, {
    "name" : "@connection",
    "type" : "Tag",
    "location" : {
      "line" : 19,
      "column" : 17
    }
  } ]
} , {
  "line" : 20,
  "elements" : [ {
    "line" : 23,
    "name" : "",
    "description" : "",
    "type" : "background",
    "keyword" : "Background",
    "steps" : [ {
      "result" : {
        "duration" : 3378458397,
        "status" : "passed"
      },
      "line" : 24,
      "name" : "we are testing the OCM Api",
      "match" : {
        "location" : "RestGeneralStepDefinitions.we_are_testing_the_OCM_api()"
      },
      "keyword" : "Given "
    } ]
  }, {
    "start_timestamp" : "2022-06-17T13:59:55.720Z",
    "before" : [ {
      "result" : {
        "duration" : 2848607237,
        "status" : "passed"
      },
      "match" : {
        "location" : "GeneralStepDefinitions.beforeScenario(Scenario)"
      }
    } ],
    "line" : 34,
    "name" : "OCM - GET all connections with pagination - Positive",
    "description" : "",
    "id" : "api---ocm---connection---v1---connections-get;ocm---get-all-connections-with-pagination---positive",
    "after" : [ {
      "result" : {
        "duration" : 1238112,
        "status" : "passed"
      },
      "match" : {
        "location" : "GeneralStepDefinitions.afterScenario()"
      }
    } ],
    "type" : "scenario",
    "keyword" : "Scenario",
    "steps" : [ {
      "result" : {
        "duration" : 7209187377,
        "status" : "passed"
      },
      "line" : 35,
      "name" : "an administrator fetches all the connections with pageSize {5} and page {1} via OCM api",
      "match" : {
        "arguments" : [ {
          "val" : "5",
          "offset" : 60
        }, {
          "val" : "1",
          "offset" : 73
        } ],
        "location" : "ConnectionStepDefinitions.an_administrator_fetches_all_the_connections_with_pageSize_and_page_via_OCM_api(String,String)"
      },
      "keyword" : "Given "
    }, {
      "result" : {
        "duration" : 232274515,
        "status" : "passed"
      },
      "line" : 36,
      "name" : "the field {statusCode} contains the value {200}",
      "match" : {
        "arguments" : [ {
          "val" : "statusCode",
          "offset" : 11
        }, {
          "val" : "200",
          "offset" : 43
        } ],
        "location" : "GeneralStepDefinitions.the_field_contains_the_value_(String,String)"
      },
      "keyword" : "Then "
    }, {
      "result" : {
        "duration" : 1363592529,
        "status" : "passed"
      },
      "line" : 37,
      "name" : "the response is valid according to the {Connection_GetConnections_schema.json} REST schema",
      "match" : {
        "arguments" : [ {
          "val" : "Connection_GetConnections_schema.json",
          "offset" : 40
        } ],
        "location" : "RestGeneralStepDefinitions.the_response_is_valid_according_to_the_REST_schema(String)"
      },
      "keyword" : "And "
    }, {
      "result" : {
        "duration" : 411075,
        "status" : "passed"
      },
      "line" : 38,
      "name" : "the field {message} contains the value {Connections fetch successfully}",
      "match" : {
        "arguments" : [ {
          "val" : "message",
          "offset" : 11
        }, {
          "val" : "Connections fetch successfully",
          "offset" : 40
        } ],
        "location" : "GeneralStepDefinitions.the_field_contains_the_value_(String,String)"
      },
      "keyword" : "Then "
    }, {
      "result" : {
        "duration" : 11045082,
        "status" : "passed"
      },
      "line" : 39,
      "name" : "the field {$.data.records} contains {5} elements",
      "match" : {
        "arguments" : [ {
          "val" : "$.data.records",
          "offset" : 11
        }, {
          "val" : "5",
          "offset" : 37
        } ],
        "location" : "GeneralStepDefinitions.the_field_contains_elements(String,int)"
      },
      "keyword" : "And "
    } ],
    "tags" : [ {
      "name" : "@rest"
    }, {
      "name" : "@all"
    }, {
      "name" : "@ocm"
    }, {
      "name" : "@connection"
    }, {
      "name" : "@connections"
    } ]
  } ],
  "name" : "API - OCM - connection - v1 - connections GET",
  "description" : "  This request fetches the connection information against the provided participantDID otherwise all the connections are fetched.",
  "id" : "api---ocm---connection---v1---connections-get",
  "keyword" : "Feature",
  "uri" : "file:src/test/resources/features/ocm/connection/v1/connections/GET.feature",
  "tags" : [ {
    "name" : "@rest",
    "type" : "Tag",
    "location" : {
      "line" : 19,
      "column" : 1
    }
  }, {
    "name" : "@all",
    "type" : "Tag",
    "location" : {
      "line" : 19,
      "column" : 7
    }
  }, {
    "name" : "@ocm",
    "type" : "Tag",
    "location" : {
      "line" : 19,
      "column" : 12
    }
  }, {
    "name" : "@connection",
    "type" : "Tag",
    "location" : {
      "line" : 19,
      "column" : 17
    }
  } ]
} , {
  "line" : 20,
  "elements" : [ {
    "line" : 23,
    "name" : "",
    "description" : "",
    "type" : "background",
    "keyword" : "Background",
    "steps" : [ {
      "result" : {
        "duration" : 3454270239,
        "status" : "passed"
      },
      "line" : 24,
      "name" : "we are testing the OCM Api",
      "match" : {
        "location" : "RestGeneralStepDefinitions.we_are_testing_the_OCM_api()"
      },
      "keyword" : "Given "
    } ]
  }, {
    "start_timestamp" : "2022-06-17T13:59:55.559Z",
    "before" : [ {
      "result" : {
        "duration" : 2820806103,
        "status" : "passed"
      },
      "match" : {
        "location" : "GeneralStepDefinitions.beforeScenario(Scenario)"
      }
    } ],
    "line" : 27,
    "name" : "OCM - GET all connections - Positive",
    "description" : "",
    "id" : "api---ocm---connection---v1---connections-get;ocm---get-all-connections---positive",
    "after" : [ {
      "result" : {
        "duration" : 905282,
        "status" : "passed"
      },
      "match" : {
        "location" : "GeneralStepDefinitions.afterScenario()"
      }
    } ],
    "type" : "scenario",
    "keyword" : "Scenario",
    "steps" : [ {
      "result" : {
        "duration" : 6824042426,
        "status" : "passed"
      },
      "line" : 28,
      "name" : "an administrator fetches all the connections via OCM api",
      "match" : {
        "location" : "ConnectionStepDefinitions.an_administrator_fetches_all_the_connections_via_OCM_api()"
      },
      "keyword" : "Given "
    }, {
      "result" : {
        "duration" : 218384760,
        "status" : "passed"
      },
      "line" : 29,
      "name" : "the field {statusCode} contains the value {200}",
      "match" : {
        "arguments" : [ {
          "val" : "statusCode",
          "offset" : 11
        }, {
          "val" : "200",
          "offset" : 43
        } ],
        "location" : "GeneralStepDefinitions.the_field_contains_the_value_(String,String)"
      },
      "keyword" : "Then "
    }, {
      "result" : {
        "duration" : 1528485130,
        "status" : "passed"
      },
      "line" : 30,
      "name" : "the response is valid according to the {Connection_GetConnections_schema.json} REST schema",
      "match" : {
        "arguments" : [ {
          "val" : "Connection_GetConnections_schema.json",
          "offset" : 40
        } ],
        "location" : "RestGeneralStepDefinitions.the_response_is_valid_according_to_the_REST_schema(String)"
      },
      "keyword" : "And "
    }, {
      "result" : {
        "duration" : 546622,
        "status" : "passed"
      },
      "line" : 31,
      "name" : "the field {message} contains the value {Connections fetch successfully}",
      "match" : {
        "arguments" : [ {
          "val" : "message",
          "offset" : 11
        }, {
          "val" : "Connections fetch successfully",
          "offset" : 40
        } ],
        "location" : "GeneralStepDefinitions.the_field_contains_the_value_(String,String)"
      },
      "keyword" : "Then "
    } ],
    "tags" : [ {
      "name" : "@rest"
    }, {
      "name" : "@all"
    }, {
      "name" : "@ocm"
    }, {
      "name" : "@connection"
    }, {
      "name" : "@connections"
    } ]
  } ],
  "name" : "API - OCM - connection - v1 - connections GET",
  "description" : "  This request fetches the connection information against the provided participantDID otherwise all the connections are fetched.",
  "id" : "api---ocm---connection---v1---connections-get",
  "keyword" : "Feature",
  "uri" : "file:src/test/resources/features/ocm/connection/v1/connections/GET.feature",
  "tags" : [ {
    "name" : "@rest",
    "type" : "Tag",
    "location" : {
      "line" : 19,
      "column" : 1
    }
  }, {
    "name" : "@all",
    "type" : "Tag",
    "location" : {
      "line" : 19,
      "column" : 7
    }
  }, {
    "name" : "@ocm",
    "type" : "Tag",
    "location" : {
      "line" : 19,
      "column" : 12
    }
  }, {
    "name" : "@connection",
    "type" : "Tag",
    "location" : {
      "line" : 19,
      "column" : 17
    }
  } ]
} ]