{
  "definitions": {},
  "$schema": "http://json-schema.org/draft-06/schema#",
  "type": "object",
  "required": [
    "status",
    "code",
    "data"
  ],
  "properties": {
    "status": {
      "type": "string"
    },
    "code": {
      "type": "string"
    },
    "data": {
      "type": "object",
      "required": [
        "channelname",
        "currentBlockHash",
        "err",
        "nbBlocks",
        "peers",
        "previousBlockHash"
      ],
      "properties": {
        "channelname": {
          "type": "string"
        },
        "currentBlockHash": {
          "type": "string"
        },
        "nbBlocks": {
          "type": "string"
        },
        "peers": {
          "type": "array",
          "items": {
            "type": "object",
            "required": [
              "name",
              "url"
            ],
            "properties": {
              "name": {
                "type": "string"
              },
              "url": {
                "type": "string"
              }
            }
          }
        },
        "previousBlockHash": {
          "type": "string"
        }
      }
    }
  }
}