{
  "missing_guarded": {
    "entityUUID": "80e41b47-d8cc-44a2-b696-59a0e1d19a60"
  },
  "empty_guarded": {
    "guardedUUID": "",
    "entityUUID": "80e41b47-d8cc-44a2-b696-59a0e1d19a60"
  },
  "invalid_uuid_guarded": {
    "guardedUUID": "80e41b47-d8cc-44a2-b696",
    "entityUUID": "80e41b47-d8cc-44a2-b696-59a0e1d19a60"
  },
  "missing_entityuuid": {
    "guardedUUID": "80e41b47-d8cc-44a2-b696-59a0e1d19a60"
  },
  "empty_entityuuid": {
    "guardedUUID": "80e41b47-d8cc-44a2-b696-59a0e1d19a60",
    "entityUUID": ""
  },
  "invalid_uuid_entityuuid": {
    "guardedUUID": "80e41b47-d8cc-44a2-b696-59a0e1d19a60",
    "entityUUID": "80e41b47-d8cc-44a2-b696"
  },
  "non_existing_uuid": {
    "guardedUUID": "5fa2c680-850b-11e8-adc0-fa7ae01bbebc",
    "entityUUID": "5fa2cb76-850b-11e8-adc0-fa7ae01bbebc"
  }
}