{
    "@context": [
        "https://www.w3.org/2018/credentials/v1"
    ],
    "@id": "did:web:dufourstorage.provider.gaia-x.community:participant:1225ed1cc7755bc5867413f1ca1cf99eb66d4f7a148e10e346390c4bb302f649/vp/dd47522082036c50c6608c13a10df715feefc3dac4743e305b2db209e1ee199f/data.json",
    "@type": [
        "VerifiablePresentation"
    ],
    "verifiableCredential": [
        {
            "@context": [
                "https://www.w3.org/2018/credentials/v1"
            ],
            "type": [
                "VerifiableCredential",
                "LegalPerson"
            ],
            "id": "https://abc-federation.gaia-x.community/public-data/participant.json",
            "issuer": "did:web:abc-federation.dev.gaiax.ovh",
            "credentialSubject": {
                "id": "did:web:abc-federation.gaia-x.community/public-data/participant.json",
                "type": "gx-participant:Participant",
                "gx-participant:name": "Fictive federation using Gaia-X federation services",
                "gx-participant:legalName": "ABC federation",
                "gx-participant:registrationNumber": {
                    "gx-participant:registrationNumberType": "local",
                    "gx-participant:registrationNumberNumber": "0762747721"
                },
                "gx-participant:headquarterAddress": {
                    "gx-participant:addressCountryCode": "BE",
                    "gx-participant:addressCode": "BE-BRU",
                    "gx-participant:street-address": "Avenue des Arts 6-9",
                    "gx-participant:postal-code": "1210"
                },
                "gx-participant:legalAddress": {
                    "gx-participant:addressCountryCode": "BE",
                    "gx-participant:addressCode": "BE-BRU",
                    "gx-participant:street-address": "Avenue des Arts 6-9",
                    "gx-participant:postal-code": "1210"
                },
                "gx-participant:termsAndConditions": "70c1d713215f95191a11d38fe2341faed27d19e083917bc8732ca4fea4976700"
            },
            "issuanceDate": "2023-04-18T15:31:02.832664+00:00",
            "proof": {
                "type": "JsonWebSignature2020",
                "proofPurpose": "assertionMethod",
                "verificationMethod": "did:web:abc-federation.dev.gaiax.ovh",
                "created": "2023-04-18T15:31:02.832664+00:00",
                "jws": "eyJhbGciOiAiUFMyNTYiLCJiNjQiOmZhbHNlLCJjcml0IjpbImI2NCJdfQ..TUHorvkm_lwsEZOO832U4wgppX_ZDzvz02iyDdiYDfu7ADy07YSDnJfdCCaEIMyFzbTr1tCAjZEAdStXusT63y5MpyqKwZRnXIddyoodThouAyNsGPPdgfnI_ZnVu131E9XXPgHv6Jp3da597x46OJa7I9RYS4NT-Bjxslc1JvEMS1MtlIVI7zzmEb79SBJdH_0xH4RjsLeiocePhRgyscqoXdapfsrmpDpqeoiP3OIsVvD2Gx_bRG5HGPBpg5VEWNqiBEK9UaHT_Hb_ZU1QNwf1rUEnw4G1r46unusoeUdftEIC9zQIellcg0o0Iiie_L8x4_M7CGNhPVVJg72D2Q"
            }
        }
    ]
}