{
    "@context": [
        "https://www.w3.org/2018/credentials/v1"
    ],
    "@id": "did:web:abc-federation.gaia-x.community:participant:8121245b25bda4bd0eac915fc50319f9752d6d2e9eb4a16c7bf76dcc67c0eda3/third-party-compliance-certificate-credential/ed1a20f90108850754b5ab1575b38b3652881859b3966b7701275173a1d9514d/data.json",
    "issuer": "did:web:abc-federation.dev.gaiax.ovh",
    "@type": [
        "VerifiableCredential",
        "ThirdPartyComplianceCertificateCredential"
    ],
    "credentialSubject": {
        "@id": "did:web:abc-federation.gaia-x.community:participant:8121245b25bda4bd0eac915fc50319f9752d6d2e9eb4a16c7bf76dcc67c0eda3/third-party-compliance-certificate-claim/7def2eb9cd7d7ac7bda07856d15bb4e01e89d0d2b8bff793a01934cfd8aaaf8f/data.json",
        "@type": "gax-compliance:ThirdPartyComplianceCertificateClaim",
        "@context": {
            "gax-compliance": "https://schemas.abc-federation.gaia-x.community/wip/vocab/compliance#",
            "gax-participant": "https://schemas.abc-federation.gaia-x.community/wip/vocab/participant#"
        },
        "isValid": {
            "@value": "True"
        }
    }
}