{
    "@context": [
        "https://www.w3.org/2018/credentials/v1"
    ],
    "@id": "did:web:dufourstorage.provider.gaia-x.community:participant:1225ed1cc7755bc5867413f1ca1cf99eb66d4f7a148e10e346390c4bb302f649/self-assessed-compliance-criteria-credential/aef57137b79a1f88a0761dc640ac2868c7daa75b691d34fd5cddf04a2e19c69d/data.json",
    "issuer": "did:web:abc-federation.dev.gaiax.ovh",
    "@type": [
        "VerifiableCredential",
        "SelfAssessedComplianceCriteriaCredential"
    ],
    "credentialSubject": {
        "@id": "did:web:dufourstorage.provider.gaia-x.community:participant:1225ed1cc7755bc5867413f1ca1cf99eb66d4f7a148e10e346390c4bb302f649/self-assessed-compliance-criteria-credential/aef57137b79a1f88a0761dc640ac2868c7daa75b691d34fd5cddf04a2e19c69d/data.json",
        "@type": "SelfAssessedComplianceCriteriaCredential",
        "@context": {
            "gax-compliance": "https://schemas.abc-federation.gaia-x.community/wip/vocab/compliance#",
            "gax-participant": "https://schemas.abc-federation.gaia-x.community/wip/vocab/participant#"
        },
        "gax-compliance:credentialSubject": "did:web:dufourstorage.provider.gaia-x.community:participant:1225ed1cc7755bc5867413f1ca1cf99eb66d4f7a148e10e346390c4bb302f649/self-assessed-compliance-criteria-claim/883a42443e35fc759830e9a748b91069090ab56aad3a75bb0aab506fce932b99/data.json",
        "gax-compliance:isValid": {
            "@value": "True"
        }
    }
}