{
  "openapi": "3.0.3",
  "info": {
    "title": "Smart Contract Manager",
    "description": "Smart contract manager",
    "version": "1.0.0"
  },
  "externalDocs": {
    "description": "Github",
    "url": "https://gitlab.com/gaia-x/data-infrastructure-federation-services/deployment-scenario/smart-contract-manager"
  },
  "servers": [
    {
      "url": "http://localhost:4000"
    }
  ],
  "tags": [
    {
      "name": "Smart Contracts",
      "description": "Everything about your sc"
    }
  ],
  "paths": {
    "/smartContracts": {
      "post": {
        "tags": [
          "Smart Contracts"
        ],
        "summary": "Generate smarts contracts from ODRL",
        "description": "Generate smarts contracts from ODRL",
        "requestBody": {
          "description": "Create smart contracts from odrl",
          "content": {
            "application/json": {
              "schema": {
                "$ref": "#/components/schemas/scgen"
              }
            }
          },
          "required": true
        },
        "responses": {
          "200": {
            "description": "Successful operation",
            "content": {
              "application/json": {
                "schema": {
                  "$ref": "#/components/schemas/scgen"
                }
              }
            }
          },
          "400": {
            "description": "Invalid input"
          }
        }
      },
      "get": {
        "tags": [
          "Smart Contracts"
        ],
        "summary": "Get datas from smart contract in registry",
        "description": "Get datas from smart contract in registry. Either provide address or ContractDId and label",
        "parameters": [
          {
            "name": "address",
            "in": "query",
            "required": false,
            "schema": {
              "type": "string"
            }
          },
          {
            "name": "contractDId",
            "in": "query",
            "required": false,
            "schema": {
              "type": "string"
            }
          },
          {
            "name": "label",
            "in": "query",
            "required": false,
            "schema": {
              "type": "string"
            }
          }
        ],
        "responses": {
          "200": {
            "description": "Successful operation",
            "content": {
              "application/json": {
                "schema": {
                  "$ref": "#/components/schemas/getSmartContractsData"
                }
              }
            }
          },
          "400": {
            "description": "Invalid input"
          }
        }
      }
    }
  },
  "components": {
    "schemas": {
      "scgen": {
        "type": "object",
        "properties": {
          "odrl": {
            "type": "object",
            "example": {
              "smartContractsToGenerate": [
                "consumption", "billing", "payment"
              ],
              "VC": {
                "type": [
                  "VerifiableCredential",
                  "ContractCredential"
                ],
                "@context": [
                  "https://schema-registry.aster-x.demo23.gxfs.fr/contexts/jws-2020",
                  "https://schema-registry.aster-x.demo23.gxfs.fr/contexts/credentials"
                ],
                "id": "did:web:aster-x.demo23.gxfs.fr:d40fccec-ff23-4675-92df-eb04c9cb86ae:data.json",
                "issuer": "did:web:aster-x.demo23.gxfs.fr",
                "issuanceDate": "2023-12-20T16:11:56.656Z",
                "validFrom": "2023-12-20T16:11:56.656Z",
                "expirationDate": "2024-12-20T16:11:56.656Z",
                "proof": {
                  "type": "JsonWebSignature2020",
                  "created": "2023-12-20T16:11:56.656Z",
                  "proofPurpose": "assertionMethod",
                  "verificationMethod": "did:web:aster-x.demo23.gxfs.fr",
                  "jws": "eyJhbGciOiJQUzI1NiIsImI2NCI6ZmFsc2UsImNyaXQiOlsiYjY0Il19..dLOswgi-NSviRFK4luCjPOil-00gLuF791gYa1TNnfu7wvsL-sokLmmgjtHCTqZTZb5pnrFneY0ScRfmoQbeDh_H7HBmATGIq0N7p30XnPPpU8wCpnKIl9VwXHoAH5Ie-tmTpHkwGJJENSr0ocOFFmshMbVihfsEvwExTrr6Y5wfoEU0GmkReRDSfRT7Zy5i8-4f9vE3UrvJCazCuilekY-83DPGE1IzS4Kpr9ZJP8Y6L7VK9A-_TZKn98qdHgVgZBdvwlO__IRh2NMkIk8Pqf0jEDgh2W-1mBA72xjsRgTjeOv43l1V1KWPsYPxGJsJH0JxEYeiJIFGyKA-wLvDrg"
                },
                "credentialSchema": {
                  "id": "https://registry.abc-federation.dev.gaiax.ovh/api/trusted-schemas-registry/v2/schemas/ContractCredential",
                  "type": "FullJsonSchemaValidator2021"
                },
                "credentialSubject": {
                  "id": "did:web:aster-x.demo23.gxfs.fr",
                  "gx-signature:participants": [
                    {
                      "gx-signature:did": "provider.agdatahub@proton.me",
                      "gx-signature:email": "yvan-wilfried.mbe-tene@softeam.fr"
                    },
                    {
                      "gx-signature:did": "jeremy.hirth-daumas@softeam.fr",
                      "gx-signature:email": "jeremy.hirth-daumas@softeam.fr"
                    }
                  ],
                  "gx-signature:links": [
                    {
                      "gx-signature:documentId": 64817,
                      "gx-signature:documentName": "terms_and_conditions.pdf",
                      "gx-signature:documentOriginalName": "terms_and_conditions.pdf",
                      "gx-signature:documentLink": "https://www.contralia.fr/eDoc/user-api/document/view?token=UD2c969ea18c1a5dc3018c87fe2d202496-27937148950314067225"
                    },
                    {
                      "gx-signature:documentId": 49932,
                      "gx-signature:documentName": "ODRL.pdf",
                      "gx-signature:documentOriginalName": "ODRL.pdf",
                      "gx-signature:documentLink": "https://www.contralia.fr/eDoc/user-api/document/view?token=UD2c969ea18c1a5dc3018c87fe2d202496-27937148950314067225"
                    }
                  ],
                  "gx:providedBy": "provider.agdatahub@proton.me",
                  "gx:consumedBy": "jeremy.hirth-daumas@softeam.fr",
                  "gx:termOfUsage": "https://example.com/terms-of-usage",
                  "gx:dataUsage": "https://example.com/data-usage",
                  "gx:notarizedIn": "https://example.com/notarizedIn",
                  "gx:dataProduct": {
                    "@context": [
                      "https://schema-registry.aster-x.demo23.gxfs.fr/contexts/credentials",
                      "https://schema-registry.aster-x.demo23.gxfs.fr/contexts/jws-2020"
                    ],
                    "@type": [
                      "VerifiableCredential"
                    ],
                    "@id": "did:web:agdatahub.provider.demo23.gxfs.fr:participant:eb06c24ac31a16b5f29316b388a742f2487ab626b5d22f23184ea7e8c3a3ed5b/vc/65b155f2810b649b9728a4eaf9239437b1bc34b1961998718080fafbcb3722a9/data.json",
                    "issuer": "did:web:agdatahub.provider.demo23.gxfs.fr",
                    "credentialSubject": {
                      "id": "did:web:agdatahub.provider.demo23.gxfs.fr:participant:eb06c24ac31a16b5f29316b388a742f2487ab626b5d22f23184ea7e8c3a3ed5b/vc/4203ae956f00530e5d68d157949dd3d0a6f07fcff21f3487e730785d53bc1e89/data.json",
                      "type": "gx:ServiceOffering",
                      "gx:providedBy": {
                        "id": "did:web:agdatahub.provider.demo23.gxfs.fr:participant:eb06c24ac31a16b5f29316b388a742f2487ab626b5d22f23184ea7e8c3a3ed5b/data.json"
                      },
                      "gx:termsAndConditions": {
                        "gx:URL": "https://icp-credentialissuer.aster-x.demo23.gxfs.fr/.well-known/TaureauxDeMontePublique",
                        "gx:hash": "c2c8bd85df0023cf7719def1a401b8fe076dacf5d61dc844080322d19ee309d9"
                      },
                      "gx:name": "Taureaux de Monte Publique : déclarations officielles",
                      "aster-conformity:layer": "IAAS",
                      "gx:keyword": [
                        "Data Product"
                      ],
                      "gx:description": "Cette offre propose les données administratives des taureaux déclarés auprès de l’Institut de l’Elevage pour la monte publique. Elle contient les données d’identité, de parenté et de déclarations des taureaux avec leur période de validité, conformément à la réglementation. Le fichier est mis à jour hebdomadairement. Certains taureaux faisant l’objet déclarations complémentaires, un même taureau peut apparaître plusieurs fois dans le fichier.",
                      "gx:descriptionMarkDown": "",
                      "gx:webAddress": "",
                      "gx:dataProtectionRegime": [
                        "GDPR2016"
                      ],
                      "gx:dataAccountExport": [
                        {
                          "gx:requestType": "email",
                          "gx:accessType": "digital",
                          "gx:formatType": "mime/png"
                        }
                      ],
                      "gx:isAvailableOn": [
                        ""
                      ],
                      "gx:policy": "default: allow",
                      "@context": [
                        "https://registry.lab.gaia-x.eu/development/api/trusted-shape-registry/v1/shapes/jsonld/trustframework#",
                        "https://schema-registry.aster-x.demo23.gxfs.fr/contexts/aster-conformity"
                      ],
                      "gx-data:dataDomains": "",
                      "gx-data:dataController": "",
                      "gx-data:consent": "",
                      "gx:policies": "",
                      "gx-data:obsoleteDateTime": null,
                      "gx-data:expirationDateTime": null,
                      "gx:aggregationOf": [
                        {
                          "dct:identifier": "./dataSet/dataset01",
                          "dct:title": "dataset01",
                          "gx:description": "",
                          "gx:copyrightOwnedBy": [
                            "France Génétique Elevage"
                          ],
                          "gx:personalDataPolicy": "",
                          "gx:expirationDateTime": null,
                          "gx:obsoleteDateTime": null,
                          "dct:distribution": [
                            {
                              "title": "2023100820231014-TaureauxMP",
                              "dct:format": "csv",
                              "dcat:byteSize": "5319062",
                              "gx:location": "https://platform.api-agro.eu/members/products/data-offerings/a01ed1fbd27245fa85bc9cec23a3e297/view",
                              "gx:hash": "",
                              "gx:hashAlgorithm": "None",
                              "gx:expirationDateTime": null,
                              "gx:obsoleteDateTime": null
                            }
                          ]
                        }
                      ]
                    },
                    "issuanceDate": "2023-11-07T12:20:57.161303+00:00",
                    "proof": {
                      "type": "JsonWebSignature2020",
                      "proofPurpose": "assertionMethod",
                      "verificationMethod": "did:web:agdatahub.provider.demo23.gxfs.fr",
                      "created": "2023-11-07T12:20:57.161303+00:00",
                      "jws": "eyJhbGciOiAiUFMyNTYiLCAiYjY0IjogZmFsc2UsICJjcml0IjogWyJiNjQiXX0..WCn13wS8pZMsYJcC2tXdZXn385PauLGRvHVLBXSl5Va_C7QP-6NNugswDMOoX36x-bkjkrn4zc4Itse4zu00EEZH9S5nfHbThfWYvBkKiLhk3A8Y6AWTievWeL-aC7FSqDTqn8yT17v8DCxm_HJyUyRaGCSHjKhgAxDDwRkXeiNqZYn1M1nR-5Uyakivve4U1Ffj6kNWjFEJ-k7DqoywZGQnGvAf-B1aoTSAsErJ9dNlKdPe4bFAE9yc0trjhBKToINdbwRE5TJ-UldAbjiHZfFhMJ8dFqF0zyym-L8X6exaRLNV6HaU0K_wTX6FH1HYPcb2QSwVmnYDHV_BSoxg0Q"
                    }
                  },
                  "odrl:hasPolicy": {
                    "@context": "https://www.w3.org/ns/odrl.jsonld",
                    "@type": "Set",
                    "uid": "https://agdatahub.provider.demo23.gxfs.fr/policy:1",
                    "nomService": "agdatahub",
                    "permission": [
                      {
                        "target": "https://minio.demo23.gxfs.fr/dataproduct/dataproduct01",
                        "assignee": "Data Subscriber",
                        "action": "use",
                        "duty": [
                          {
                            "assigner": "Data Provider Inc.",
                            "assignee": "Data Subscriber",
                            "action": [
                              {
                                "rdf:value": {
                                  "@id": "odrl:compensate"
                                },
                                "refinement": [
                                  {
                                    "leftOperand": "payAmount",
                                    "operator": "eq",
                                    "rightOperand": {
                                      "@value": "135.00",
                                      "@type": "xsd:decimal"
                                    },
                                    "unit": "http://dbpedia.org/resource/Euro"
                                  },
                                  {
                                    "leftOperand": "timeInterval",
                                    "operator": "eq",
                                    "rightOperand": "PT60S"
                                  },
                                  {
                                    "leftOperand": "payMethod",
                                    "operator": "eq",
                                    "rightOperand": "creditCard"
                                  },
                                  {
                                    "leftOperand": "paySolution",
                                    "operator": "eq",
                                    "rightOperand": "paynum"
                                  },
                                  {
                                    "leftOperand": "creditorCode",
                                    "operator": "eq",
                                    "rightOperand": "gaia-x"
                                  },
                                  {
                                    "leftOperand": "debitorEmail",
                                    "operator": "eq",
                                    "rightOperand": "moez.somai@softeam.fr"
                                  }
                                ]
                              },
                              {
                                "rdf:value": {
                                  "@id": "odrl:billing"
                                },
                              "periodicity":{
                                "leftOperand": "timeInterval",
                                "operator": "eq",
                                "rightOperand": "PT20S"
                              },
                                "refinement": [
                                  [
                                    {
                                      "leftOperand": "type",
                                      "operator": "eq",
                                      "rightOperand": "CSV"
                                    },
                                    {
                                      "leftOperand": "volume",
                                      "operator": "eq",
                                      "rightOperand": {
                                        "@value": "5"
                                      },
                                      "unit": "https://dbpedia.org/page/Gigabyte"
                                    },
                                    {
                                      "leftOperand": "pricePerVolume",
                                      "operator": "eq",
                                      "rightOperand": {
                                        "@value": "10.00",
                                        "@type": "xsd:decimal"
                                      },
                                      "unit": "http://dbpedia.org/resource/Euro"
                                    }
                                  ],
                                  [
                                    {
                                      "leftOperand": "type",
                                      "operator": "eq",
                                      "rightOperand": "XML"
                                    },
                                    {
                                      "leftOperand": "volume",
                                      "operator": "eq",
                                      "rightOperand": {
                                        "@value": "3"
                                      },
                                      "unit": "https://dbpedia.org/page/Gigabyte"
                                    },
                                    {
                                      "leftOperand": "pricePerVolume",
                                      "operator": "eq",
                                      "rightOperand": {
                                        "@value": "15.00",
                                        "@type": "xsd:decimal"
                                      },
                                      "unit": "http://dbpedia.org/resource/Euro"
                                    }
                                  ]
                                ]
                              }
                            ]
                          },
                          {
                            "action": "nextPolicy",
                            "target": "https://agdatahub.provider.demo23.gxfs.fr/policy:1010"
                          }
                        ],
                        "constraint": [
                          {
                            "leftOperand": "dataVolumePerDay",
                            "operator": "lteq",
                            "rightOperand": 5,
                            "unit": "https://dbpedia.org/page/Gigabyte"
                          },
                          {
                            "leftOperand": "dataVolume",
                            "operator": "lteq",
                            "rightOperand": 50,
                            "unit": "https://dbpedia.org/page/Gigabyte"
                          },
                          {
                            "leftOperand": "odrl:spatial",
                            "operator": "isAnyOf",
                            "rightOperand": {
                              "@list": [
                                "Europe",
                                "États-Unis"
                              ]
                            }
                          },
                          {
                            "leftOperand": "odrl:industry",
                            "operator": "isAnyOf",
                            "rightOperand": {
                              "@list": [
                                "Technologie"
                              ]
                            }
                          },
                          {
                            "leftOperand": "odrl:product",
                            "operator": "isAnyOf",
                            "rightOperand": {
                              "@list": [
                                "Données Financières"
                              ]
                            }
                          },
                          {
                            "leftOperand": "dateTime",
                            "operator": "gteq",
                            "rightOperand": {
                              "@value": "2025-09-15",
                              "@type": "xsd:date"
                            }
                          },
                          {
                            "leftOperand": "dateTime",
                            "operator": "lt",
                            "rightOperand": {
                              "@value": "2025-09-15",
                              "@type": "xsd:date"
                            }
                          },
                          {
                            "leftOperand": "fileFormat",
                            "operator": "in",
                            "rightOperand": [
                              "application/pdf",
                              "image/jpeg"
                            ]
                          }
                        ]
                      }
                    ],
                    "obligation": [
                      {
                        "target": "https://minio.demo23.gxfs.fr/dataset/dataset01",
                        "assigner": "Data Subscriber",
                        "assignee": "Data Provider Inc.",
                        "action": "distribute"
                      }
                    ]
                  },
                  "type": "ContractCredential"
                },
                "validUntil": "2024-12-20T16:11:56.656Z",
                "credentialStatus": {
                  "type": "StatusList2021Entry",
                  "id": "https://revocation-registry.aster-x.demo23.gxfs.fr/api/v1/revocations/credentials/default-suspension#841",
                  "statusPurpose": "suspension",
                  "statusListIndex": "841",
                  "statusListCredential": "https://revocation-registry.aster-x.demo23.gxfs.fr/api/v1/revocations/credentials/default-suspension"
                }
              }
            }
          }
        }
      },
      "getSmartContractsData": {
        "type": "object",
        "properties": {
          "address": {
            "type": "string",
            "example": "0xac0974bec39a17e36ba4a6b4d238ff944bacb478cbed5efcae784d7bf4f2ff80"
          }
        }
      }
    }
  }
}