{
  "issuance_key": {
    "type": "jwk",
    "jwk": "{\"kty\":\"OKP\",\"d\":\"mDhpwaH6JYSrD2Bq7Cs-pzmsjlLj4EOhxyI-9DM1mFI\",\"crv\":\"Ed25519\",\"kid\":\"Vzx7l5fh56F3Pf9aR3DECU5BwfrY6ZJe05aiWYWzan8\",\"x\":\"T3T4-u1Xz3vAV2JwPNxWfs4pik_JLiArz_WTCvrCFUM\"}"
  },
  "issuer_did": "did:key:z6MkjoRhq1jSNJdLiruSXrFFxagqrztZaXHqHGUTKJbcNywp", // OPTIONAL
  "vc": {
    "@context": [
      "https://www.w3.org/2018/credentials/v1"
    ],
    "type": [
      "VerifiableCredential",
      "EmployeeCredential"
    ],

    "issuer": {
      "id": "did:key:temporary",
      "name": "Eviden Issuer"
    },
    "credentialSubject": {
      "id": "did:key:123",
      "firstName": "Van Hoan",
      "lastName":"Hoang",
      "team":"Innovation"
    }
  },
  "subject_did":"did:key:z6Mktcw1ZtZv1Cscc8APxUXaase7zaf4zXtmSQhvFWLTwPu2#z6Mktcw1ZtZv1Cscc8APxUXaase7zaf4zXtmSQhvFWLTwPu2",
  "selectiveDisclosure":{
    "fields":{
      "credentialSubject":{
        "sd":false,
        "children":{
          "decoys":2,
          "decoyMode":"FIXED",
          "fields":{
            "team":{
              "sd":true
            }
          }
        }
      }
    }
  }
}