{
  "@context": {
    "@version": 1.1,
    "@protected": true,
    "ThirdPartyComplianceCertificateClaim": {
      "@id": "https://schemas.abc-federation.gaia-x.community/wip/vocab/compliance#ThirdPartyComplianceCertificateClaim"
    },
    "ThirdPartyComplianceCertificateCredential" :{
      "@id": "https://schemas.abc-federation.gaia-x.community/wip/vocab/compliance#ThirdPartyComplianceCertificateCredential"
    },
    "ComplianceCertificateCredential": {
      "@id": "https://schemas.abc-federation.gaia-x.community/wip/vocab/compliance#ComplianceCertificateCredential"
    },
    "ComplianceCertificateClaim": {
      "@id": "https://schemas.abc-federation.gaia-x.community/wip/vocab/compliance#ComplianceCertificateClaim"
    },
    "ThirdPartyComplianceCertificationScheme": {
      "@id": "https://schemas.abc-federation.gaia-x.community/wip/vocab/compliance#ThirdPartyComplianceCertificationScheme"
    },
    "ComplianceReference": {
      "@id": "https://schemas.abc-federation.gaia-x.community/wip/vocab/compliance#ComplianceReference"
    }
  }
}