{
 "@context": "https://www.w3.org/ns/odrl.jsonld",
 "@type": "Set",
 "uid": "https://data-exchange.com/policy:1010",
 "permission": [
   {
     "target": "https://data-exchange.com/dataset/123",
     "assignee": "Data Consumer",
     "action": "use",
     "constraint": [
       {
         "leftOperand": "odrl:industry",
         "operator": "isNoneOf",
         "rightOperand": {
           "@list": [ "automotive" ]
         }
       }
     ]
   }
 ]
}
