[
    { "participant" : "https://schemas.abc-federation.gaia-x.community/wip/validation/participantShape.ttl"},                       
    { "serviceOffering" : "https://schemas.abc-federation.gaia-x.community/wip/validation/service-offeringShape.ttl"},
    { "location" :"https://schemas.abc-federation.gaia-x.community/wip/validation/locationShape.ttl" },
    { "locatedServiceOffering" : "https://schemas.abc-federation.gaia-x.community/wip/validation/located-service-offeringShape.ttl"},
    { "provider" : "https://schemas.abc-federation.gaia-x.community/wip/validation/providerShape.ttl "}
]
