{
    "@context" : {
      "day" : {
        "@id" : "test:day"
      },
      "month" : {
        "@id" : "test:month"
      },
      "myList" : {
        "@id" : "test:myList"
      },
      "year" : {
        "@id" : "test:year"
      },
      "schema" : "http://schema.org/",
      "rdf" : "http://www.w3.org/1999/02/22-rdf-syntax-ns#",
      "xsd" : "http://www.w3.org/2001/XMLSchema#",
      "test" : "http://www.test.com/ns#"
    },
    "@graph" : [ {
      "@id" : "test:MyNode",
      "@type" : "test:MyTargetClass",
      "myList" : [
        {
          "year" : "2019",
          "month" : "October",
          "day" : "29"
        },
        {
          "year" : "2018",
          "month" : "January",
          "day" : "17"
        }
      ]
    } ]
  }