{
      "gax-service:canHostServiceOffering": [
        {
          "@id": "did:web:ovh.provider.gaia-x.community/public/json-ld/service-offering/S-01.json"
        },
        {
          "@id": "did:web:ovh.provider.gaia-x.community/public/json-ld/service-offering/S-02.json"
        }
      ],
      "gax-participant:country": {
        "@value": "FR",
        "@type": "xsd:string"
      },
      "gax-participant:state": {
        "@value": "state",
        "@type": "xsd:string"
      },
      "gax-participant:urbanArea": {
        "@value": "urbanArea",
        "@type": "xsd:string"
      },
      "gax-participant:providerDesignation": {
        "@value": "providerDesignation",
        "@type": "xsd:string"
      },
      "gax-participant:hasLocatedServiceOffering": [
        {
          "@id": "did:web:ovh.provider.gaia-x.community/public/json-ld/located-service-offering/S-01.json"
        },
        {
          "@id": "did:web:ovh.provider.gaia-x.community/public/json-ld/located-service-offering/S-02.json"
        }
      ]
}