{
  "type": "service_account",
  "project_id": "ccmc-vc-lifecycle",
  "private_key_id": "6482736139ae9741a90047ded4b48ca0a573890e",
  "private_key": "-----BEGIN PRIVATE KEY-----\nMIIEvgIBADANBgkqhkiG9w0BAQEFAASCBKgwggSkAgEAAoIBAQDIG5o8ZtisuLAD\nzIIOZ04O7p1G3Bfs+RXiBXY1IC6C3DeRcNq1qlBdtraFyTLFVacHKZYIWU7dexml\nwY1pBavW483j7TluZUFdoo4LoRNuxjuLiZY0647g3y/FJJdxAEP1KJRhHpxamzxC\nwwF83KrdUMyN4Ta/ONAvhreqLOP7s4saocf7XjnajiBnklCzx7Ot0kOx8tu+dujK\nd7OfbcNTcrCAV8Dy4w+rsd1GlosAXgYCud8bRW3LtgM59pe0Mv4M09mHm2PQOV/k\nTi49svlld8vNXWf9Rgsfswk70gkWgGN2n4INwcC51Lc+CcYPEycZc2LTmC/euXMj\nnTQm47A/AgMBAAECggEAPduigxd71XDGIHaAobk3fRAwGC6DSuL468SqdOO83QD8\nQH51bYD3lPCdXaADjNLcbi9hzLTm1zpthDrf3t4875G+HL5BaantWeedJ2Ukn7Kx\nx4HBqBxFL6humO+lzO27FDb2H0uaI7wnFbA4boO8YevPP/ClvtjuKjLn5bg4xZ5/\nZiACSj7a1SpnLBIuUnZWrx8O2Hg0xDr1TwomxCQFxiOBuhIqCOaO/BqXAfvxmLN6\nkpJrUukO46o8e1+80hI9fRCjG56aX/GinfymHRDiE97XODo8hMF8X7r5sB85cB9C\n+94JaRTuzlX6z2Tb73UX049lGqYc4HMSfGemQBPGeQKBgQD2wjAHS9IYYB9/Vr6I\nyJlkqGP3PHJ/Gsf3qavqXgbzNwWvdmPMxf8a20bN0wdVSM/wJrg1d53rbEC1bZbE\nbNLJ1FUeul4ZCajTA0sRUSi7DxMjszr173IDtNeHVzqv4sz1CAqflGMJB7+HQ+QX\nTFgnUMPvrfU5cI0eix1JVxF8lQKBgQDPmiX0XX9nrEeUG4Ne7Xwo0ND59lDYnzA0\nfhjblk7XxEIkqoZIETwO9ojrLYRFpLAf0PMlESs4d2CUEvVPnEDiTtWj8HXqap9T\n6Ajce26X5PufQXp5PoQdcJpCtbyX5jF6S74tQSv4qxw2HRqCCV4K4g5tzSD3O2Nm\niIaOQQEwgwKBgDAamxJRDZwC4SEJ4Ar6UCz3RsWj2w48Qk9dnE4MFn7DczBJfBsn\nXhv2M09cnElb8G14nuCNeROz/slfm8yfClieNBnRaxamc2rvcWrmz3Hn9ms3PX9E\nNo3Sa1HPB3nSVPJPpwKFAul3wTa1XXnNQEIp1Iic+PlBn8EcjZEGkDohAoGBAMln\n9lyN/NW6uTLCQoBtDCCY/bUTt7mBLwYuM7WNrG3+FGF4IpB2T/sASTNIVGQwc0Ja\nuBmE/5ZnkoX1opKauAQWkYPb/LnwuSRxH2+wPEoWt9r4bnaEJS5emPoRUKdZhzTr\nmNRUvvEgKF2DfL0dk2QhjfgOo2XX8wZ9e3U1MY87AoGBANTSKIBqVwl0+xCYMK2t\nNr360jFem+8yvyCp1xSa2++tkeHv8+CWsRG8jZzT5AhlIX1cb6+OjNWtmoSLL37H\nAy0PfDyOfqVeKpH+m8J9aNM5JP8bQjwRNnpNuFVS6VfXam2KsPw1u9eEYUl4p7MA\nUq4kTKHbuuaTTQQDYkJfxMhk\n-----END PRIVATE KEY-----\n",
  "client_email": "firebase-adminsdk-1c5z7@ccmc-vc-lifecycle.iam.gserviceaccount.com",
  "client_id": "116709556502227993888",
  "auth_uri": "https://accounts.google.com/o/oauth2/auth",
  "token_uri": "https://oauth2.googleapis.com/token",
  "auth_provider_x509_cert_url": "https://www.googleapis.com/oauth2/v1/certs",
  "client_x509_cert_url": "https://www.googleapis.com/robot/v1/metadata/x509/firebase-adminsdk-1c5z7%40ccmc-vc-lifecycle.iam.gserviceaccount.com",
  "universe_domain": "googleapis.com"
}
