{
  "nixpkgs": {
    "branch": "nixos-22.05",
    "description": "Nix Packages collection",
    "homepage": "",
    "owner": "NixOS",
    "repo": "nixpkgs",
    "rev": "22.11",
    "sha256": "11w3wn2yjhaa5pv20gbfbirvjq6i3m7pqrq2msf0g7cv44vijwgw",
    "type": "tarball",
    "url": "https://github.com/NixOS/nixpkgs/archive/22.11.tar.gz",
    "url_template": "https://github.com/<owner>/<repo>/archive/<rev>.tar.gz"
  }
}
