{
  "info": {
    "name": "Provider Catalogue",
    "schema": "https://schema.getpostman.com/json/collection/v2.1.0/collection.json"
  },
  "item": [
    {
      "name": "Healthcheck should return a valid value",
      "event": [
        {
          "listen": "test",
          "script": {
            "exec": [
              "pm.test(\"Get healthcheck returns 200\", function () {",
              "    pm.response.to.have.status(200);",
              "});"
            ],
            "type": "text/javascript"
          }
        }
      ],
      "request": {
        "method": "GET",
        "header": [
          {
            "key": "Accept",
            "value": "application/json",
            "type": "text"
          }
        ],
        "url": {
          "raw": "{{base_url}}/healthcheck",
          "host": [
            "{{base_url}}"
          ],
          "path": [
            "healthcheck"
          ]
        },
        "description": "GET /healthcheck"
      },
      "response": []
    },
    {
      "name": "Get Catalogue should return a valid value",
      "event": [
        {
          "listen": "test",
          "script": {
            "exec": [
              "pm.test(\"Get catalogue returns 200\", function () {",
              "    pm.response.to.have.status(200);",
              "});",
              "",
              "pm.test(\"Get catalogue return jsonld\", function () {",
              "    pm.response.to.have.header('Content-Type');",
              "    pm.response.to.be.header('Content-Type', 'application/ld+json');",
              "});",
              "",
              "pm.test(\"Get catalogue return catalogue object\", function () {",
              "    var catalogue = pm.response.json();",
              "    pm.expect(catalogue['@type']).to.eq('Catalogue');",
              "    pm.expect(catalogue['@context']['gx']).to.eq('https://w3id.org/gaia-x/');",
              "    pm.expect(catalogue['@context']['schema']).to.eq('https://schema.org/');",
              "    pm.expect(catalogue['@context']['@vocab']).to.eq('gx:Catalogue/');",
              "});"
            ],
            "type": "text/javascript"
          }
        }
      ],
      "request": {
        "method": "GET",
        "header": [
          {
            "key": "Accept",
            "value": "application/json",
            "type": "text"
          }
        ],
        "url": {
          "raw": "{{base_url}}/catalog",
          "host": [
            "{{base_url}}"
          ],
          "path": [
            "catalog"
          ]
        },
        "description": "GET /catalog"
      },
      "response": []
    },
    {
      "name": "POST Index VC should return a valid value",
      "event": [
        {
          "listen": "test",
          "script": {
            "exec": [
              "pm.test(\"POST index vc returns 201\", function () {",
              "    pm.response.to.have.status(201);",
              "});"
            ],
            "type": "text/javascript"
          }
        }
      ],
      "request": {
        "method": "POST",
        "header": [
          {
            "key": "Accept",
            "value": "application/json",
            "type": "text"
          },
          {
            "key": "Content-Type",
            "value": "text/plain",
            "type": "text"
          },
          {
            "key": "x-api-key",
            "value": "{{api-key}}",
            "type": "text"
          }
        ],
        "body": {
          "mode": "raw",
          "raw": "did:web:ovhcloud.provider.dev.gaiax.ovh:participant:68a5bbea9518e7e2ac1cc75bcc8819a7edd5c4711e073ffa4bb260034dc6423c/vc/ffaf848d2220673c7ceec0689de0794875ce0ab2ab019a62b7c2d31c716ba582/data.json"
        },
        "url": {
          "raw": "{{base_url}}/catalog/items/",
          "host": [
            "{{base_url}}"
          ],
          "path": [
            "catalog/items/"
          ]
        },
        "description": "POST /catalog/items/"
      },
      "response": []
    },
    {
      "name": "DELETE VC should return a valid value",
      "event": [
        {
          "listen": "test",
          "script": {
            "exec": [
              "pm.test(\"DELETE index vc returns 204\", function () {",
              "    pm.response.to.have.status(204);",
              "});"
            ],
            "type": "text/javascript"
          }
        }
      ],
      "request": {
        "method": "DELETE",
        "header": [
          {
            "key": "Accept",
            "value": "application/json",
            "type": "text"
          },
          {
            "key": "Content-Type",
            "value": "text/plain",
            "type": "text"
          },
          {
            "key": "x-api-key",
            "value": "{{api-key}}",
            "type": "text"
          }
        ],
        "body": {
          "mode": "raw",
          "raw": "did:web:ovhcloud.provider.dev.gaiax.ovh:participant:68a5bbea9518e7e2ac1cc75bcc8819a7edd5c4711e073ffa4bb260034dc6423c/vc/ffaf848d2220673c7ceec0689de0794875ce0ab2ab019a62b7c2d31c716ba582/data.json"
        },
        "url": {
          "raw": "{{base_url}}/catalog/items/",
          "host": [
            "{{base_url}}"
          ],
          "path": [
            "catalog/items/"
          ]
        },
        "description": "DELETE /catalog/items/"
      },
      "response": []
    }
  ],
  "protocolProfileBehavior": {}
}
