{
  "@context": [
    "https://www.w3.org/2018/credentials/v1",
    {
      "gx-data": "https://www.w3.org/2018/credentials/v1"
    }
  ],
  "id": "did:web:dufourstorage.provider.dev.gaiax.ovh:participant:1225ed1cc7755bc5867413f1ca1cf99eb66d4f7a148e10e346390c4bb302f649/data-product/ba28f8f4a715d8af98d68aa72be0ac5519cd87dfa2345686479ea5/data.json",
  "@type": "gx-data:DataProduct",
  "gx-data:providedBy": "https://docaposte.provider.dev.gaiax.ovh/participant/44abd1d1db9faafcb2f5a5384d491680ae7bd458b4e12dc5be831bb07d4f260f/compliance-certificate-claim/vc/data.json",
  "gx-data:serviceTermsAndConditions": {
    "gx-data:value": "https://compliance.lab.gaia-x.eu/development",
    "gx-data:hash": "myrandomhash"
  },
  "gx-data:title": "DufourDataTest",
  "gx-data:serviceType": [
    "Collaboration",
    "Translation"
  ],
  "gx-data:description": "zfz",
  "gx-data:descriptionMarkDown": "",
  "gx-data:webAddress": "",
  "gx-data:dataProtectionRegime": "",
  "gx-data:dataExport": [
    {
      "gx-data:requestType": "email",
      "gx-data:accessType": "digital",
      "gx-data:formatType": "mime/png"
    }
  ],
  "gx-data:dependsOn": "",
  "gx-data:keyword": "",
  "gx-data:layer": "SAAS",
  "gx-data:isAvailableOn": [
    "did:web:dufourstorage.provider.dev.gaiax.ovh:participant:1225ed1cc7755bc5867413f1ca1cf99eb66d4f7a148e10e346390c4bb302f649/location/80ba30db8dd2622a93be652e8db5b3f3085baabc50d387d1dc3311f76455e22d/data.json"
  ],
  "gx-data:aggregationOf": [
    {
      "gx-data:identifier": "62b32ab3404fc258d3837f89",
      "gx-data:copyrightOwnedBy": "did:web:example.com/api/secure/participant/organisations/62b30fd8404fc258d38369ed",
      "gx-data:license": [],
      "gx-data:personalDataPolicy": "NO_PERSONAL_DATA",
      "gx-data:distribution": [
        {
          "gx-data:title": "ice_cream_archived.xls",
          "gx-data:mediaType": "application/vnd.ms-excel",
          "gx-data:byteSize": 23552,
          "gx-data:fileHash": "cea466b7813f9dba5613a7d8e4dbd3915116e8c5441e862224486eb854feeb8a",
          "gx-data:algorithm": "SHA-256",
          "gx-data:location": {
            "@id": "did:web:dufourstorage.provider.dev.gaiax.ovh:participant:1225ed1cc7755bc5867413f1ca1cf99eb66d4f7a148e10e346390c4bb302f649/location/80ba30db8dd2622a93be652e8db5b3f3085baabc50d387d1dc3311f76455e22d/data.json",
            "@type": "gx:Location"
          }
        }
      ]
    },
    {
      "gx-data:identifier": "62e790b98829212af7dad7ab",
      "gx-data:copyrightOwnedBy": "did:web:example.com/api/secure/participant/organisations/62b30fd8404fc258d38369ed",
      "gx-data:license": [],
      "gx-data:personalDataPolicy": "NO_PERSONAL_DATA",
      "gx-data:distribution": [
        {
          "gx-data:title": "multidataset.xls",
          "gx-data:mediaType": "application/vnd.ms-excel",
          "gx-data:byteSize": 30965248,
          "gx-data:fileHash": "44f5f116d381c2ab4dab9459a15ab00e5fb043a66832447f2cc5d6a3a18855f1",
          "gx-data:algorithm": "SHA-256",
          "gx-data:location": {
            "@id": "did:web:dufourstorage.provider.dev.gaiax.ovh:participant:1225ed1cc7755bc5867413f1ca1cf99eb66d4f7a148e10e346390c4bb302f649/location/80ba30db8dd2622a93be652e8db5b3f3085baabc50d387d1dc3311f76455e22d/data.json",
            "@type": "gx:Location"
          }
        }
      ]
    }
  ]
}
}