{
  "dct:title": "String",
  "dct:distributions": [
    "dcat:distribution_01","...","dcat:distribution_N"
  ],
  "dct:identifier": "String",
  "dct:issued": "Date",
  "gx:expirationDateTime": "Date",
  "dct:license": ["String1", "String2","...","URI_N"],
  "gx:dataLicensors": ["URI_01", "URI_02","...","URI_N"],
  "gx:dataUsageAgreement": ["DataUsageAgreement_01", "DataUsageAgreement_02","...", "DataUsageAgreement_N"],
  "gx:exposedThrough": ["URI_01", "URI_02","...","URI_N"]
}