{
  "gx:producedBy": "URI",
  "gx:providedBy": "URI",
  "gx:licensedBy": ["URI_01", "URI_02"],
  "gx:dataUsageAgreementTrustAnchor": "URI",
  "gx:dataProduct": "URI",
  "gx:signers": [
    {
      "gx:participantRole": "Provider/Consumer/Licensor/Producer",
      "gx:mandatory": "boolean",
      "gx:legalValidity": "Yes/No"
    }
  ]
}