{
  "gx:providedBy": "URI",
  "gx:termsAndConditions": "URI",
  "dct:license": ["String1", "String2"],
  "gx:title": "String",
  "gx:description": "String",
  "dct:issued": "Date",
  "gx:obsoleteDateTime": "Date",
  "odrl:hasPolicy": ["ODRL1", "ODRL2"],
  "gx:dataLicensors": ["URI1", "URI2"],
  "gx:dataUsageAgreement":  ["DataUsageAgreement1", "DataUsageAgreement2"],
  "gx:aggregationOf": "gx:dataSet[]",
  "dct:identifier": "String",
  "dcat:contactPoint": "vCard",
  "dcterms:conformsTo": ["URI1", "URI2"]
}