{
  "@context": [
    "https://www.w3.org/2018/credentials/v1"
  ],
  "@type": [
    "VerifiableCredential",
    "DataProduct"
  ],
  "@id": "did:web:abc-federation.gaia-x.community:participant:8121245b25bda4bd0eac915fc50319f9752d6d2e9eb4a16c7bf76dcc67c0eda3/vc/dataproductminio/data.json",
  "credentialSubject": {
    "type": "DataProduct",
    "id": "did:web:dufourstorage.provider.dev.gaiax.ovh:participant:1225ed1cc7755bc5867413f1ca1cf99eb66d4f7a148e10e346390c4bb302f649/data.json",
    "gx:providedBy": "URI",
    "gx:termsAndConditions": "https://dufourstorage.provider.gaia-x.community/terms-and-conditions.json",
    "dct:license": [
      "license1",
      "license2"
    ],
    "gx:title": "Data Product on Minio",
    "odrl:hasPolicy": [
      {
        "@context": "https://www.w3.org/ns/odrl.jsonld",
        "@type": "Set",
        "uid": "https://data-exchange.com/policy:1010",
        "permission": [
          {
            "target": "https://data-exchange.com/dataset01",
            "assignee": "Data Consumer",
            "action": "grantUse"
          }
        ]
      },
      {
        "@context": "https://www.w3.org/ns/odrl.jsonld",
        "@type": "Set",
        "uid": "https://data-exchange.com/policy:1010",
        "permission": [
          {
            "target": "https://data-exchange.com/dataset01",
            "assignee": "Data Consumer",
            "action": "use",
            "constraint": [
              {
                "leftOperand": "dateTime",
                "operator": "lt",
                "rightOperand": {
                  "@value": "2024-01-01",
                  "@type": "xsd:date"
                }
              }
            ]
          }
        ]
      }
    ],
    "gx:aggregationOf": [
      {
        "dct:title": "dataset01",
        "dct:distributions": [
          {
            "dct:title": "Data Product on Minio",
            "dct:format": "PDF"
          }
        ],
        "dct:identifier": "dataset01",
        "gx:exposedThrough": [
          "https://minio.abc-federation.dev.gaiax.ovh"
        ]
      }
    ]
  },
  "expirationDate": "2023-06-21T12:17:52.960Z",
  "issuer": "did:web:dufourstorage.provider.dev.gaiax.ovh",
  "issuanceDate": "2023-06-09T09:34:22.288842+00:00",
  "proof": {
    "type": "JsonWebSignature2020",
    "proofPurpose": "assertionMethod",
    "verificationMethod": "did:web:dufourstorage.provider.dev.gaiax.ovh",
    "created": "2023-09-12T12:09:41.526689+00:00",
    "jws": "eyJhbGciOiJQUzI1NiIsImI2NCI6ZmFsc2UsImNyaXQiOlsiYjY0Il19..plHGj1R4ZYPC3IVC8P0uJOe-7frZSpYMEel8ZB8DpI4-rzyqcXQFfs3_stSVVgyguz-ZWOBjICjtvQK4QBE8CueEHRwt_PoFnUKGbhQ1CQPNbNEU6CWcqGU0j9OQQqp7r1aQcdQ80MnAfuBg0SXCdH5L9aTXZN0vZwf3iZu-ueQ4qAJ1DVvZDLBqhezUFJatQkS6a5kuABPPBq0tuwJeIGAuKFXsYfLiXInLHKkDWkZJ26Y9P7fa1E-40-2kvCS_R4w_7XqgZo-DnVN15rcxpmD78JGDekqxd2exN1P8WW0qeBe8HCNi6RcQSERoxmfHO5Bt1sDFnL7zYP1a9t_b-A"
  }
}