{
  "gx:providedBy": "URI",
  "gx:termsAndConditions": "URI",
  "dct:license": ["String1", "String2"],
  "gx:title": "String",
  "odrl:hasPolicy": ["ODRL1", "ODRL"],
  "gx:aggregationOf": "gx:dataSet[]",
  "dct:identifier": "String"
}