[
    {
        "id":"rule_07",
        "description":"Check if the terms and condition are valid and that of the federation",
        "required": {
            "type":["abc:TermsAndConditions"],
            "registry":true,
            "path":"/api/termsAndConditions"
        }
    },
    {
        "id":"rule_08",
        "description":"Check the issuer of the compliance participant is one of the clearing house",
        "required": {
            "type":["gx:compliance"],
            "registry":true,
            "path":"/api/trusted-issuers/compliance"
        }
    }
]