[
  {
    "@context": [
      "https://schema-registry.aster-x.demo23.gxfs.fr/contexts/credentials",
      "https://schema-registry.aster-x.demo23.gxfs.fr/contexts/jws-2020"
    ],
    "@type": [
      "VerifiableCredential"
    ],
    "@id": "did:web:ikoula.provider.demo23.gxfs.fr:participant:cdd56402c4c9193156ec5593836c89fb5103b29fa3555b3bf594e077cc55333c/vc/legal-participant/legal-participant.json",
    "issuer": "did:web:ikoula.provider.demo23.gxfs.fr",
    "credentialSubject": {
      "id": "did:web:ikoula.provider.demo23.gxfs.fr:participant:cdd56402c4c9193156ec5593836c89fb5103b29fa3555b3bf594e077cc55333c/data.json",
      "gx:legalName": "IKOULA",
      "gx:legalRegistrationNumber": {
        "id": "did:web:ikoula.provider.demo23.gxfs.fr:participant:cdd56402c4c9193156ec5593836c89fb5103b29fa3555b3bf594e077cc55333c/vc/legal-participant/gaiax-legal-registration-number.json"
      },
      "gx:headquarterAddress": {
        "gx:countrySubdivisionCode": "FR-IDF"
      },
      "gx:legalAddress": {
        "gx:countrySubdivisionCode": "FR-IDF"
      },
      "@context": [
        "https://registry.lab.gaia-x.eu/development/api/trusted-shape-registry/v1/shapes/jsonld/trustframework#"
      ],
      "type": "gx:LegalParticipant"
    },
    "issuanceDate": "2023-11-07T09:24:23.389404+00:00",
    "proof": {
      "type": "JsonWebSignature2020",
      "proofPurpose": "assertionMethod",
      "verificationMethod": "did:web:ikoula.provider.demo23.gxfs.fr",
      "created": "2023-11-07T09:24:23.389404+00:00",
      "jws": "eyJhbGciOiAiUFMyNTYiLCAiYjY0IjogZmFsc2UsICJjcml0IjogWyJiNjQiXX0..vQ7csLejh8Ut3daSgRZ8YoosUd34gnOcazLc6eeCC8MF1I__2A3q0PprdlT5G9VJZctkta_-3eAiyGUD8dYoAeJYT4zYj-5W6sl-NiHgZVj8pZYE2Whw7Vr0FknqI9i7de0wHyJ1jcKDSZb4ssk4khyQZkmwqqzpAlIVjSv-8Sniap0FpC3oRNks-GWLFkwFyQW55JYHwZ-8iB51m4u9Q1tfq1hpFBi1x2rAJqXeTstD62cUi5nXAd2zyGEnNB6Pw9P17dppWbDhwSzTNUj3_Czy0o3vqQKeXj4c92OIfjixJCW8sacRD1P5ONQWY_znMlUVQHJDSV-lZykG5PWcPA"
    }
  },
  {
    "@context": [
      "https://schema-registry.aster-x.demo23.gxfs.fr/contexts/credentials",
      "https://schema-registry.aster-x.demo23.gxfs.fr/contexts/jws-2020"
    ],
    "@type": [
      "VerifiableCredential"
    ],
    "@id": "did:web:gigas.provider.demo23.gxfs.fr:participant:10f73b0bf81e10616bd3ac78c0f77c34c9a6022353ee0077b6e09e87d33ffb9e/vc/legal-participant/legal-participant.json",
    "issuer": "did:web:gigas.provider.demo23.gxfs.fr",
    "credentialSubject": {
      "id": "did:web:gigas.provider.demo23.gxfs.fr:participant:10f73b0bf81e10616bd3ac78c0f77c34c9a6022353ee0077b6e09e87d33ffb9e/data.json",
      "gx:legalName": "GIGAS HOSTING SA",
      "gx:legalRegistrationNumber": {
        "id": "did:web:gigas.provider.demo23.gxfs.fr:participant:10f73b0bf81e10616bd3ac78c0f77c34c9a6022353ee0077b6e09e87d33ffb9e/vc/legal-participant/gaiax-legal-registration-number.json"
      },
      "gx:headquarterAddress": {
        "gx:countrySubdivisionCode": "ES-M"
      },
      "gx:legalAddress": {
        "gx:countrySubdivisionCode": "ES-M"
      },
      "@context": [
        "https://registry.lab.gaia-x.eu/development/api/trusted-shape-registry/v1/shapes/jsonld/trustframework#"
      ],
      "type": "gx:LegalParticipant"
    },
    "issuanceDate": "2023-11-07T09:34:11.896808+00:00",
    "proof": {
      "type": "JsonWebSignature2020",
      "proofPurpose": "assertionMethod",
      "verificationMethod": "did:web:gigas.provider.demo23.gxfs.fr",
      "created": "2023-11-07T09:34:11.896808+00:00",
      "jws": "eyJhbGciOiAiUFMyNTYiLCAiYjY0IjogZmFsc2UsICJjcml0IjogWyJiNjQiXX0..E59t07pWkZJKTYDvVLnUbgTNK_MtauRvnwhBukIhiZ81pG-uYuEBvcHpd-Yv7wTmMHg-Nip2Q-xmCxVwQRSelxDFuY20rPIrzVvSB8Nc9VWy6r4P1xY5GukTQMesvQXH7vJhFL0bamDNOxXFZ5JwmfeK2kCiN-DUbnfz1IWt9NZpGmH9aDUEyrrD4tZmM1jOft8QTCJIopuiuLb0BsCAjUCQYZk1RP2WokOID3saCAzZrvoVYbPuBWiPDxDCAYdpKCJpbjOUW74C34qVPVu5G8e5vN18mu7FGFBt4NVWC_K6gXIZsZp1selMRp3CvNZYmMJY20dmy3xVdEzoR9FOCw"
    }
  }
]
