[
  {
    "country_name": "Portugal",
    "location_did": "did:web:gigas.provider.gaia-x.community:participant:10f73b0bf81e10616bd3ac78c0f77c34c9a6022353ee0077b6e09e87d33ffb9e/location/80ba30db8dd2622a93be652e8db5b3f3085baabc50d387d1dc3311f76455e22d/data.json",
    "provider_designation": "Oni",
    "provider_did": "did:web:gigas.provider.gaia-x.community:participant:10f73b0bf81e10616bd3ac78c0f77c34c9a6022353ee0077b6e09e87d33ffb9e/data.json",
    "state": "Port",
    "urban_area": "Port"
  },
  {
    "country_name": "Spain",
    "location_did": "did:web:gigas.provider.gaia-x.community:participant:10f73b0bf81e10616bd3ac78c0f77c34c9a6022353ee0077b6e09e87d33ffb9e/location/f17220a5c93bdc04451b1253015b4e2c2dc1cd532b9e4e6e75f13f39080024f6/data.json",
    "provider_designation": "Interxion (Mad1)",
    "provider_did": "did:web:gigas.provider.gaia-x.community:participant:10f73b0bf81e10616bd3ac78c0f77c34c9a6022353ee0077b6e09e87d33ffb9e/data.json",
    "state": "Madrid",
    "urban_area": "Madrid"
  },
  {
    "country_name": "Spain",
    "location_did": "did:web:gigas.provider.gaia-x.community:participant:10f73b0bf81e10616bd3ac78c0f77c34c9a6022353ee0077b6e09e87d33ffb9e/location/f43e6fee6d461d5abd490852f3e10e62a5ef8f7113ddcb5843763d1e8f7df523/data.json",
    "provider_designation": "Interxion (Mad2)",
    "provider_did": "did:web:gigas.provider.gaia-x.community:participant:10f73b0bf81e10616bd3ac78c0f77c34c9a6022353ee0077b6e09e87d33ffb9e/data.json",
    "state": "Madrid",
    "urban_area": "Madrid"
  },
  {
    "country_name": "Portugal",
    "location_did": "did:web:gigas.provider.gaia-x.community:participant:10f73b0bf81e10616bd3ac78c0f77c34c9a6022353ee0077b6e09e87d33ffb9e/location/cdaf622d545337367680b2da15f86f58efb3e8cdcae82b23ebcf1dfb20c04bda/data.json",
    "provider_designation": "Oni",
    "provider_did": "did:web:gigas.provider.gaia-x.community:participant:10f73b0bf81e10616bd3ac78c0f77c34c9a6022353ee0077b6e09e87d33ffb9e/data.json",
    "state": "Lisboa",
    "urban_area": "Matinha"
  },
  {
    "country_name": "Ireland",
    "location_did": "did:web:gigas.provider.gaia-x.community:participant:10f73b0bf81e10616bd3ac78c0f77c34c9a6022353ee0077b6e09e87d33ffb9e/location/dada1a228f67ba0bf06c90c860523b4fe7ee277418071b8f495ba075dec9bf0c/data.json",
    "provider_designation": "BT",
    "provider_did": "did:web:gigas.provider.gaia-x.community:participant:10f73b0bf81e10616bd3ac78c0f77c34c9a6022353ee0077b6e09e87d33ffb9e/data.json",
    "state": "Dublin",
    "urban_area": "Dublin"
  },
  {
    "country_name": "France",
    "location_did": "did:web:ikoula.provider.gaia-x.community:participant:cdd56402c4c9193156ec5593836c89fb5103b29fa3555b3bf594e077cc55333c/location/f17220a5c93bdc04451b1253015b4e2c2dc1cd532b9e4e6e75f13f39080024f6/data.json",
    "provider_designation": "IKDC1",
    "provider_did": "did:web:ikoula.provider.gaia-x.community:participant:cdd56402c4c9193156ec5593836c89fb5103b29fa3555b3bf594e077cc55333c/data.json",
    "state": "Grand Est",
    "urban_area": "Reims"
  },
  {
    "country_name": "France",
    "location_did": "did:web:ikoula.provider.gaia-x.community:participant:cdd56402c4c9193156ec5593836c89fb5103b29fa3555b3bf594e077cc55333c/location/f43e6fee6d461d5abd490852f3e10e62a5ef8f7113ddcb5843763d1e8f7df523/data.json",
    "provider_designation": "IKDC2",
    "provider_did": "did:web:ikoula.provider.gaia-x.community:participant:cdd56402c4c9193156ec5593836c89fb5103b29fa3555b3bf594e077cc55333c/data.json",
    "state": "Grand Est",
    "urban_area": "Eppes (La\u00f4n)"
  }
]
