{
  "@context": [
    "https://www.w3.org/2018/credentials/v1",
    {
      "gx-data": "https://www.w3.org/2018/credentials/v1"
    }
  ],
  "@id": "did:web:dufourstorage.provider.gaia-x.community:participant:1225ed1cc7755bc5867413f1ca1cf99eb66d4f7a148e10e346390c4bb302f649/vc/092ef87c6c51b7e9be5868f28df9f0e84153f45ade241146cd144737923254e7/data.json",
  "type": [
    "VerifiableCredential",
    "Catalogue"
  ],
  "issuer": "did:web:dufourstorage.provider.gaia-x.community",
  "expirationDate": "2043-07-20T16:48:09.608+02:00",
  "credentialSubject": {
    "@type": "Catalogue",
    "@context": {
      "gx": "https://w3id.org/gaia-x/",
      "schema": "https://schema.org/",
      "@vocab": "gx:Catalogue/"
    },
    "providedBy": "did:web:dufourstorage.provider.dev.gaiax.ovh:participant:1225ed1cc7755bc5867413f1ca1cf99eb66d4f7a148e10e346390c4bb302f649/data.json",
    "getVerifiableCredentialsIDs": [
      "did:web:dufourstorage.provider.gaia-x.community:participant:1225ed1cc7755bc5867413f1ca1cf99eb66d4f7a148e10e346390c4bb302f649/vc/54411943454afca5f95a4e2d666e16e7522a9cc69100eb3e70de8a787dbd48f8/data.json",
      "did:web:dufourstorage.provider.gaia-x.community:participant:1225ed1cc7755bc5867413f1ca1cf99eb66d4f7a148e10e346390c4bb302f649/vc/e7524df3099753f840fee14dcd79001946257e495697ba49bef82975251aef37/data.json",
      "did:web:dufourstorage.provider.gaia-x.community:participant:1225ed1cc7755bc5867413f1ca1cf99eb66d4f7a148e10e346390c4bb302f649/vc/9078c804e69f88c6b674ebd8342d727f0714a3960a7fa4efeb3be3d2bfe342df/data.json",
      "did:web:dufourstorage.provider.gaia-x.community:participant:1225ed1cc7755bc5867413f1ca1cf99eb66d4f7a148e10e346390c4bb302f649/vc/b808dfaea16f1855d824b8581eb9a6560dd289291e2fc7fc26124981043492ba/data.json",
      "did:web:dufourstorage.provider.gaia-x.community:participant:1225ed1cc7755bc5867413f1ca1cf99eb66d4f7a148e10e346390c4bb302f649/vc/cf08fd174095c535ad692db15316244228879f4214d872e52121973bcb448a92/data.json",
      "did:web:dufourstorage.provider.gaia-x.community:participant:1225ed1cc7755bc5867413f1ca1cf99eb66d4f7a148e10e346390c4bb302f649/vc/f84ffe162de3c05e84d788f1944022785398869b21f144d0b5c36ff793a24b93/data.json",
      "did:web:dufourstorage.provider.gaia-x.community:participant:1225ed1cc7755bc5867413f1ca1cf99eb66d4f7a148e10e346390c4bb302f649/vc/0f174a3926fe46a5dbadc18226eb987cb9447886e96c633dd68c53cb45b92717/data.json",
      "did:web:dufourstorage.provider.gaia-x.community:participant:1225ed1cc7755bc5867413f1ca1cf99eb66d4f7a148e10e346390c4bb302f649/vc/5c9d8623e225b4198dffa2991054c85eccf06ecced5eebb763c5d1d78296bd96/data.json",
      "did:web:dufourstorage.provider.dev.gaiax.ovh:participant:1225ed1cc7755bc5867413f1ca1cf99eb66d4f7a148e10e346390c4bb302f649/vc/246e0c551a4819e0d1c17d2a9bb9bdee38ce6c95264c1ef55786ae2cd1ff41d0/data.json",
      "did:web:dufourstorage.provider.dev.gaiax.ovh:participant:1225ed1cc7755bc5867413f1ca1cf99eb66d4f7a148e10e346390c4bb302f649/vc/0987654321/data.json",
      "did:web:dufourstorage.provider.gaia-x.community:participant:1225ed1cc7755bc5867413f1ca1cf99eb66d4f7a148e10e346390c4bb302f649/vc/876b8c509c61d61622b3596166f4d65b92f281227fffce0f22ce0d313c7478ba/data.json",
      "did:web:dufourstorage.provider.gaia-x.community:participant:1225ed1cc7755bc5867413f1ca1cf99eb66d4f7a148e10e346390c4bb302f649/vc/c70e751732e3ed9b8a63f29ab354d57c35e675e7046495dcae4998a7291c221c/data.json",
      "did:web:dufourstorage.provider.gaia-x.community:participant:1225ed1cc7755bc5867413f1ca1cf99eb66d4f7a148e10e346390c4bb302f649/vc/94bd65f62f78064c4656dad4e9d505a5d9f8c9cb65eaa271c65b02c9a7f8ac6d/data.json",
      "did:web:dufourstorage.provider.gaia-x.community:participant:1225ed1cc7755bc5867413f1ca1cf99eb66d4f7a148e10e346390c4bb302f649/vc/ad92f0ba28a8ac2d2d69f68f8aee26b6de8f153311c2f470b7687da12215bfbc/data.json",
      "did:web:dufourstorage.provider.gaia-x.community:participant:1225ed1cc7755bc5867413f1ca1cf99eb66d4f7a148e10e346390c4bb302f649/vc/e3b33bc114eb98eb42148bead6b827632428432e7db6dbe46ce9fd81e880571a/data.json",
      "did:web:dufourstorage.provider.gaia-x.community:participant:1225ed1cc7755bc5867413f1ca1cf99eb66d4f7a148e10e346390c4bb302f649/vc/60fcba74870ced6d981c40da33744b712ad0e5a0164d8b86389c7d52fcd8c3ab/data.json",
      "did:web:dufourstorage.provider.gaia-x.community:participant:1225ed1cc7755bc5867413f1ca1cf99eb66d4f7a148e10e346390c4bb302f649/vc/d208651c46efddd84a73bad9167128b4738a659727ec052ecdf514e62f2b32e9/data.json",
      "did:web:dufourstorage.provider.gaia-x.community:participant:1225ed1cc7755bc5867413f1ca1cf99eb66d4f7a148e10e346390c4bb302f649/vc/dd3de9e300aaecbfc7e3d9b351cacf6b19d7f72f60fa11c22b99e7d28b11c76c/data.json",
      "did:web:dufourstorage.provider.gaia-x.community:participant:1225ed1cc7755bc5867413f1ca1cf99eb66d4f7a148e10e346390c4bb302f649/vc/b6d8a8825c61541dbdaf9023205b343d0b13e0350eb71246a90bdfdbf2d529ce/data.json"
    ]
  },
  "issuanceDate": "2023-04-21T14:48:36.823185+00:00",
  "proof": {
    "type": "JsonWebSignature2020",
    "proofPurpose": "assertionMethod",
    "verificationMethod": "did:web:dufourstorage.provider.gaia-x.community",
    "created": "2023-04-21T14:48:36.823185+00:00",
    "jws": "eyJhbGciOiAiUFMyNTYiLCAiYjY0IjogZmFsc2UsICJjcml0IjogWyJiNjQiXX0..ditO7Zch9_y8k6lW542dsNlrGkHZsp4FgYYpyp3VqjSL2-7iLCd5iHqMx8e1-f_EeE0eES_6TStXkDUUOBAvBpHOGFVQX0L8Lih6ZAs2WZcA5a5bw9tWGYP-iKuWGGEenhfjuJe-8xFzBDSU89DbSZ6CLIVQZyo0OXnlUGaRnejH-NdOkJ0hOeDxW-X5Vr_1OQ_9An-ls47G9xlJmnIMPX0k3dqs0gDu08l1dsNnPGhknp34UX-C_xLnhW0jhPMFNvbdsSPp6-KiuqWWinJMG8RdmXLaNMUi45rJn-uN6OSqV8XQ8zvYhqwhism90yYGJSvKgV_s3nlLhpJvrAC7TQ"
  }
}
