{
  "@context": [
    "https://schema-registry.aster-x.demo23.gxfs.fr/contexts/credentials",
    "https://w3id.org/security/suites/jws-2020/v1",
    "https://schema-registry.aster-x.demo23.gxfs.fr/contexts/aster-conformity"
  ],
  "@graph": []
}
