{
    "PORT": 9073,
    "DB_URL": "mongodb://localhost:27017/monitoring",
    "REDIS": {
        "PORT": "6379",
        "HOST": "127.0.0.1"
    },
    "JWT_OPTIONS": {
        "SECRET_KEY": "Lr-x9g5-Rq-yB6NNcTKlVQ.ZvRscU8PgFGNIRJhg16i1y6CpyxaiMeGzeQzcFoxaCs",
        "EXPIRES_IN": "1d"
    },
    "FCM_TOKEN": "AAAAxDg2DMg:APA91bH1sVyshALHAZXqTlvl33iIn8v1osQCpsKxwGkFXXv0xOwmmvUxij99hsoVMOyqGAQzBvc_A-Z32xfAMmU8slAOTNgtAgvApUqKWXao7HWmK1GLguTDxSoG3jOIYyeZYKNEOe5_",
    "EMAIL_SERVICE": 0,
    "SENDGRID_API_KEY": "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"
}