[
    {
        "id" : "de.grogra.testplugins.one",
        "name" : "giplugintest1",
        "description" : "Test plugin",
        "helpUrl": "https://gitlab.com/grogra/groimp/",
        "vendor": "de.grogra",
        "mainClass": "",
        "versions" : {
            "1.0" : {
                "downloadUrl" : "https://gitlab.com/gaetan.heidsieck/giplugintest1/-/raw/main/giplugintest1-1.0.zip",
                "libs" : {},
                "depends" : [
                    "de.grogra.pf",
                    "de.grogra.imp"
                ]
            }
        }
    }
]
