{
  "ParishData": {
    "parish_offpriest": {
      "Proper": "Officialing Priest",
      "Type": "text"
    },
    "parish_recby": {
      "Proper": "Received By",
      "Type": "text",
      "Break" : false
    },
    "parish_date": {
      "Proper": "Date",
      "Type": "date"
    },
    "parish_or": {
      "Proper": "OR#",
      "Type": "text"
    }
  },
  "Reminder" : "Please be on time. Kindly fetch the Priest and bring him back at the parish before and after the Blessing.",
  "Icon" : "priest.png"
}