year,from,to,hospitalizations
1998,"{'latlong': [-40.37386802241421, -18.482273989187647], 'name': 'Norte'}","{'latlong': [-40.37386802241421, -18.482273989187647], 'name': 'Norte'}",2018
1998,"{'latlong': [-40.37386802241421, -18.482273989187647], 'name': 'Norte'}","{'latlong': [-40.413051713467134, -19.36386835275335], 'name': 'Central'}",110
1998,"{'latlong': [-40.37386802241421, -18.482273989187647], 'name': 'Norte'}","{'latlong': [-40.78119299861817, -20.15896969790739], 'name': 'Metropolitana'}",152
1998,"{'latlong': [-40.37386802241421, -18.482273989187647], 'name': 'Norte'}","{'latlong': [-41.27886237691346, -20.75688096507395], 'name': 'Sul'}",3
1998,"{'latlong': [-40.413051713467134, -19.36386835275335], 'name': 'Central'}","{'latlong': [-40.37386802241421, -18.482273989187647], 'name': 'Norte'}",18
1998,"{'latlong': [-40.413051713467134, -19.36386835275335], 'name': 'Central'}","{'latlong': [-40.413051713467134, -19.36386835275335], 'name': 'Central'}",3811
1998,"{'latlong': [-40.413051713467134, -19.36386835275335], 'name': 'Central'}","{'latlong': [-40.78119299861817, -20.15896969790739], 'name': 'Metropolitana'}",324
1998,"{'latlong': [-40.413051713467134, -19.36386835275335], 'name': 'Central'}","{'latlong': [-41.27886237691346, -20.75688096507395], 'name': 'Sul'}",1
1998,"{'latlong': [-40.78119299861817, -20.15896969790739], 'name': 'Metropolitana'}","{'latlong': [-40.37386802241421, -18.482273989187647], 'name': 'Norte'}",6
1998,"{'latlong': [-40.78119299861817, -20.15896969790739], 'name': 'Metropolitana'}","{'latlong': [-40.413051713467134, -19.36386835275335], 'name': 'Central'}",90
1998,"{'latlong': [-40.78119299861817, -20.15896969790739], 'name': 'Metropolitana'}","{'latlong': [-40.78119299861817, -20.15896969790739], 'name': 'Metropolitana'}",7307
1998,"{'latlong': [-40.78119299861817, -20.15896969790739], 'name': 'Metropolitana'}","{'latlong': [-41.27886237691346, -20.75688096507395], 'name': 'Sul'}",47
1998,"{'latlong': [-41.27886237691346, -20.75688096507395], 'name': 'Sul'}","{'latlong': [-40.37386802241421, -18.482273989187647], 'name': 'Norte'}",1
1998,"{'latlong': [-41.27886237691346, -20.75688096507395], 'name': 'Sul'}","{'latlong': [-40.78119299861817, -20.15896969790739], 'name': 'Metropolitana'}",249
1998,"{'latlong': [-41.27886237691346, -20.75688096507395], 'name': 'Sul'}","{'latlong': [-41.27886237691346, -20.75688096507395], 'name': 'Sul'}",4370
1999,"{'latlong': [-40.37386802241421, -18.482273989187647], 'name': 'Norte'}","{'latlong': [-40.37386802241421, -18.482273989187647], 'name': 'Norte'}",1958
1999,"{'latlong': [-40.37386802241421, -18.482273989187647], 'name': 'Norte'}","{'latlong': [-40.413051713467134, -19.36386835275335], 'name': 'Central'}",131
1999,"{'latlong': [-40.37386802241421, -18.482273989187647], 'name': 'Norte'}","{'latlong': [-40.78119299861817, -20.15896969790739], 'name': 'Metropolitana'}",160
1999,"{'latlong': [-40.37386802241421, -18.482273989187647], 'name': 'Norte'}","{'latlong': [-41.27886237691346, -20.75688096507395], 'name': 'Sul'}",2
1999,"{'latlong': [-40.413051713467134, -19.36386835275335], 'name': 'Central'}","{'latlong': [-40.37386802241421, -18.482273989187647], 'name': 'Norte'}",18
1999,"{'latlong': [-40.413051713467134, -19.36386835275335], 'name': 'Central'}","{'latlong': [-40.413051713467134, -19.36386835275335], 'name': 'Central'}",4427
1999,"{'latlong': [-40.413051713467134, -19.36386835275335], 'name': 'Central'}","{'latlong': [-40.78119299861817, -20.15896969790739], 'name': 'Metropolitana'}",329
1999,"{'latlong': [-40.413051713467134, -19.36386835275335], 'name': 'Central'}","{'latlong': [-41.27886237691346, -20.75688096507395], 'name': 'Sul'}",1
1999,"{'latlong': [-40.78119299861817, -20.15896969790739], 'name': 'Metropolitana'}","{'latlong': [-40.37386802241421, -18.482273989187647], 'name': 'Norte'}",1
1999,"{'latlong': [-40.78119299861817, -20.15896969790739], 'name': 'Metropolitana'}","{'latlong': [-40.413051713467134, -19.36386835275335], 'name': 'Central'}",83
1999,"{'latlong': [-40.78119299861817, -20.15896969790739], 'name': 'Metropolitana'}","{'latlong': [-40.78119299861817, -20.15896969790739], 'name': 'Metropolitana'}",7551
1999,"{'latlong': [-40.78119299861817, -20.15896969790739], 'name': 'Metropolitana'}","{'latlong': [-41.27886237691346, -20.75688096507395], 'name': 'Sul'}",78
1999,"{'latlong': [-41.27886237691346, -20.75688096507395], 'name': 'Sul'}","{'latlong': [-40.413051713467134, -19.36386835275335], 'name': 'Central'}",6
1999,"{'latlong': [-41.27886237691346, -20.75688096507395], 'name': 'Sul'}","{'latlong': [-40.78119299861817, -20.15896969790739], 'name': 'Metropolitana'}",275
1999,"{'latlong': [-41.27886237691346, -20.75688096507395], 'name': 'Sul'}","{'latlong': [-41.27886237691346, -20.75688096507395], 'name': 'Sul'}",4656
2000,"{'latlong': [-40.37386802241421, -18.482273989187647], 'name': 'Norte'}","{'latlong': [-40.37386802241421, -18.482273989187647], 'name': 'Norte'}",1819
2000,"{'latlong': [-40.37386802241421, -18.482273989187647], 'name': 'Norte'}","{'latlong': [-40.413051713467134, -19.36386835275335], 'name': 'Central'}",122
2000,"{'latlong': [-40.37386802241421, -18.482273989187647], 'name': 'Norte'}","{'latlong': [-40.78119299861817, -20.15896969790739], 'name': 'Metropolitana'}",148
2000,"{'latlong': [-40.37386802241421, -18.482273989187647], 'name': 'Norte'}","{'latlong': [-41.27886237691346, -20.75688096507395], 'name': 'Sul'}",5
2000,"{'latlong': [-40.413051713467134, -19.36386835275335], 'name': 'Central'}","{'latlong': [-40.37386802241421, -18.482273989187647], 'name': 'Norte'}",27
2000,"{'latlong': [-40.413051713467134, -19.36386835275335], 'name': 'Central'}","{'latlong': [-40.413051713467134, -19.36386835275335], 'name': 'Central'}",4294
2000,"{'latlong': [-40.413051713467134, -19.36386835275335], 'name': 'Central'}","{'latlong': [-40.78119299861817, -20.15896969790739], 'name': 'Metropolitana'}",268
2000,"{'latlong': [-40.78119299861817, -20.15896969790739], 'name': 'Metropolitana'}","{'latlong': [-40.37386802241421, -18.482273989187647], 'name': 'Norte'}",2
2000,"{'latlong': [-40.78119299861817, -20.15896969790739], 'name': 'Metropolitana'}","{'latlong': [-40.413051713467134, -19.36386835275335], 'name': 'Central'}",56
2000,"{'latlong': [-40.78119299861817, -20.15896969790739], 'name': 'Metropolitana'}","{'latlong': [-40.78119299861817, -20.15896969790739], 'name': 'Metropolitana'}",8211
2000,"{'latlong': [-40.78119299861817, -20.15896969790739], 'name': 'Metropolitana'}","{'latlong': [-41.27886237691346, -20.75688096507395], 'name': 'Sul'}",81
2000,"{'latlong': [-41.27886237691346, -20.75688096507395], 'name': 'Sul'}","{'latlong': [-40.413051713467134, -19.36386835275335], 'name': 'Central'}",3
2000,"{'latlong': [-41.27886237691346, -20.75688096507395], 'name': 'Sul'}","{'latlong': [-40.78119299861817, -20.15896969790739], 'name': 'Metropolitana'}",312
2000,"{'latlong': [-41.27886237691346, -20.75688096507395], 'name': 'Sul'}","{'latlong': [-41.27886237691346, -20.75688096507395], 'name': 'Sul'}",5171
2001,"{'latlong': [-40.37386802241421, -18.482273989187647], 'name': 'Norte'}","{'latlong': [-40.37386802241421, -18.482273989187647], 'name': 'Norte'}",1924
2001,"{'latlong': [-40.37386802241421, -18.482273989187647], 'name': 'Norte'}","{'latlong': [-40.413051713467134, -19.36386835275335], 'name': 'Central'}",88
2001,"{'latlong': [-40.37386802241421, -18.482273989187647], 'name': 'Norte'}","{'latlong': [-40.78119299861817, -20.15896969790739], 'name': 'Metropolitana'}",193
2001,"{'latlong': [-40.37386802241421, -18.482273989187647], 'name': 'Norte'}","{'latlong': [-41.27886237691346, -20.75688096507395], 'name': 'Sul'}",1
2001,"{'latlong': [-40.413051713467134, -19.36386835275335], 'name': 'Central'}","{'latlong': [-40.37386802241421, -18.482273989187647], 'name': 'Norte'}",20
2001,"{'latlong': [-40.413051713467134, -19.36386835275335], 'name': 'Central'}","{'latlong': [-40.413051713467134, -19.36386835275335], 'name': 'Central'}",3776
2001,"{'latlong': [-40.413051713467134, -19.36386835275335], 'name': 'Central'}","{'latlong': [-40.78119299861817, -20.15896969790739], 'name': 'Metropolitana'}",366
2001,"{'latlong': [-40.78119299861817, -20.15896969790739], 'name': 'Metropolitana'}","{'latlong': [-40.37386802241421, -18.482273989187647], 'name': 'Norte'}",5
2001,"{'latlong': [-40.78119299861817, -20.15896969790739], 'name': 'Metropolitana'}","{'latlong': [-40.413051713467134, -19.36386835275335], 'name': 'Central'}",48
2001,"{'latlong': [-40.78119299861817, -20.15896969790739], 'name': 'Metropolitana'}","{'latlong': [-40.78119299861817, -20.15896969790739], 'name': 'Metropolitana'}",7714
2001,"{'latlong': [-40.78119299861817, -20.15896969790739], 'name': 'Metropolitana'}","{'latlong': [-41.27886237691346, -20.75688096507395], 'name': 'Sul'}",126
2001,"{'latlong': [-41.27886237691346, -20.75688096507395], 'name': 'Sul'}","{'latlong': [-40.413051713467134, -19.36386835275335], 'name': 'Central'}",3
2001,"{'latlong': [-41.27886237691346, -20.75688096507395], 'name': 'Sul'}","{'latlong': [-40.78119299861817, -20.15896969790739], 'name': 'Metropolitana'}",260
2001,"{'latlong': [-41.27886237691346, -20.75688096507395], 'name': 'Sul'}","{'latlong': [-41.27886237691346, -20.75688096507395], 'name': 'Sul'}",4963
2002,"{'latlong': [-40.37386802241421, -18.482273989187647], 'name': 'Norte'}","{'latlong': [-40.37386802241421, -18.482273989187647], 'name': 'Norte'}",1903
2002,"{'latlong': [-40.37386802241421, -18.482273989187647], 'name': 'Norte'}","{'latlong': [-40.413051713467134, -19.36386835275335], 'name': 'Central'}",338
2002,"{'latlong': [-40.37386802241421, -18.482273989187647], 'name': 'Norte'}","{'latlong': [-40.78119299861817, -20.15896969790739], 'name': 'Metropolitana'}",209
2002,"{'latlong': [-40.37386802241421, -18.482273989187647], 'name': 'Norte'}","{'latlong': [-41.27886237691346, -20.75688096507395], 'name': 'Sul'}",2
2002,"{'latlong': [-40.413051713467134, -19.36386835275335], 'name': 'Central'}","{'latlong': [-40.37386802241421, -18.482273989187647], 'name': 'Norte'}",27
2002,"{'latlong': [-40.413051713467134, -19.36386835275335], 'name': 'Central'}","{'latlong': [-40.413051713467134, -19.36386835275335], 'name': 'Central'}",4118
2002,"{'latlong': [-40.413051713467134, -19.36386835275335], 'name': 'Central'}","{'latlong': [-40.78119299861817, -20.15896969790739], 'name': 'Metropolitana'}",675
2002,"{'latlong': [-40.78119299861817, -20.15896969790739], 'name': 'Metropolitana'}","{'latlong': [-40.37386802241421, -18.482273989187647], 'name': 'Norte'}",2
2002,"{'latlong': [-40.78119299861817, -20.15896969790739], 'name': 'Metropolitana'}","{'latlong': [-40.413051713467134, -19.36386835275335], 'name': 'Central'}",65
2002,"{'latlong': [-40.78119299861817, -20.15896969790739], 'name': 'Metropolitana'}","{'latlong': [-40.78119299861817, -20.15896969790739], 'name': 'Metropolitana'}",11995
2002,"{'latlong': [-40.78119299861817, -20.15896969790739], 'name': 'Metropolitana'}","{'latlong': [-41.27886237691346, -20.75688096507395], 'name': 'Sul'}",162
2002,"{'latlong': [-41.27886237691346, -20.75688096507395], 'name': 'Sul'}","{'latlong': [-40.78119299861817, -20.15896969790739], 'name': 'Metropolitana'}",447
2002,"{'latlong': [-41.27886237691346, -20.75688096507395], 'name': 'Sul'}","{'latlong': [-41.27886237691346, -20.75688096507395], 'name': 'Sul'}",5487
2003,"{'latlong': [-40.37386802241421, -18.482273989187647], 'name': 'Norte'}","{'latlong': [-40.37386802241421, -18.482273989187647], 'name': 'Norte'}",2002
2003,"{'latlong': [-40.37386802241421, -18.482273989187647], 'name': 'Norte'}","{'latlong': [-40.413051713467134, -19.36386835275335], 'name': 'Central'}",205
2003,"{'latlong': [-40.37386802241421, -18.482273989187647], 'name': 'Norte'}","{'latlong': [-40.78119299861817, -20.15896969790739], 'name': 'Metropolitana'}",228
2003,"{'latlong': [-40.37386802241421, -18.482273989187647], 'name': 'Norte'}","{'latlong': [-41.27886237691346, -20.75688096507395], 'name': 'Sul'}",7
2003,"{'latlong': [-40.413051713467134, -19.36386835275335], 'name': 'Central'}","{'latlong': [-40.37386802241421, -18.482273989187647], 'name': 'Norte'}",37
2003,"{'latlong': [-40.413051713467134, -19.36386835275335], 'name': 'Central'}","{'latlong': [-40.413051713467134, -19.36386835275335], 'name': 'Central'}",3902
2003,"{'latlong': [-40.413051713467134, -19.36386835275335], 'name': 'Central'}","{'latlong': [-40.78119299861817, -20.15896969790739], 'name': 'Metropolitana'}",390
2003,"{'latlong': [-40.413051713467134, -19.36386835275335], 'name': 'Central'}","{'latlong': [-41.27886237691346, -20.75688096507395], 'name': 'Sul'}",3
2003,"{'latlong': [-40.78119299861817, -20.15896969790739], 'name': 'Metropolitana'}","{'latlong': [-40.37386802241421, -18.482273989187647], 'name': 'Norte'}",1
2003,"{'latlong': [-40.78119299861817, -20.15896969790739], 'name': 'Metropolitana'}","{'latlong': [-40.413051713467134, -19.36386835275335], 'name': 'Central'}",38
2003,"{'latlong': [-40.78119299861817, -20.15896969790739], 'name': 'Metropolitana'}","{'latlong': [-40.78119299861817, -20.15896969790739], 'name': 'Metropolitana'}",13935
2003,"{'latlong': [-40.78119299861817, -20.15896969790739], 'name': 'Metropolitana'}","{'latlong': [-41.27886237691346, -20.75688096507395], 'name': 'Sul'}",178
2003,"{'latlong': [-41.27886237691346, -20.75688096507395], 'name': 'Sul'}","{'latlong': [-40.78119299861817, -20.15896969790739], 'name': 'Metropolitana'}",313
2003,"{'latlong': [-41.27886237691346, -20.75688096507395], 'name': 'Sul'}","{'latlong': [-41.27886237691346, -20.75688096507395], 'name': 'Sul'}",5953
2004,"{'latlong': [-40.37386802241421, -18.482273989187647], 'name': 'Norte'}","{'latlong': [-40.37386802241421, -18.482273989187647], 'name': 'Norte'}",2057
2004,"{'latlong': [-40.37386802241421, -18.482273989187647], 'name': 'Norte'}","{'latlong': [-40.413051713467134, -19.36386835275335], 'name': 'Central'}",167
2004,"{'latlong': [-40.37386802241421, -18.482273989187647], 'name': 'Norte'}","{'latlong': [-40.78119299861817, -20.15896969790739], 'name': 'Metropolitana'}",233
2004,"{'latlong': [-40.37386802241421, -18.482273989187647], 'name': 'Norte'}","{'latlong': [-41.27886237691346, -20.75688096507395], 'name': 'Sul'}",4
2004,"{'latlong': [-40.413051713467134, -19.36386835275335], 'name': 'Central'}","{'latlong': [-40.37386802241421, -18.482273989187647], 'name': 'Norte'}",36
2004,"{'latlong': [-40.413051713467134, -19.36386835275335], 'name': 'Central'}","{'latlong': [-40.413051713467134, -19.36386835275335], 'name': 'Central'}",3924
2004,"{'latlong': [-40.413051713467134, -19.36386835275335], 'name': 'Central'}","{'latlong': [-40.78119299861817, -20.15896969790739], 'name': 'Metropolitana'}",427
2004,"{'latlong': [-40.413051713467134, -19.36386835275335], 'name': 'Central'}","{'latlong': [-41.27886237691346, -20.75688096507395], 'name': 'Sul'}",9
2004,"{'latlong': [-40.78119299861817, -20.15896969790739], 'name': 'Metropolitana'}","{'latlong': [-40.37386802241421, -18.482273989187647], 'name': 'Norte'}",3
2004,"{'latlong': [-40.78119299861817, -20.15896969790739], 'name': 'Metropolitana'}","{'latlong': [-40.413051713467134, -19.36386835275335], 'name': 'Central'}",28
2004,"{'latlong': [-40.78119299861817, -20.15896969790739], 'name': 'Metropolitana'}","{'latlong': [-40.78119299861817, -20.15896969790739], 'name': 'Metropolitana'}",13871
2004,"{'latlong': [-40.78119299861817, -20.15896969790739], 'name': 'Metropolitana'}","{'latlong': [-41.27886237691346, -20.75688096507395], 'name': 'Sul'}",178
2004,"{'latlong': [-41.27886237691346, -20.75688096507395], 'name': 'Sul'}","{'latlong': [-40.78119299861817, -20.15896969790739], 'name': 'Metropolitana'}",364
2004,"{'latlong': [-41.27886237691346, -20.75688096507395], 'name': 'Sul'}","{'latlong': [-41.27886237691346, -20.75688096507395], 'name': 'Sul'}",5728
2005,"{'latlong': [-40.37386802241421, -18.482273989187647], 'name': 'Norte'}","{'latlong': [-40.37386802241421, -18.482273989187647], 'name': 'Norte'}",1739
2005,"{'latlong': [-40.37386802241421, -18.482273989187647], 'name': 'Norte'}","{'latlong': [-40.413051713467134, -19.36386835275335], 'name': 'Central'}",147
2005,"{'latlong': [-40.37386802241421, -18.482273989187647], 'name': 'Norte'}","{'latlong': [-40.78119299861817, -20.15896969790739], 'name': 'Metropolitana'}",174
2005,"{'latlong': [-40.37386802241421, -18.482273989187647], 'name': 'Norte'}","{'latlong': [-41.27886237691346, -20.75688096507395], 'name': 'Sul'}",1
2005,"{'latlong': [-40.413051713467134, -19.36386835275335], 'name': 'Central'}","{'latlong': [-40.37386802241421, -18.482273989187647], 'name': 'Norte'}",47
2005,"{'latlong': [-40.413051713467134, -19.36386835275335], 'name': 'Central'}","{'latlong': [-40.413051713467134, -19.36386835275335], 'name': 'Central'}",3380
2005,"{'latlong': [-40.413051713467134, -19.36386835275335], 'name': 'Central'}","{'latlong': [-40.78119299861817, -20.15896969790739], 'name': 'Metropolitana'}",374
2005,"{'latlong': [-40.413051713467134, -19.36386835275335], 'name': 'Central'}","{'latlong': [-41.27886237691346, -20.75688096507395], 'name': 'Sul'}",5
2005,"{'latlong': [-40.78119299861817, -20.15896969790739], 'name': 'Metropolitana'}","{'latlong': [-40.413051713467134, -19.36386835275335], 'name': 'Central'}",26
2005,"{'latlong': [-40.78119299861817, -20.15896969790739], 'name': 'Metropolitana'}","{'latlong': [-40.78119299861817, -20.15896969790739], 'name': 'Metropolitana'}",11350
2005,"{'latlong': [-40.78119299861817, -20.15896969790739], 'name': 'Metropolitana'}","{'latlong': [-41.27886237691346, -20.75688096507395], 'name': 'Sul'}",109
2005,"{'latlong': [-41.27886237691346, -20.75688096507395], 'name': 'Sul'}","{'latlong': [-40.78119299861817, -20.15896969790739], 'name': 'Metropolitana'}",267
2005,"{'latlong': [-41.27886237691346, -20.75688096507395], 'name': 'Sul'}","{'latlong': [-41.27886237691346, -20.75688096507395], 'name': 'Sul'}",5656
2006,"{'latlong': [-40.37386802241421, -18.482273989187647], 'name': 'Norte'}","{'latlong': [-40.37386802241421, -18.482273989187647], 'name': 'Norte'}",1669
2006,"{'latlong': [-40.37386802241421, -18.482273989187647], 'name': 'Norte'}","{'latlong': [-40.413051713467134, -19.36386835275335], 'name': 'Central'}",106
2006,"{'latlong': [-40.37386802241421, -18.482273989187647], 'name': 'Norte'}","{'latlong': [-40.78119299861817, -20.15896969790739], 'name': 'Metropolitana'}",179
2006,"{'latlong': [-40.37386802241421, -18.482273989187647], 'name': 'Norte'}","{'latlong': [-41.27886237691346, -20.75688096507395], 'name': 'Sul'}",8
2006,"{'latlong': [-40.413051713467134, -19.36386835275335], 'name': 'Central'}","{'latlong': [-40.37386802241421, -18.482273989187647], 'name': 'Norte'}",27
2006,"{'latlong': [-40.413051713467134, -19.36386835275335], 'name': 'Central'}","{'latlong': [-40.413051713467134, -19.36386835275335], 'name': 'Central'}",3026
2006,"{'latlong': [-40.413051713467134, -19.36386835275335], 'name': 'Central'}","{'latlong': [-40.78119299861817, -20.15896969790739], 'name': 'Metropolitana'}",328
2006,"{'latlong': [-40.413051713467134, -19.36386835275335], 'name': 'Central'}","{'latlong': [-41.27886237691346, -20.75688096507395], 'name': 'Sul'}",6
2006,"{'latlong': [-40.78119299861817, -20.15896969790739], 'name': 'Metropolitana'}","{'latlong': [-40.37386802241421, -18.482273989187647], 'name': 'Norte'}",1
2006,"{'latlong': [-40.78119299861817, -20.15896969790739], 'name': 'Metropolitana'}","{'latlong': [-40.413051713467134, -19.36386835275335], 'name': 'Central'}",26
2006,"{'latlong': [-40.78119299861817, -20.15896969790739], 'name': 'Metropolitana'}","{'latlong': [-40.78119299861817, -20.15896969790739], 'name': 'Metropolitana'}",9003
2006,"{'latlong': [-40.78119299861817, -20.15896969790739], 'name': 'Metropolitana'}","{'latlong': [-41.27886237691346, -20.75688096507395], 'name': 'Sul'}",145
2006,"{'latlong': [-41.27886237691346, -20.75688096507395], 'name': 'Sul'}","{'latlong': [-40.78119299861817, -20.15896969790739], 'name': 'Metropolitana'}",229
2006,"{'latlong': [-41.27886237691346, -20.75688096507395], 'name': 'Sul'}","{'latlong': [-41.27886237691346, -20.75688096507395], 'name': 'Sul'}",5257
2007,"{'latlong': [-40.37386802241421, -18.482273989187647], 'name': 'Norte'}","{'latlong': [-40.37386802241421, -18.482273989187647], 'name': 'Norte'}",1816
2007,"{'latlong': [-40.37386802241421, -18.482273989187647], 'name': 'Norte'}","{'latlong': [-40.413051713467134, -19.36386835275335], 'name': 'Central'}",138
2007,"{'latlong': [-40.37386802241421, -18.482273989187647], 'name': 'Norte'}","{'latlong': [-40.78119299861817, -20.15896969790739], 'name': 'Metropolitana'}",176
2007,"{'latlong': [-40.37386802241421, -18.482273989187647], 'name': 'Norte'}","{'latlong': [-41.27886237691346, -20.75688096507395], 'name': 'Sul'}",8
2007,"{'latlong': [-40.413051713467134, -19.36386835275335], 'name': 'Central'}","{'latlong': [-40.37386802241421, -18.482273989187647], 'name': 'Norte'}",18
2007,"{'latlong': [-40.413051713467134, -19.36386835275335], 'name': 'Central'}","{'latlong': [-40.413051713467134, -19.36386835275335], 'name': 'Central'}",3370
2007,"{'latlong': [-40.413051713467134, -19.36386835275335], 'name': 'Central'}","{'latlong': [-40.78119299861817, -20.15896969790739], 'name': 'Metropolitana'}",353
2007,"{'latlong': [-40.413051713467134, -19.36386835275335], 'name': 'Central'}","{'latlong': [-41.27886237691346, -20.75688096507395], 'name': 'Sul'}",1
2007,"{'latlong': [-40.78119299861817, -20.15896969790739], 'name': 'Metropolitana'}","{'latlong': [-40.37386802241421, -18.482273989187647], 'name': 'Norte'}",1
2007,"{'latlong': [-40.78119299861817, -20.15896969790739], 'name': 'Metropolitana'}","{'latlong': [-40.413051713467134, -19.36386835275335], 'name': 'Central'}",31
2007,"{'latlong': [-40.78119299861817, -20.15896969790739], 'name': 'Metropolitana'}","{'latlong': [-40.78119299861817, -20.15896969790739], 'name': 'Metropolitana'}",9390
2007,"{'latlong': [-40.78119299861817, -20.15896969790739], 'name': 'Metropolitana'}","{'latlong': [-41.27886237691346, -20.75688096507395], 'name': 'Sul'}",159
2007,"{'latlong': [-41.27886237691346, -20.75688096507395], 'name': 'Sul'}","{'latlong': [-40.413051713467134, -19.36386835275335], 'name': 'Central'}",3
2007,"{'latlong': [-41.27886237691346, -20.75688096507395], 'name': 'Sul'}","{'latlong': [-40.78119299861817, -20.15896969790739], 'name': 'Metropolitana'}",217
2007,"{'latlong': [-41.27886237691346, -20.75688096507395], 'name': 'Sul'}","{'latlong': [-41.27886237691346, -20.75688096507395], 'name': 'Sul'}",5037
2008,"{'latlong': [-40.37386802241421, -18.482273989187647], 'name': 'Norte'}","{'latlong': [-40.37386802241421, -18.482273989187647], 'name': 'Norte'}",1736
2008,"{'latlong': [-40.37386802241421, -18.482273989187647], 'name': 'Norte'}","{'latlong': [-40.413051713467134, -19.36386835275335], 'name': 'Central'}",213
2008,"{'latlong': [-40.37386802241421, -18.482273989187647], 'name': 'Norte'}","{'latlong': [-40.78119299861817, -20.15896969790739], 'name': 'Metropolitana'}",117
2008,"{'latlong': [-40.37386802241421, -18.482273989187647], 'name': 'Norte'}","{'latlong': [-41.27886237691346, -20.75688096507395], 'name': 'Sul'}",6
2008,"{'latlong': [-40.413051713467134, -19.36386835275335], 'name': 'Central'}","{'latlong': [-40.37386802241421, -18.482273989187647], 'name': 'Norte'}",20
2008,"{'latlong': [-40.413051713467134, -19.36386835275335], 'name': 'Central'}","{'latlong': [-40.413051713467134, -19.36386835275335], 'name': 'Central'}",3299
2008,"{'latlong': [-40.413051713467134, -19.36386835275335], 'name': 'Central'}","{'latlong': [-40.78119299861817, -20.15896969790739], 'name': 'Metropolitana'}",275
2008,"{'latlong': [-40.413051713467134, -19.36386835275335], 'name': 'Central'}","{'latlong': [-41.27886237691346, -20.75688096507395], 'name': 'Sul'}",3
2008,"{'latlong': [-40.78119299861817, -20.15896969790739], 'name': 'Metropolitana'}","{'latlong': [-40.37386802241421, -18.482273989187647], 'name': 'Norte'}",3
2008,"{'latlong': [-40.78119299861817, -20.15896969790739], 'name': 'Metropolitana'}","{'latlong': [-40.413051713467134, -19.36386835275335], 'name': 'Central'}",99
2008,"{'latlong': [-40.78119299861817, -20.15896969790739], 'name': 'Metropolitana'}","{'latlong': [-40.78119299861817, -20.15896969790739], 'name': 'Metropolitana'}",8961
2008,"{'latlong': [-40.78119299861817, -20.15896969790739], 'name': 'Metropolitana'}","{'latlong': [-41.27886237691346, -20.75688096507395], 'name': 'Sul'}",137
2008,"{'latlong': [-41.27886237691346, -20.75688096507395], 'name': 'Sul'}","{'latlong': [-40.413051713467134, -19.36386835275335], 'name': 'Central'}",5
2008,"{'latlong': [-41.27886237691346, -20.75688096507395], 'name': 'Sul'}","{'latlong': [-40.78119299861817, -20.15896969790739], 'name': 'Metropolitana'}",307
2008,"{'latlong': [-41.27886237691346, -20.75688096507395], 'name': 'Sul'}","{'latlong': [-41.27886237691346, -20.75688096507395], 'name': 'Sul'}",5235
2009,"{'latlong': [-40.37386802241421, -18.482273989187647], 'name': 'Norte'}","{'latlong': [-40.37386802241421, -18.482273989187647], 'name': 'Norte'}",1805
2009,"{'latlong': [-40.37386802241421, -18.482273989187647], 'name': 'Norte'}","{'latlong': [-40.413051713467134, -19.36386835275335], 'name': 'Central'}",219
2009,"{'latlong': [-40.37386802241421, -18.482273989187647], 'name': 'Norte'}","{'latlong': [-40.78119299861817, -20.15896969790739], 'name': 'Metropolitana'}",140
2009,"{'latlong': [-40.37386802241421, -18.482273989187647], 'name': 'Norte'}","{'latlong': [-41.27886237691346, -20.75688096507395], 'name': 'Sul'}",1
2009,"{'latlong': [-40.413051713467134, -19.36386835275335], 'name': 'Central'}","{'latlong': [-40.37386802241421, -18.482273989187647], 'name': 'Norte'}",9
2009,"{'latlong': [-40.413051713467134, -19.36386835275335], 'name': 'Central'}","{'latlong': [-40.413051713467134, -19.36386835275335], 'name': 'Central'}",3464
2009,"{'latlong': [-40.413051713467134, -19.36386835275335], 'name': 'Central'}","{'latlong': [-40.78119299861817, -20.15896969790739], 'name': 'Metropolitana'}",234
2009,"{'latlong': [-40.413051713467134, -19.36386835275335], 'name': 'Central'}","{'latlong': [-41.27886237691346, -20.75688096507395], 'name': 'Sul'}",8
2009,"{'latlong': [-40.78119299861817, -20.15896969790739], 'name': 'Metropolitana'}","{'latlong': [-40.37386802241421, -18.482273989187647], 'name': 'Norte'}",1
2009,"{'latlong': [-40.78119299861817, -20.15896969790739], 'name': 'Metropolitana'}","{'latlong': [-40.413051713467134, -19.36386835275335], 'name': 'Central'}",194
2009,"{'latlong': [-40.78119299861817, -20.15896969790739], 'name': 'Metropolitana'}","{'latlong': [-40.78119299861817, -20.15896969790739], 'name': 'Metropolitana'}",10342
2009,"{'latlong': [-40.78119299861817, -20.15896969790739], 'name': 'Metropolitana'}","{'latlong': [-41.27886237691346, -20.75688096507395], 'name': 'Sul'}",170
2009,"{'latlong': [-41.27886237691346, -20.75688096507395], 'name': 'Sul'}","{'latlong': [-40.413051713467134, -19.36386835275335], 'name': 'Central'}",8
2009,"{'latlong': [-41.27886237691346, -20.75688096507395], 'name': 'Sul'}","{'latlong': [-40.78119299861817, -20.15896969790739], 'name': 'Metropolitana'}",372
2009,"{'latlong': [-41.27886237691346, -20.75688096507395], 'name': 'Sul'}","{'latlong': [-41.27886237691346, -20.75688096507395], 'name': 'Sul'}",5165
2010,"{'latlong': [-40.37386802241421, -18.482273989187647], 'name': 'Norte'}","{'latlong': [-40.37386802241421, -18.482273989187647], 'name': 'Norte'}",1857
2010,"{'latlong': [-40.37386802241421, -18.482273989187647], 'name': 'Norte'}","{'latlong': [-40.413051713467134, -19.36386835275335], 'name': 'Central'}",233
2010,"{'latlong': [-40.37386802241421, -18.482273989187647], 'name': 'Norte'}","{'latlong': [-40.78119299861817, -20.15896969790739], 'name': 'Metropolitana'}",220
2010,"{'latlong': [-40.37386802241421, -18.482273989187647], 'name': 'Norte'}","{'latlong': [-41.27886237691346, -20.75688096507395], 'name': 'Sul'}",2
2010,"{'latlong': [-40.413051713467134, -19.36386835275335], 'name': 'Central'}","{'latlong': [-40.37386802241421, -18.482273989187647], 'name': 'Norte'}",23
2010,"{'latlong': [-40.413051713467134, -19.36386835275335], 'name': 'Central'}","{'latlong': [-40.413051713467134, -19.36386835275335], 'name': 'Central'}",3461
2010,"{'latlong': [-40.413051713467134, -19.36386835275335], 'name': 'Central'}","{'latlong': [-40.78119299861817, -20.15896969790739], 'name': 'Metropolitana'}",348
2010,"{'latlong': [-40.413051713467134, -19.36386835275335], 'name': 'Central'}","{'latlong': [-41.27886237691346, -20.75688096507395], 'name': 'Sul'}",9
2010,"{'latlong': [-40.78119299861817, -20.15896969790739], 'name': 'Metropolitana'}","{'latlong': [-40.37386802241421, -18.482273989187647], 'name': 'Norte'}",3
2010,"{'latlong': [-40.78119299861817, -20.15896969790739], 'name': 'Metropolitana'}","{'latlong': [-40.413051713467134, -19.36386835275335], 'name': 'Central'}",150
2010,"{'latlong': [-40.78119299861817, -20.15896969790739], 'name': 'Metropolitana'}","{'latlong': [-40.78119299861817, -20.15896969790739], 'name': 'Metropolitana'}",10874
2010,"{'latlong': [-40.78119299861817, -20.15896969790739], 'name': 'Metropolitana'}","{'latlong': [-41.27886237691346, -20.75688096507395], 'name': 'Sul'}",203
2010,"{'latlong': [-41.27886237691346, -20.75688096507395], 'name': 'Sul'}","{'latlong': [-40.413051713467134, -19.36386835275335], 'name': 'Central'}",4
2010,"{'latlong': [-41.27886237691346, -20.75688096507395], 'name': 'Sul'}","{'latlong': [-40.78119299861817, -20.15896969790739], 'name': 'Metropolitana'}",529
2010,"{'latlong': [-41.27886237691346, -20.75688096507395], 'name': 'Sul'}","{'latlong': [-41.27886237691346, -20.75688096507395], 'name': 'Sul'}",5280
2011,"{'latlong': [-40.37386802241421, -18.482273989187647], 'name': 'Norte'}","{'latlong': [-40.37386802241421, -18.482273989187647], 'name': 'Norte'}",2005
2011,"{'latlong': [-40.37386802241421, -18.482273989187647], 'name': 'Norte'}","{'latlong': [-40.413051713467134, -19.36386835275335], 'name': 'Central'}",297
2011,"{'latlong': [-40.37386802241421, -18.482273989187647], 'name': 'Norte'}","{'latlong': [-40.78119299861817, -20.15896969790739], 'name': 'Metropolitana'}",493
2011,"{'latlong': [-40.413051713467134, -19.36386835275335], 'name': 'Central'}","{'latlong': [-40.37386802241421, -18.482273989187647], 'name': 'Norte'}",36
2011,"{'latlong': [-40.413051713467134, -19.36386835275335], 'name': 'Central'}","{'latlong': [-40.413051713467134, -19.36386835275335], 'name': 'Central'}",3533
2011,"{'latlong': [-40.413051713467134, -19.36386835275335], 'name': 'Central'}","{'latlong': [-40.78119299861817, -20.15896969790739], 'name': 'Metropolitana'}",512
2011,"{'latlong': [-40.413051713467134, -19.36386835275335], 'name': 'Central'}","{'latlong': [-41.27886237691346, -20.75688096507395], 'name': 'Sul'}",5
2011,"{'latlong': [-40.78119299861817, -20.15896969790739], 'name': 'Metropolitana'}","{'latlong': [-40.37386802241421, -18.482273989187647], 'name': 'Norte'}",5
2011,"{'latlong': [-40.78119299861817, -20.15896969790739], 'name': 'Metropolitana'}","{'latlong': [-40.413051713467134, -19.36386835275335], 'name': 'Central'}",127
2011,"{'latlong': [-40.78119299861817, -20.15896969790739], 'name': 'Metropolitana'}","{'latlong': [-40.78119299861817, -20.15896969790739], 'name': 'Metropolitana'}",12967
2011,"{'latlong': [-40.78119299861817, -20.15896969790739], 'name': 'Metropolitana'}","{'latlong': [-41.27886237691346, -20.75688096507395], 'name': 'Sul'}",194
2011,"{'latlong': [-41.27886237691346, -20.75688096507395], 'name': 'Sul'}","{'latlong': [-40.37386802241421, -18.482273989187647], 'name': 'Norte'}",2
2011,"{'latlong': [-41.27886237691346, -20.75688096507395], 'name': 'Sul'}","{'latlong': [-40.413051713467134, -19.36386835275335], 'name': 'Central'}",2
2011,"{'latlong': [-41.27886237691346, -20.75688096507395], 'name': 'Sul'}","{'latlong': [-40.78119299861817, -20.15896969790739], 'name': 'Metropolitana'}",796
2011,"{'latlong': [-41.27886237691346, -20.75688096507395], 'name': 'Sul'}","{'latlong': [-41.27886237691346, -20.75688096507395], 'name': 'Sul'}",5939
2012,"{'latlong': [-40.37386802241421, -18.482273989187647], 'name': 'Norte'}","{'latlong': [-40.37386802241421, -18.482273989187647], 'name': 'Norte'}",2116
2012,"{'latlong': [-40.37386802241421, -18.482273989187647], 'name': 'Norte'}","{'latlong': [-40.413051713467134, -19.36386835275335], 'name': 'Central'}",383
2012,"{'latlong': [-40.37386802241421, -18.482273989187647], 'name': 'Norte'}","{'latlong': [-40.78119299861817, -20.15896969790739], 'name': 'Metropolitana'}",580
2012,"{'latlong': [-40.37386802241421, -18.482273989187647], 'name': 'Norte'}","{'latlong': [-41.27886237691346, -20.75688096507395], 'name': 'Sul'}",2
2012,"{'latlong': [-40.413051713467134, -19.36386835275335], 'name': 'Central'}","{'latlong': [-40.37386802241421, -18.482273989187647], 'name': 'Norte'}",39
2012,"{'latlong': [-40.413051713467134, -19.36386835275335], 'name': 'Central'}","{'latlong': [-40.413051713467134, -19.36386835275335], 'name': 'Central'}",3626
2012,"{'latlong': [-40.413051713467134, -19.36386835275335], 'name': 'Central'}","{'latlong': [-40.78119299861817, -20.15896969790739], 'name': 'Metropolitana'}",726
2012,"{'latlong': [-40.413051713467134, -19.36386835275335], 'name': 'Central'}","{'latlong': [-41.27886237691346, -20.75688096507395], 'name': 'Sul'}",5
2012,"{'latlong': [-40.78119299861817, -20.15896969790739], 'name': 'Metropolitana'}","{'latlong': [-40.37386802241421, -18.482273989187647], 'name': 'Norte'}",4
2012,"{'latlong': [-40.78119299861817, -20.15896969790739], 'name': 'Metropolitana'}","{'latlong': [-40.413051713467134, -19.36386835275335], 'name': 'Central'}",140
2012,"{'latlong': [-40.78119299861817, -20.15896969790739], 'name': 'Metropolitana'}","{'latlong': [-40.78119299861817, -20.15896969790739], 'name': 'Metropolitana'}",12701
2012,"{'latlong': [-40.78119299861817, -20.15896969790739], 'name': 'Metropolitana'}","{'latlong': [-41.27886237691346, -20.75688096507395], 'name': 'Sul'}",188
2012,"{'latlong': [-41.27886237691346, -20.75688096507395], 'name': 'Sul'}","{'latlong': [-40.413051713467134, -19.36386835275335], 'name': 'Central'}",2
2012,"{'latlong': [-41.27886237691346, -20.75688096507395], 'name': 'Sul'}","{'latlong': [-40.78119299861817, -20.15896969790739], 'name': 'Metropolitana'}",977
2012,"{'latlong': [-41.27886237691346, -20.75688096507395], 'name': 'Sul'}","{'latlong': [-41.27886237691346, -20.75688096507395], 'name': 'Sul'}",5603
2013,"{'latlong': [-40.37386802241421, -18.482273989187647], 'name': 'Norte'}","{'latlong': [-40.37386802241421, -18.482273989187647], 'name': 'Norte'}",2036
2013,"{'latlong': [-40.37386802241421, -18.482273989187647], 'name': 'Norte'}","{'latlong': [-40.413051713467134, -19.36386835275335], 'name': 'Central'}",278
2013,"{'latlong': [-40.37386802241421, -18.482273989187647], 'name': 'Norte'}","{'latlong': [-40.78119299861817, -20.15896969790739], 'name': 'Metropolitana'}",279
2013,"{'latlong': [-40.37386802241421, -18.482273989187647], 'name': 'Norte'}","{'latlong': [-41.27886237691346, -20.75688096507395], 'name': 'Sul'}",2
2013,"{'latlong': [-40.413051713467134, -19.36386835275335], 'name': 'Central'}","{'latlong': [-40.37386802241421, -18.482273989187647], 'name': 'Norte'}",37
2013,"{'latlong': [-40.413051713467134, -19.36386835275335], 'name': 'Central'}","{'latlong': [-40.413051713467134, -19.36386835275335], 'name': 'Central'}",3657
2013,"{'latlong': [-40.413051713467134, -19.36386835275335], 'name': 'Central'}","{'latlong': [-40.78119299861817, -20.15896969790739], 'name': 'Metropolitana'}",337
2013,"{'latlong': [-40.413051713467134, -19.36386835275335], 'name': 'Central'}","{'latlong': [-41.27886237691346, -20.75688096507395], 'name': 'Sul'}",2
2013,"{'latlong': [-40.78119299861817, -20.15896969790739], 'name': 'Metropolitana'}","{'latlong': [-40.37386802241421, -18.482273989187647], 'name': 'Norte'}",10
2013,"{'latlong': [-40.78119299861817, -20.15896969790739], 'name': 'Metropolitana'}","{'latlong': [-40.413051713467134, -19.36386835275335], 'name': 'Central'}",102
2013,"{'latlong': [-40.78119299861817, -20.15896969790739], 'name': 'Metropolitana'}","{'latlong': [-40.78119299861817, -20.15896969790739], 'name': 'Metropolitana'}",9666
2013,"{'latlong': [-40.78119299861817, -20.15896969790739], 'name': 'Metropolitana'}","{'latlong': [-41.27886237691346, -20.75688096507395], 'name': 'Sul'}",157
2013,"{'latlong': [-41.27886237691346, -20.75688096507395], 'name': 'Sul'}","{'latlong': [-40.413051713467134, -19.36386835275335], 'name': 'Central'}",4
2013,"{'latlong': [-41.27886237691346, -20.75688096507395], 'name': 'Sul'}","{'latlong': [-40.78119299861817, -20.15896969790739], 'name': 'Metropolitana'}",436
2013,"{'latlong': [-41.27886237691346, -20.75688096507395], 'name': 'Sul'}","{'latlong': [-41.27886237691346, -20.75688096507395], 'name': 'Sul'}",5945
2014,"{'latlong': [-40.37386802241421, -18.482273989187647], 'name': 'Norte'}","{'latlong': [-40.37386802241421, -18.482273989187647], 'name': 'Norte'}",2380
2014,"{'latlong': [-40.37386802241421, -18.482273989187647], 'name': 'Norte'}","{'latlong': [-40.413051713467134, -19.36386835275335], 'name': 'Central'}",291
2014,"{'latlong': [-40.37386802241421, -18.482273989187647], 'name': 'Norte'}","{'latlong': [-40.78119299861817, -20.15896969790739], 'name': 'Metropolitana'}",310
2014,"{'latlong': [-40.37386802241421, -18.482273989187647], 'name': 'Norte'}","{'latlong': [-41.27886237691346, -20.75688096507395], 'name': 'Sul'}",1
2014,"{'latlong': [-40.413051713467134, -19.36386835275335], 'name': 'Central'}","{'latlong': [-40.37386802241421, -18.482273989187647], 'name': 'Norte'}",21
2014,"{'latlong': [-40.413051713467134, -19.36386835275335], 'name': 'Central'}","{'latlong': [-40.413051713467134, -19.36386835275335], 'name': 'Central'}",4402
2014,"{'latlong': [-40.413051713467134, -19.36386835275335], 'name': 'Central'}","{'latlong': [-40.78119299861817, -20.15896969790739], 'name': 'Metropolitana'}",354
2014,"{'latlong': [-40.413051713467134, -19.36386835275335], 'name': 'Central'}","{'latlong': [-41.27886237691346, -20.75688096507395], 'name': 'Sul'}",4
2014,"{'latlong': [-40.78119299861817, -20.15896969790739], 'name': 'Metropolitana'}","{'latlong': [-40.37386802241421, -18.482273989187647], 'name': 'Norte'}",5
2014,"{'latlong': [-40.78119299861817, -20.15896969790739], 'name': 'Metropolitana'}","{'latlong': [-40.413051713467134, -19.36386835275335], 'name': 'Central'}",164
2014,"{'latlong': [-40.78119299861817, -20.15896969790739], 'name': 'Metropolitana'}","{'latlong': [-40.78119299861817, -20.15896969790739], 'name': 'Metropolitana'}",10350
2014,"{'latlong': [-40.78119299861817, -20.15896969790739], 'name': 'Metropolitana'}","{'latlong': [-41.27886237691346, -20.75688096507395], 'name': 'Sul'}",170
2014,"{'latlong': [-41.27886237691346, -20.75688096507395], 'name': 'Sul'}","{'latlong': [-40.413051713467134, -19.36386835275335], 'name': 'Central'}",1
2014,"{'latlong': [-41.27886237691346, -20.75688096507395], 'name': 'Sul'}","{'latlong': [-40.78119299861817, -20.15896969790739], 'name': 'Metropolitana'}",469
2014,"{'latlong': [-41.27886237691346, -20.75688096507395], 'name': 'Sul'}","{'latlong': [-41.27886237691346, -20.75688096507395], 'name': 'Sul'}",6272
2015,"{'latlong': [-40.37386802241421, -18.482273989187647], 'name': 'Norte'}","{'latlong': [-40.37386802241421, -18.482273989187647], 'name': 'Norte'}",1977
2015,"{'latlong': [-40.37386802241421, -18.482273989187647], 'name': 'Norte'}","{'latlong': [-40.413051713467134, -19.36386835275335], 'name': 'Central'}",501
2015,"{'latlong': [-40.37386802241421, -18.482273989187647], 'name': 'Norte'}","{'latlong': [-40.78119299861817, -20.15896969790739], 'name': 'Metropolitana'}",297
2015,"{'latlong': [-40.37386802241421, -18.482273989187647], 'name': 'Norte'}","{'latlong': [-41.27886237691346, -20.75688096507395], 'name': 'Sul'}",8
2015,"{'latlong': [-40.413051713467134, -19.36386835275335], 'name': 'Central'}","{'latlong': [-40.37386802241421, -18.482273989187647], 'name': 'Norte'}",21
2015,"{'latlong': [-40.413051713467134, -19.36386835275335], 'name': 'Central'}","{'latlong': [-40.413051713467134, -19.36386835275335], 'name': 'Central'}",4142
2015,"{'latlong': [-40.413051713467134, -19.36386835275335], 'name': 'Central'}","{'latlong': [-40.78119299861817, -20.15896969790739], 'name': 'Metropolitana'}",316
2015,"{'latlong': [-40.413051713467134, -19.36386835275335], 'name': 'Central'}","{'latlong': [-41.27886237691346, -20.75688096507395], 'name': 'Sul'}",1
2015,"{'latlong': [-40.78119299861817, -20.15896969790739], 'name': 'Metropolitana'}","{'latlong': [-40.37386802241421, -18.482273989187647], 'name': 'Norte'}",6
2015,"{'latlong': [-40.78119299861817, -20.15896969790739], 'name': 'Metropolitana'}","{'latlong': [-40.413051713467134, -19.36386835275335], 'name': 'Central'}",191
2015,"{'latlong': [-40.78119299861817, -20.15896969790739], 'name': 'Metropolitana'}","{'latlong': [-40.78119299861817, -20.15896969790739], 'name': 'Metropolitana'}",11101
2015,"{'latlong': [-40.78119299861817, -20.15896969790739], 'name': 'Metropolitana'}","{'latlong': [-41.27886237691346, -20.75688096507395], 'name': 'Sul'}",199
2015,"{'latlong': [-41.27886237691346, -20.75688096507395], 'name': 'Sul'}","{'latlong': [-40.413051713467134, -19.36386835275335], 'name': 'Central'}",5
2015,"{'latlong': [-41.27886237691346, -20.75688096507395], 'name': 'Sul'}","{'latlong': [-40.78119299861817, -20.15896969790739], 'name': 'Metropolitana'}",573
2015,"{'latlong': [-41.27886237691346, -20.75688096507395], 'name': 'Sul'}","{'latlong': [-41.27886237691346, -20.75688096507395], 'name': 'Sul'}",5809
2016,"{'latlong': [-40.37386802241421, -18.482273989187647], 'name': 'Norte'}","{'latlong': [-40.37386802241421, -18.482273989187647], 'name': 'Norte'}",2221
2016,"{'latlong': [-40.37386802241421, -18.482273989187647], 'name': 'Norte'}","{'latlong': [-40.413051713467134, -19.36386835275335], 'name': 'Central'}",794
2016,"{'latlong': [-40.37386802241421, -18.482273989187647], 'name': 'Norte'}","{'latlong': [-40.78119299861817, -20.15896969790739], 'name': 'Metropolitana'}",215
2016,"{'latlong': [-40.37386802241421, -18.482273989187647], 'name': 'Norte'}","{'latlong': [-41.27886237691346, -20.75688096507395], 'name': 'Sul'}",5
2016,"{'latlong': [-40.413051713467134, -19.36386835275335], 'name': 'Central'}","{'latlong': [-40.37386802241421, -18.482273989187647], 'name': 'Norte'}",16
2016,"{'latlong': [-40.413051713467134, -19.36386835275335], 'name': 'Central'}","{'latlong': [-40.413051713467134, -19.36386835275335], 'name': 'Central'}",4377
2016,"{'latlong': [-40.413051713467134, -19.36386835275335], 'name': 'Central'}","{'latlong': [-40.78119299861817, -20.15896969790739], 'name': 'Metropolitana'}",380
2016,"{'latlong': [-40.413051713467134, -19.36386835275335], 'name': 'Central'}","{'latlong': [-41.27886237691346, -20.75688096507395], 'name': 'Sul'}",1
2016,"{'latlong': [-40.78119299861817, -20.15896969790739], 'name': 'Metropolitana'}","{'latlong': [-40.37386802241421, -18.482273989187647], 'name': 'Norte'}",13
2016,"{'latlong': [-40.78119299861817, -20.15896969790739], 'name': 'Metropolitana'}","{'latlong': [-40.413051713467134, -19.36386835275335], 'name': 'Central'}",246
2016,"{'latlong': [-40.78119299861817, -20.15896969790739], 'name': 'Metropolitana'}","{'latlong': [-40.78119299861817, -20.15896969790739], 'name': 'Metropolitana'}",12269
2016,"{'latlong': [-40.78119299861817, -20.15896969790739], 'name': 'Metropolitana'}","{'latlong': [-41.27886237691346, -20.75688096507395], 'name': 'Sul'}",194
2016,"{'latlong': [-41.27886237691346, -20.75688096507395], 'name': 'Sul'}","{'latlong': [-40.413051713467134, -19.36386835275335], 'name': 'Central'}",24
2016,"{'latlong': [-41.27886237691346, -20.75688096507395], 'name': 'Sul'}","{'latlong': [-40.78119299861817, -20.15896969790739], 'name': 'Metropolitana'}",750
2016,"{'latlong': [-41.27886237691346, -20.75688096507395], 'name': 'Sul'}","{'latlong': [-41.27886237691346, -20.75688096507395], 'name': 'Sul'}",5197
2017,"{'latlong': [-40.37386802241421, -18.482273989187647], 'name': 'Norte'}","{'latlong': [-40.37386802241421, -18.482273989187647], 'name': 'Norte'}",2094
2017,"{'latlong': [-40.37386802241421, -18.482273989187647], 'name': 'Norte'}","{'latlong': [-40.413051713467134, -19.36386835275335], 'name': 'Central'}",1019
2017,"{'latlong': [-40.37386802241421, -18.482273989187647], 'name': 'Norte'}","{'latlong': [-40.78119299861817, -20.15896969790739], 'name': 'Metropolitana'}",299
2017,"{'latlong': [-40.413051713467134, -19.36386835275335], 'name': 'Central'}","{'latlong': [-40.37386802241421, -18.482273989187647], 'name': 'Norte'}",17
2017,"{'latlong': [-40.413051713467134, -19.36386835275335], 'name': 'Central'}","{'latlong': [-40.413051713467134, -19.36386835275335], 'name': 'Central'}",4420
2017,"{'latlong': [-40.413051713467134, -19.36386835275335], 'name': 'Central'}","{'latlong': [-40.78119299861817, -20.15896969790739], 'name': 'Metropolitana'}",406
2017,"{'latlong': [-40.78119299861817, -20.15896969790739], 'name': 'Metropolitana'}","{'latlong': [-40.37386802241421, -18.482273989187647], 'name': 'Norte'}",7
2017,"{'latlong': [-40.78119299861817, -20.15896969790739], 'name': 'Metropolitana'}","{'latlong': [-40.413051713467134, -19.36386835275335], 'name': 'Central'}",293
2017,"{'latlong': [-40.78119299861817, -20.15896969790739], 'name': 'Metropolitana'}","{'latlong': [-40.78119299861817, -20.15896969790739], 'name': 'Metropolitana'}",12399
2017,"{'latlong': [-40.78119299861817, -20.15896969790739], 'name': 'Metropolitana'}","{'latlong': [-41.27886237691346, -20.75688096507395], 'name': 'Sul'}",169
2017,"{'latlong': [-41.27886237691346, -20.75688096507395], 'name': 'Sul'}","{'latlong': [-40.37386802241421, -18.482273989187647], 'name': 'Norte'}",1
2017,"{'latlong': [-41.27886237691346, -20.75688096507395], 'name': 'Sul'}","{'latlong': [-40.413051713467134, -19.36386835275335], 'name': 'Central'}",24
2017,"{'latlong': [-41.27886237691346, -20.75688096507395], 'name': 'Sul'}","{'latlong': [-40.78119299861817, -20.15896969790739], 'name': 'Metropolitana'}",911
2017,"{'latlong': [-41.27886237691346, -20.75688096507395], 'name': 'Sul'}","{'latlong': [-41.27886237691346, -20.75688096507395], 'name': 'Sul'}",5407
2018,"{'latlong': [-40.37386802241421, -18.482273989187647], 'name': 'Norte'}","{'latlong': [-40.37386802241421, -18.482273989187647], 'name': 'Norte'}",1920
2018,"{'latlong': [-40.37386802241421, -18.482273989187647], 'name': 'Norte'}","{'latlong': [-40.413051713467134, -19.36386835275335], 'name': 'Central'}",904
2018,"{'latlong': [-40.37386802241421, -18.482273989187647], 'name': 'Norte'}","{'latlong': [-40.78119299861817, -20.15896969790739], 'name': 'Metropolitana'}",356
2018,"{'latlong': [-40.37386802241421, -18.482273989187647], 'name': 'Norte'}","{'latlong': [-41.27886237691346, -20.75688096507395], 'name': 'Sul'}",1
2018,"{'latlong': [-40.413051713467134, -19.36386835275335], 'name': 'Central'}","{'latlong': [-40.37386802241421, -18.482273989187647], 'name': 'Norte'}",10
2018,"{'latlong': [-40.413051713467134, -19.36386835275335], 'name': 'Central'}","{'latlong': [-40.413051713467134, -19.36386835275335], 'name': 'Central'}",4377
2018,"{'latlong': [-40.413051713467134, -19.36386835275335], 'name': 'Central'}","{'latlong': [-40.78119299861817, -20.15896969790739], 'name': 'Metropolitana'}",375
2018,"{'latlong': [-40.413051713467134, -19.36386835275335], 'name': 'Central'}","{'latlong': [-41.27886237691346, -20.75688096507395], 'name': 'Sul'}",1
2018,"{'latlong': [-40.78119299861817, -20.15896969790739], 'name': 'Metropolitana'}","{'latlong': [-40.37386802241421, -18.482273989187647], 'name': 'Norte'}",10
2018,"{'latlong': [-40.78119299861817, -20.15896969790739], 'name': 'Metropolitana'}","{'latlong': [-40.413051713467134, -19.36386835275335], 'name': 'Central'}",332
2018,"{'latlong': [-40.78119299861817, -20.15896969790739], 'name': 'Metropolitana'}","{'latlong': [-40.78119299861817, -20.15896969790739], 'name': 'Metropolitana'}",12599
2018,"{'latlong': [-40.78119299861817, -20.15896969790739], 'name': 'Metropolitana'}","{'latlong': [-41.27886237691346, -20.75688096507395], 'name': 'Sul'}",181
2018,"{'latlong': [-41.27886237691346, -20.75688096507395], 'name': 'Sul'}","{'latlong': [-40.37386802241421, -18.482273989187647], 'name': 'Norte'}",3
2018,"{'latlong': [-41.27886237691346, -20.75688096507395], 'name': 'Sul'}","{'latlong': [-40.413051713467134, -19.36386835275335], 'name': 'Central'}",55
2018,"{'latlong': [-41.27886237691346, -20.75688096507395], 'name': 'Sul'}","{'latlong': [-40.78119299861817, -20.15896969790739], 'name': 'Metropolitana'}",728
2018,"{'latlong': [-41.27886237691346, -20.75688096507395], 'name': 'Sul'}","{'latlong': [-41.27886237691346, -20.75688096507395], 'name': 'Sul'}",6092
2019,"{'latlong': [-40.37386802241421, -18.482273989187647], 'name': 'Norte'}","{'latlong': [-40.37386802241421, -18.482273989187647], 'name': 'Norte'}",1948
2019,"{'latlong': [-40.37386802241421, -18.482273989187647], 'name': 'Norte'}","{'latlong': [-40.413051713467134, -19.36386835275335], 'name': 'Central'}",938
2019,"{'latlong': [-40.37386802241421, -18.482273989187647], 'name': 'Norte'}","{'latlong': [-40.78119299861817, -20.15896969790739], 'name': 'Metropolitana'}",577
2019,"{'latlong': [-40.37386802241421, -18.482273989187647], 'name': 'Norte'}","{'latlong': [-41.27886237691346, -20.75688096507395], 'name': 'Sul'}",3
2019,"{'latlong': [-40.413051713467134, -19.36386835275335], 'name': 'Central'}","{'latlong': [-40.37386802241421, -18.482273989187647], 'name': 'Norte'}",24
2019,"{'latlong': [-40.413051713467134, -19.36386835275335], 'name': 'Central'}","{'latlong': [-40.413051713467134, -19.36386835275335], 'name': 'Central'}",4679
2019,"{'latlong': [-40.413051713467134, -19.36386835275335], 'name': 'Central'}","{'latlong': [-40.78119299861817, -20.15896969790739], 'name': 'Metropolitana'}",572
2019,"{'latlong': [-40.78119299861817, -20.15896969790739], 'name': 'Metropolitana'}","{'latlong': [-40.37386802241421, -18.482273989187647], 'name': 'Norte'}",5
2019,"{'latlong': [-40.78119299861817, -20.15896969790739], 'name': 'Metropolitana'}","{'latlong': [-40.413051713467134, -19.36386835275335], 'name': 'Central'}",325
2019,"{'latlong': [-40.78119299861817, -20.15896969790739], 'name': 'Metropolitana'}","{'latlong': [-40.78119299861817, -20.15896969790739], 'name': 'Metropolitana'}",12363
2019,"{'latlong': [-40.78119299861817, -20.15896969790739], 'name': 'Metropolitana'}","{'latlong': [-41.27886237691346, -20.75688096507395], 'name': 'Sul'}",182
2019,"{'latlong': [-41.27886237691346, -20.75688096507395], 'name': 'Sul'}","{'latlong': [-40.413051713467134, -19.36386835275335], 'name': 'Central'}",30
2019,"{'latlong': [-41.27886237691346, -20.75688096507395], 'name': 'Sul'}","{'latlong': [-40.78119299861817, -20.15896969790739], 'name': 'Metropolitana'}",742
2019,"{'latlong': [-41.27886237691346, -20.75688096507395], 'name': 'Sul'}","{'latlong': [-41.27886237691346, -20.75688096507395], 'name': 'Sul'}",5459
2020,"{'latlong': [-40.37386802241421, -18.482273989187647], 'name': 'Norte'}","{'latlong': [-40.37386802241421, -18.482273989187647], 'name': 'Norte'}",825
2020,"{'latlong': [-40.37386802241421, -18.482273989187647], 'name': 'Norte'}","{'latlong': [-40.413051713467134, -19.36386835275335], 'name': 'Central'}",431
2020,"{'latlong': [-40.37386802241421, -18.482273989187647], 'name': 'Norte'}","{'latlong': [-40.78119299861817, -20.15896969790739], 'name': 'Metropolitana'}",108
2020,"{'latlong': [-40.413051713467134, -19.36386835275335], 'name': 'Central'}","{'latlong': [-40.37386802241421, -18.482273989187647], 'name': 'Norte'}",12
2020,"{'latlong': [-40.413051713467134, -19.36386835275335], 'name': 'Central'}","{'latlong': [-40.413051713467134, -19.36386835275335], 'name': 'Central'}",1717
2020,"{'latlong': [-40.413051713467134, -19.36386835275335], 'name': 'Central'}","{'latlong': [-40.78119299861817, -20.15896969790739], 'name': 'Metropolitana'}",178
2020,"{'latlong': [-40.78119299861817, -20.15896969790739], 'name': 'Metropolitana'}","{'latlong': [-40.37386802241421, -18.482273989187647], 'name': 'Norte'}",3
2020,"{'latlong': [-40.78119299861817, -20.15896969790739], 'name': 'Metropolitana'}","{'latlong': [-40.413051713467134, -19.36386835275335], 'name': 'Central'}",110
2020,"{'latlong': [-40.78119299861817, -20.15896969790739], 'name': 'Metropolitana'}","{'latlong': [-40.78119299861817, -20.15896969790739], 'name': 'Metropolitana'}",4387
2020,"{'latlong': [-40.78119299861817, -20.15896969790739], 'name': 'Metropolitana'}","{'latlong': [-41.27886237691346, -20.75688096507395], 'name': 'Sul'}",48
2020,"{'latlong': [-41.27886237691346, -20.75688096507395], 'name': 'Sul'}","{'latlong': [-40.413051713467134, -19.36386835275335], 'name': 'Central'}",16
2020,"{'latlong': [-41.27886237691346, -20.75688096507395], 'name': 'Sul'}","{'latlong': [-40.78119299861817, -20.15896969790739], 'name': 'Metropolitana'}",285
2020,"{'latlong': [-41.27886237691346, -20.75688096507395], 'name': 'Sul'}","{'latlong': [-41.27886237691346, -20.75688096507395], 'name': 'Sul'}",1631
