year,from,to,hospitalizations,distance
1994,"{'latlong': [-38.26279503575439, -5.2411729332342185], 'name': '5ª Macro - Litoral Leste/Jaguaribe'}","{'latlong': [-38.26279503575439, -5.2411729332342185], 'name': '5ª Macro - Litoral Leste/Jaguaribe'}",142,0.0
1994,"{'latlong': [-38.26279503575439, -5.2411729332342185], 'name': '5ª Macro - Litoral Leste/Jaguaribe'}","{'latlong': [-39.04198570967633, -3.972272374155126], 'name': '1ª Macro - Fortaleza'}",21,140.29094146329456
1994,"{'latlong': [-38.26279503575439, -5.2411729332342185], 'name': '5ª Macro - Litoral Leste/Jaguaribe'}","{'latlong': [-39.4424043736871, -6.6823328399832285], 'name': '3ª Macro - Cariri'}",2,181.09845882673415
1994,"{'latlong': [-39.04198570967633, -3.972272374155126], 'name': '1ª Macro - Fortaleza'}","{'latlong': [-38.26279503575439, -5.2411729332342185], 'name': '5ª Macro - Litoral Leste/Jaguaribe'}",2,140.29094146329456
1994,"{'latlong': [-39.04198570967633, -3.972272374155126], 'name': '1ª Macro - Fortaleza'}","{'latlong': [-39.04198570967633, -3.972272374155126], 'name': '1ª Macro - Fortaleza'}",1654,0.0
1994,"{'latlong': [-39.04198570967633, -3.972272374155126], 'name': '1ª Macro - Fortaleza'}","{'latlong': [-40.49827164718406, -4.270228494122716], 'name': '2ª Macro - Sobral'}",8,163.69432955223883
1994,"{'latlong': [-39.4424043736871, -6.6823328399832285], 'name': '3ª Macro - Cariri'}","{'latlong': [-39.04198570967633, -3.972272374155126], 'name': '1ª Macro - Fortaleza'}",12,238.1362922408207
1994,"{'latlong': [-39.4424043736871, -6.6823328399832285], 'name': '3ª Macro - Cariri'}","{'latlong': [-39.4424043736871, -6.6823328399832285], 'name': '3ª Macro - Cariri'}",925,0.0
1994,"{'latlong': [-39.5970436535868, -5.3600126499898675], 'name': '4ª Macro - Sertão Central'}","{'latlong': [-39.04198570967633, -3.972272374155126], 'name': '1ª Macro - Fortaleza'}",22,134.60427573279884
1994,"{'latlong': [-39.5970436535868, -5.3600126499898675], 'name': '4ª Macro - Sertão Central'}","{'latlong': [-39.5970436535868, -5.3600126499898675], 'name': '4ª Macro - Sertão Central'}",137,0.0
1994,"{'latlong': [-39.5970436535868, -5.3600126499898675], 'name': '4ª Macro - Sertão Central'}","{'latlong': [-40.49827164718406, -4.270228494122716], 'name': '2ª Macro - Sobral'}",2,136.6063403884904
1994,"{'latlong': [-40.49827164718406, -4.270228494122716], 'name': '2ª Macro - Sobral'}","{'latlong': [-39.04198570967633, -3.972272374155126], 'name': '1ª Macro - Fortaleza'}",28,163.69432955223883
1994,"{'latlong': [-40.49827164718406, -4.270228494122716], 'name': '2ª Macro - Sobral'}","{'latlong': [-40.49827164718406, -4.270228494122716], 'name': '2ª Macro - Sobral'}",670,0.0
1995,"{'latlong': [-38.26279503575439, -5.2411729332342185], 'name': '5ª Macro - Litoral Leste/Jaguaribe'}","{'latlong': [-38.26279503575439, -5.2411729332342185], 'name': '5ª Macro - Litoral Leste/Jaguaribe'}",1195,0.0
1995,"{'latlong': [-38.26279503575439, -5.2411729332342185], 'name': '5ª Macro - Litoral Leste/Jaguaribe'}","{'latlong': [-39.04198570967633, -3.972272374155126], 'name': '1ª Macro - Fortaleza'}",296,140.29094146329456
1995,"{'latlong': [-38.26279503575439, -5.2411729332342185], 'name': '5ª Macro - Litoral Leste/Jaguaribe'}","{'latlong': [-39.4424043736871, -6.6823328399832285], 'name': '3ª Macro - Cariri'}",9,181.09845882673415
1995,"{'latlong': [-38.26279503575439, -5.2411729332342185], 'name': '5ª Macro - Litoral Leste/Jaguaribe'}","{'latlong': [-39.5970436535868, -5.3600126499898675], 'name': '4ª Macro - Sertão Central'}",14,148.47845738572832
1995,"{'latlong': [-38.26279503575439, -5.2411729332342185], 'name': '5ª Macro - Litoral Leste/Jaguaribe'}","{'latlong': [-40.49827164718406, -4.270228494122716], 'name': '2ª Macro - Sobral'}",1,261.9034991383947
1995,"{'latlong': [-39.04198570967633, -3.972272374155126], 'name': '1ª Macro - Fortaleza'}","{'latlong': [-38.26279503575439, -5.2411729332342185], 'name': '5ª Macro - Litoral Leste/Jaguaribe'}",14,140.29094146329456
1995,"{'latlong': [-39.04198570967633, -3.972272374155126], 'name': '1ª Macro - Fortaleza'}","{'latlong': [-39.04198570967633, -3.972272374155126], 'name': '1ª Macro - Fortaleza'}",15429,0.0
1995,"{'latlong': [-39.04198570967633, -3.972272374155126], 'name': '1ª Macro - Fortaleza'}","{'latlong': [-39.4424043736871, -6.6823328399832285], 'name': '3ª Macro - Cariri'}",498,238.1362922408207
1995,"{'latlong': [-39.04198570967633, -3.972272374155126], 'name': '1ª Macro - Fortaleza'}","{'latlong': [-39.5970436535868, -5.3600126499898675], 'name': '4ª Macro - Sertão Central'}",4,134.60427573279884
1995,"{'latlong': [-39.04198570967633, -3.972272374155126], 'name': '1ª Macro - Fortaleza'}","{'latlong': [-40.49827164718406, -4.270228494122716], 'name': '2ª Macro - Sobral'}",37,163.69432955223883
1995,"{'latlong': [-39.4424043736871, -6.6823328399832285], 'name': '3ª Macro - Cariri'}","{'latlong': [-39.04198570967633, -3.972272374155126], 'name': '1ª Macro - Fortaleza'}",160,238.1362922408207
1995,"{'latlong': [-39.4424043736871, -6.6823328399832285], 'name': '3ª Macro - Cariri'}","{'latlong': [-39.4424043736871, -6.6823328399832285], 'name': '3ª Macro - Cariri'}",5874,0.0
1995,"{'latlong': [-39.4424043736871, -6.6823328399832285], 'name': '3ª Macro - Cariri'}","{'latlong': [-39.5970436535868, -5.3600126499898675], 'name': '4ª Macro - Sertão Central'}",22,114.99291452469504
1995,"{'latlong': [-39.4424043736871, -6.6823328399832285], 'name': '3ª Macro - Cariri'}","{'latlong': [-40.49827164718406, -4.270228494122716], 'name': '2ª Macro - Sobral'}",1,237.07015549816794
1995,"{'latlong': [-39.5970436535868, -5.3600126499898675], 'name': '4ª Macro - Sertão Central'}","{'latlong': [-38.26279503575439, -5.2411729332342185], 'name': '5ª Macro - Litoral Leste/Jaguaribe'}",6,148.47845738572832
1995,"{'latlong': [-39.5970436535868, -5.3600126499898675], 'name': '4ª Macro - Sertão Central'}","{'latlong': [-39.04198570967633, -3.972272374155126], 'name': '1ª Macro - Fortaleza'}",310,134.60427573279884
1995,"{'latlong': [-39.5970436535868, -5.3600126499898675], 'name': '4ª Macro - Sertão Central'}","{'latlong': [-39.4424043736871, -6.6823328399832285], 'name': '3ª Macro - Cariri'}",27,114.99291452469504
1995,"{'latlong': [-39.5970436535868, -5.3600126499898675], 'name': '4ª Macro - Sertão Central'}","{'latlong': [-39.5970436535868, -5.3600126499898675], 'name': '4ª Macro - Sertão Central'}",1133,0.0
1995,"{'latlong': [-39.5970436535868, -5.3600126499898675], 'name': '4ª Macro - Sertão Central'}","{'latlong': [-40.49827164718406, -4.270228494122716], 'name': '2ª Macro - Sobral'}",15,136.6063403884904
1995,"{'latlong': [-40.49827164718406, -4.270228494122716], 'name': '2ª Macro - Sobral'}","{'latlong': [-39.04198570967633, -3.972272374155126], 'name': '1ª Macro - Fortaleza'}",249,163.69432955223883
1995,"{'latlong': [-40.49827164718406, -4.270228494122716], 'name': '2ª Macro - Sobral'}","{'latlong': [-39.4424043736871, -6.6823328399832285], 'name': '3ª Macro - Cariri'}",5,237.07015549816794
1995,"{'latlong': [-40.49827164718406, -4.270228494122716], 'name': '2ª Macro - Sobral'}","{'latlong': [-39.5970436535868, -5.3600126499898675], 'name': '4ª Macro - Sertão Central'}",2,136.6063403884904
1995,"{'latlong': [-40.49827164718406, -4.270228494122716], 'name': '2ª Macro - Sobral'}","{'latlong': [-40.49827164718406, -4.270228494122716], 'name': '2ª Macro - Sobral'}",4665,0.0
1996,"{'latlong': [-38.26279503575439, -5.2411729332342185], 'name': '5ª Macro - Litoral Leste/Jaguaribe'}","{'latlong': [-38.26279503575439, -5.2411729332342185], 'name': '5ª Macro - Litoral Leste/Jaguaribe'}",921,0.0
1996,"{'latlong': [-38.26279503575439, -5.2411729332342185], 'name': '5ª Macro - Litoral Leste/Jaguaribe'}","{'latlong': [-39.04198570967633, -3.972272374155126], 'name': '1ª Macro - Fortaleza'}",252,140.29094146329456
1996,"{'latlong': [-38.26279503575439, -5.2411729332342185], 'name': '5ª Macro - Litoral Leste/Jaguaribe'}","{'latlong': [-39.4424043736871, -6.6823328399832285], 'name': '3ª Macro - Cariri'}",5,181.09845882673415
1996,"{'latlong': [-38.26279503575439, -5.2411729332342185], 'name': '5ª Macro - Litoral Leste/Jaguaribe'}","{'latlong': [-39.5970436535868, -5.3600126499898675], 'name': '4ª Macro - Sertão Central'}",5,148.47845738572832
1996,"{'latlong': [-39.04198570967633, -3.972272374155126], 'name': '1ª Macro - Fortaleza'}","{'latlong': [-38.26279503575439, -5.2411729332342185], 'name': '5ª Macro - Litoral Leste/Jaguaribe'}",13,140.29094146329456
1996,"{'latlong': [-39.04198570967633, -3.972272374155126], 'name': '1ª Macro - Fortaleza'}","{'latlong': [-39.04198570967633, -3.972272374155126], 'name': '1ª Macro - Fortaleza'}",10607,0.0
1996,"{'latlong': [-39.04198570967633, -3.972272374155126], 'name': '1ª Macro - Fortaleza'}","{'latlong': [-39.5970436535868, -5.3600126499898675], 'name': '4ª Macro - Sertão Central'}",7,134.60427573279884
1996,"{'latlong': [-39.04198570967633, -3.972272374155126], 'name': '1ª Macro - Fortaleza'}","{'latlong': [-40.49827164718406, -4.270228494122716], 'name': '2ª Macro - Sobral'}",14,163.69432955223883
1996,"{'latlong': [-39.4424043736871, -6.6823328399832285], 'name': '3ª Macro - Cariri'}","{'latlong': [-38.26279503575439, -5.2411729332342185], 'name': '5ª Macro - Litoral Leste/Jaguaribe'}",1,181.09845882673415
1996,"{'latlong': [-39.4424043736871, -6.6823328399832285], 'name': '3ª Macro - Cariri'}","{'latlong': [-39.04198570967633, -3.972272374155126], 'name': '1ª Macro - Fortaleza'}",126,238.1362922408207
1996,"{'latlong': [-39.4424043736871, -6.6823328399832285], 'name': '3ª Macro - Cariri'}","{'latlong': [-39.4424043736871, -6.6823328399832285], 'name': '3ª Macro - Cariri'}",3496,0.0
1996,"{'latlong': [-39.4424043736871, -6.6823328399832285], 'name': '3ª Macro - Cariri'}","{'latlong': [-39.5970436535868, -5.3600126499898675], 'name': '4ª Macro - Sertão Central'}",18,114.99291452469504
1996,"{'latlong': [-39.4424043736871, -6.6823328399832285], 'name': '3ª Macro - Cariri'}","{'latlong': [-40.49827164718406, -4.270228494122716], 'name': '2ª Macro - Sobral'}",2,237.07015549816794
1996,"{'latlong': [-39.5970436535868, -5.3600126499898675], 'name': '4ª Macro - Sertão Central'}","{'latlong': [-38.26279503575439, -5.2411729332342185], 'name': '5ª Macro - Litoral Leste/Jaguaribe'}",2,148.47845738572832
1996,"{'latlong': [-39.5970436535868, -5.3600126499898675], 'name': '4ª Macro - Sertão Central'}","{'latlong': [-39.04198570967633, -3.972272374155126], 'name': '1ª Macro - Fortaleza'}",251,134.60427573279884
1996,"{'latlong': [-39.5970436535868, -5.3600126499898675], 'name': '4ª Macro - Sertão Central'}","{'latlong': [-39.4424043736871, -6.6823328399832285], 'name': '3ª Macro - Cariri'}",13,114.99291452469504
1996,"{'latlong': [-39.5970436535868, -5.3600126499898675], 'name': '4ª Macro - Sertão Central'}","{'latlong': [-39.5970436535868, -5.3600126499898675], 'name': '4ª Macro - Sertão Central'}",860,0.0
1996,"{'latlong': [-39.5970436535868, -5.3600126499898675], 'name': '4ª Macro - Sertão Central'}","{'latlong': [-40.49827164718406, -4.270228494122716], 'name': '2ª Macro - Sobral'}",10,136.6063403884904
1996,"{'latlong': [-40.49827164718406, -4.270228494122716], 'name': '2ª Macro - Sobral'}","{'latlong': [-39.04198570967633, -3.972272374155126], 'name': '1ª Macro - Fortaleza'}",204,163.69432955223883
1996,"{'latlong': [-40.49827164718406, -4.270228494122716], 'name': '2ª Macro - Sobral'}","{'latlong': [-39.4424043736871, -6.6823328399832285], 'name': '3ª Macro - Cariri'}",2,237.07015549816794
1996,"{'latlong': [-40.49827164718406, -4.270228494122716], 'name': '2ª Macro - Sobral'}","{'latlong': [-39.5970436535868, -5.3600126499898675], 'name': '4ª Macro - Sertão Central'}",2,136.6063403884904
1996,"{'latlong': [-40.49827164718406, -4.270228494122716], 'name': '2ª Macro - Sobral'}","{'latlong': [-40.49827164718406, -4.270228494122716], 'name': '2ª Macro - Sobral'}",3522,0.0
1997,"{'latlong': [-38.26279503575439, -5.2411729332342185], 'name': '5ª Macro - Litoral Leste/Jaguaribe'}","{'latlong': [-38.26279503575439, -5.2411729332342185], 'name': '5ª Macro - Litoral Leste/Jaguaribe'}",868,0.0
1997,"{'latlong': [-38.26279503575439, -5.2411729332342185], 'name': '5ª Macro - Litoral Leste/Jaguaribe'}","{'latlong': [-39.04198570967633, -3.972272374155126], 'name': '1ª Macro - Fortaleza'}",275,140.29094146329456
1997,"{'latlong': [-38.26279503575439, -5.2411729332342185], 'name': '5ª Macro - Litoral Leste/Jaguaribe'}","{'latlong': [-39.4424043736871, -6.6823328399832285], 'name': '3ª Macro - Cariri'}",3,181.09845882673415
1997,"{'latlong': [-38.26279503575439, -5.2411729332342185], 'name': '5ª Macro - Litoral Leste/Jaguaribe'}","{'latlong': [-39.5970436535868, -5.3600126499898675], 'name': '4ª Macro - Sertão Central'}",7,148.47845738572832
1997,"{'latlong': [-39.04198570967633, -3.972272374155126], 'name': '1ª Macro - Fortaleza'}","{'latlong': [-38.26279503575439, -5.2411729332342185], 'name': '5ª Macro - Litoral Leste/Jaguaribe'}",7,140.29094146329456
1997,"{'latlong': [-39.04198570967633, -3.972272374155126], 'name': '1ª Macro - Fortaleza'}","{'latlong': [-39.04198570967633, -3.972272374155126], 'name': '1ª Macro - Fortaleza'}",10482,0.0
1997,"{'latlong': [-39.04198570967633, -3.972272374155126], 'name': '1ª Macro - Fortaleza'}","{'latlong': [-39.4424043736871, -6.6823328399832285], 'name': '3ª Macro - Cariri'}",3,238.1362922408207
1997,"{'latlong': [-39.04198570967633, -3.972272374155126], 'name': '1ª Macro - Fortaleza'}","{'latlong': [-39.5970436535868, -5.3600126499898675], 'name': '4ª Macro - Sertão Central'}",3,134.60427573279884
1997,"{'latlong': [-39.04198570967633, -3.972272374155126], 'name': '1ª Macro - Fortaleza'}","{'latlong': [-40.49827164718406, -4.270228494122716], 'name': '2ª Macro - Sobral'}",21,163.69432955223883
1997,"{'latlong': [-39.4424043736871, -6.6823328399832285], 'name': '3ª Macro - Cariri'}","{'latlong': [-38.26279503575439, -5.2411729332342185], 'name': '5ª Macro - Litoral Leste/Jaguaribe'}",1,181.09845882673415
1997,"{'latlong': [-39.4424043736871, -6.6823328399832285], 'name': '3ª Macro - Cariri'}","{'latlong': [-39.04198570967633, -3.972272374155126], 'name': '1ª Macro - Fortaleza'}",135,238.1362922408207
1997,"{'latlong': [-39.4424043736871, -6.6823328399832285], 'name': '3ª Macro - Cariri'}","{'latlong': [-39.4424043736871, -6.6823328399832285], 'name': '3ª Macro - Cariri'}",3047,0.0
1997,"{'latlong': [-39.4424043736871, -6.6823328399832285], 'name': '3ª Macro - Cariri'}","{'latlong': [-40.49827164718406, -4.270228494122716], 'name': '2ª Macro - Sobral'}",1,237.07015549816794
1997,"{'latlong': [-39.5970436535868, -5.3600126499898675], 'name': '4ª Macro - Sertão Central'}","{'latlong': [-38.26279503575439, -5.2411729332342185], 'name': '5ª Macro - Litoral Leste/Jaguaribe'}",13,148.47845738572832
1997,"{'latlong': [-39.5970436535868, -5.3600126499898675], 'name': '4ª Macro - Sertão Central'}","{'latlong': [-39.04198570967633, -3.972272374155126], 'name': '1ª Macro - Fortaleza'}",279,134.60427573279884
1997,"{'latlong': [-39.5970436535868, -5.3600126499898675], 'name': '4ª Macro - Sertão Central'}","{'latlong': [-39.4424043736871, -6.6823328399832285], 'name': '3ª Macro - Cariri'}",7,114.99291452469504
1997,"{'latlong': [-39.5970436535868, -5.3600126499898675], 'name': '4ª Macro - Sertão Central'}","{'latlong': [-39.5970436535868, -5.3600126499898675], 'name': '4ª Macro - Sertão Central'}",941,0.0
1997,"{'latlong': [-39.5970436535868, -5.3600126499898675], 'name': '4ª Macro - Sertão Central'}","{'latlong': [-40.49827164718406, -4.270228494122716], 'name': '2ª Macro - Sobral'}",4,136.6063403884904
1997,"{'latlong': [-40.49827164718406, -4.270228494122716], 'name': '2ª Macro - Sobral'}","{'latlong': [-38.26279503575439, -5.2411729332342185], 'name': '5ª Macro - Litoral Leste/Jaguaribe'}",1,261.9034991383947
1997,"{'latlong': [-40.49827164718406, -4.270228494122716], 'name': '2ª Macro - Sobral'}","{'latlong': [-39.04198570967633, -3.972272374155126], 'name': '1ª Macro - Fortaleza'}",214,163.69432955223883
1997,"{'latlong': [-40.49827164718406, -4.270228494122716], 'name': '2ª Macro - Sobral'}","{'latlong': [-39.4424043736871, -6.6823328399832285], 'name': '3ª Macro - Cariri'}",2,237.07015549816794
1997,"{'latlong': [-40.49827164718406, -4.270228494122716], 'name': '2ª Macro - Sobral'}","{'latlong': [-39.5970436535868, -5.3600126499898675], 'name': '4ª Macro - Sertão Central'}",1,136.6063403884904
1997,"{'latlong': [-40.49827164718406, -4.270228494122716], 'name': '2ª Macro - Sobral'}","{'latlong': [-40.49827164718406, -4.270228494122716], 'name': '2ª Macro - Sobral'}",3278,0.0
1998,"{'latlong': [-38.26279503575439, -5.2411729332342185], 'name': '5ª Macro - Litoral Leste/Jaguaribe'}","{'latlong': [-38.26279503575439, -5.2411729332342185], 'name': '5ª Macro - Litoral Leste/Jaguaribe'}",163,0.0
1998,"{'latlong': [-38.26279503575439, -5.2411729332342185], 'name': '5ª Macro - Litoral Leste/Jaguaribe'}","{'latlong': [-39.04198570967633, -3.972272374155126], 'name': '1ª Macro - Fortaleza'}",48,140.29094146329456
1998,"{'latlong': [-39.04198570967633, -3.972272374155126], 'name': '1ª Macro - Fortaleza'}","{'latlong': [-38.26279503575439, -5.2411729332342185], 'name': '5ª Macro - Litoral Leste/Jaguaribe'}",2,140.29094146329456
1998,"{'latlong': [-39.04198570967633, -3.972272374155126], 'name': '1ª Macro - Fortaleza'}","{'latlong': [-39.04198570967633, -3.972272374155126], 'name': '1ª Macro - Fortaleza'}",2808,0.0
1998,"{'latlong': [-39.04198570967633, -3.972272374155126], 'name': '1ª Macro - Fortaleza'}","{'latlong': [-39.5970436535868, -5.3600126499898675], 'name': '4ª Macro - Sertão Central'}",1,134.60427573279884
1998,"{'latlong': [-39.4424043736871, -6.6823328399832285], 'name': '3ª Macro - Cariri'}","{'latlong': [-39.04198570967633, -3.972272374155126], 'name': '1ª Macro - Fortaleza'}",38,238.1362922408207
1998,"{'latlong': [-39.4424043736871, -6.6823328399832285], 'name': '3ª Macro - Cariri'}","{'latlong': [-39.4424043736871, -6.6823328399832285], 'name': '3ª Macro - Cariri'}",846,0.0
1998,"{'latlong': [-39.4424043736871, -6.6823328399832285], 'name': '3ª Macro - Cariri'}","{'latlong': [-39.5970436535868, -5.3600126499898675], 'name': '4ª Macro - Sertão Central'}",2,114.99291452469504
1998,"{'latlong': [-39.4424043736871, -6.6823328399832285], 'name': '3ª Macro - Cariri'}","{'latlong': [-40.49827164718406, -4.270228494122716], 'name': '2ª Macro - Sobral'}",1,237.07015549816794
1998,"{'latlong': [-39.5970436535868, -5.3600126499898675], 'name': '4ª Macro - Sertão Central'}","{'latlong': [-38.26279503575439, -5.2411729332342185], 'name': '5ª Macro - Litoral Leste/Jaguaribe'}",1,148.47845738572832
1998,"{'latlong': [-39.5970436535868, -5.3600126499898675], 'name': '4ª Macro - Sertão Central'}","{'latlong': [-39.04198570967633, -3.972272374155126], 'name': '1ª Macro - Fortaleza'}",56,134.60427573279884
1998,"{'latlong': [-39.5970436535868, -5.3600126499898675], 'name': '4ª Macro - Sertão Central'}","{'latlong': [-39.4424043736871, -6.6823328399832285], 'name': '3ª Macro - Cariri'}",4,114.99291452469504
1998,"{'latlong': [-39.5970436535868, -5.3600126499898675], 'name': '4ª Macro - Sertão Central'}","{'latlong': [-39.5970436535868, -5.3600126499898675], 'name': '4ª Macro - Sertão Central'}",291,0.0
1998,"{'latlong': [-39.5970436535868, -5.3600126499898675], 'name': '4ª Macro - Sertão Central'}","{'latlong': [-40.49827164718406, -4.270228494122716], 'name': '2ª Macro - Sobral'}",2,136.6063403884904
1998,"{'latlong': [-40.49827164718406, -4.270228494122716], 'name': '2ª Macro - Sobral'}","{'latlong': [-39.04198570967633, -3.972272374155126], 'name': '1ª Macro - Fortaleza'}",66,163.69432955223883
1998,"{'latlong': [-40.49827164718406, -4.270228494122716], 'name': '2ª Macro - Sobral'}","{'latlong': [-39.4424043736871, -6.6823328399832285], 'name': '3ª Macro - Cariri'}",1,237.07015549816794
1998,"{'latlong': [-40.49827164718406, -4.270228494122716], 'name': '2ª Macro - Sobral'}","{'latlong': [-40.49827164718406, -4.270228494122716], 'name': '2ª Macro - Sobral'}",950,0.0
1999,"{'latlong': [-38.26279503575439, -5.2411729332342185], 'name': '5ª Macro - Litoral Leste/Jaguaribe'}","{'latlong': [-38.26279503575439, -5.2411729332342185], 'name': '5ª Macro - Litoral Leste/Jaguaribe'}",254,0.0
1999,"{'latlong': [-38.26279503575439, -5.2411729332342185], 'name': '5ª Macro - Litoral Leste/Jaguaribe'}","{'latlong': [-39.04198570967633, -3.972272374155126], 'name': '1ª Macro - Fortaleza'}",71,140.29094146329456
1999,"{'latlong': [-39.04198570967633, -3.972272374155126], 'name': '1ª Macro - Fortaleza'}","{'latlong': [-38.26279503575439, -5.2411729332342185], 'name': '5ª Macro - Litoral Leste/Jaguaribe'}",4,140.29094146329456
1999,"{'latlong': [-39.04198570967633, -3.972272374155126], 'name': '1ª Macro - Fortaleza'}","{'latlong': [-39.04198570967633, -3.972272374155126], 'name': '1ª Macro - Fortaleza'}",3465,0.0
1999,"{'latlong': [-39.04198570967633, -3.972272374155126], 'name': '1ª Macro - Fortaleza'}","{'latlong': [-40.49827164718406, -4.270228494122716], 'name': '2ª Macro - Sobral'}",2,163.69432955223883
1999,"{'latlong': [-39.4424043736871, -6.6823328399832285], 'name': '3ª Macro - Cariri'}","{'latlong': [-39.04198570967633, -3.972272374155126], 'name': '1ª Macro - Fortaleza'}",54,238.1362922408207
1999,"{'latlong': [-39.4424043736871, -6.6823328399832285], 'name': '3ª Macro - Cariri'}","{'latlong': [-39.4424043736871, -6.6823328399832285], 'name': '3ª Macro - Cariri'}",1101,0.0
1999,"{'latlong': [-39.4424043736871, -6.6823328399832285], 'name': '3ª Macro - Cariri'}","{'latlong': [-39.5970436535868, -5.3600126499898675], 'name': '4ª Macro - Sertão Central'}",4,114.99291452469504
1999,"{'latlong': [-39.4424043736871, -6.6823328399832285], 'name': '3ª Macro - Cariri'}","{'latlong': [-40.49827164718406, -4.270228494122716], 'name': '2ª Macro - Sobral'}",1,237.07015549816794
1999,"{'latlong': [-39.5970436535868, -5.3600126499898675], 'name': '4ª Macro - Sertão Central'}","{'latlong': [-39.04198570967633, -3.972272374155126], 'name': '1ª Macro - Fortaleza'}",62,134.60427573279884
1999,"{'latlong': [-39.5970436535868, -5.3600126499898675], 'name': '4ª Macro - Sertão Central'}","{'latlong': [-39.4424043736871, -6.6823328399832285], 'name': '3ª Macro - Cariri'}",1,114.99291452469504
1999,"{'latlong': [-39.5970436535868, -5.3600126499898675], 'name': '4ª Macro - Sertão Central'}","{'latlong': [-39.5970436535868, -5.3600126499898675], 'name': '4ª Macro - Sertão Central'}",328,0.0
1999,"{'latlong': [-39.5970436535868, -5.3600126499898675], 'name': '4ª Macro - Sertão Central'}","{'latlong': [-40.49827164718406, -4.270228494122716], 'name': '2ª Macro - Sobral'}",2,136.6063403884904
1999,"{'latlong': [-40.49827164718406, -4.270228494122716], 'name': '2ª Macro - Sobral'}","{'latlong': [-39.04198570967633, -3.972272374155126], 'name': '1ª Macro - Fortaleza'}",69,163.69432955223883
1999,"{'latlong': [-40.49827164718406, -4.270228494122716], 'name': '2ª Macro - Sobral'}","{'latlong': [-39.4424043736871, -6.6823328399832285], 'name': '3ª Macro - Cariri'}",1,237.07015549816794
1999,"{'latlong': [-40.49827164718406, -4.270228494122716], 'name': '2ª Macro - Sobral'}","{'latlong': [-40.49827164718406, -4.270228494122716], 'name': '2ª Macro - Sobral'}",1235,0.0
2000,"{'latlong': [-38.26279503575439, -5.2411729332342185], 'name': '5ª Macro - Litoral Leste/Jaguaribe'}","{'latlong': [-38.26279503575439, -5.2411729332342185], 'name': '5ª Macro - Litoral Leste/Jaguaribe'}",381,0.0
2000,"{'latlong': [-38.26279503575439, -5.2411729332342185], 'name': '5ª Macro - Litoral Leste/Jaguaribe'}","{'latlong': [-39.04198570967633, -3.972272374155126], 'name': '1ª Macro - Fortaleza'}",75,140.29094146329456
2000,"{'latlong': [-39.04198570967633, -3.972272374155126], 'name': '1ª Macro - Fortaleza'}","{'latlong': [-38.26279503575439, -5.2411729332342185], 'name': '5ª Macro - Litoral Leste/Jaguaribe'}",1,140.29094146329456
2000,"{'latlong': [-39.04198570967633, -3.972272374155126], 'name': '1ª Macro - Fortaleza'}","{'latlong': [-39.04198570967633, -3.972272374155126], 'name': '1ª Macro - Fortaleza'}",3709,0.0
2000,"{'latlong': [-39.04198570967633, -3.972272374155126], 'name': '1ª Macro - Fortaleza'}","{'latlong': [-39.4424043736871, -6.6823328399832285], 'name': '3ª Macro - Cariri'}",1,238.1362922408207
2000,"{'latlong': [-39.04198570967633, -3.972272374155126], 'name': '1ª Macro - Fortaleza'}","{'latlong': [-39.5970436535868, -5.3600126499898675], 'name': '4ª Macro - Sertão Central'}",1,134.60427573279884
2000,"{'latlong': [-39.04198570967633, -3.972272374155126], 'name': '1ª Macro - Fortaleza'}","{'latlong': [-40.49827164718406, -4.270228494122716], 'name': '2ª Macro - Sobral'}",3,163.69432955223883
2000,"{'latlong': [-39.4424043736871, -6.6823328399832285], 'name': '3ª Macro - Cariri'}","{'latlong': [-39.04198570967633, -3.972272374155126], 'name': '1ª Macro - Fortaleza'}",70,238.1362922408207
2000,"{'latlong': [-39.4424043736871, -6.6823328399832285], 'name': '3ª Macro - Cariri'}","{'latlong': [-39.4424043736871, -6.6823328399832285], 'name': '3ª Macro - Cariri'}",1395,0.0
2000,"{'latlong': [-39.4424043736871, -6.6823328399832285], 'name': '3ª Macro - Cariri'}","{'latlong': [-39.5970436535868, -5.3600126499898675], 'name': '4ª Macro - Sertão Central'}",1,114.99291452469504
2000,"{'latlong': [-39.5970436535868, -5.3600126499898675], 'name': '4ª Macro - Sertão Central'}","{'latlong': [-39.04198570967633, -3.972272374155126], 'name': '1ª Macro - Fortaleza'}",93,134.60427573279884
2000,"{'latlong': [-39.5970436535868, -5.3600126499898675], 'name': '4ª Macro - Sertão Central'}","{'latlong': [-39.5970436535868, -5.3600126499898675], 'name': '4ª Macro - Sertão Central'}",463,0.0
2000,"{'latlong': [-39.5970436535868, -5.3600126499898675], 'name': '4ª Macro - Sertão Central'}","{'latlong': [-40.49827164718406, -4.270228494122716], 'name': '2ª Macro - Sobral'}",2,136.6063403884904
2000,"{'latlong': [-40.49827164718406, -4.270228494122716], 'name': '2ª Macro - Sobral'}","{'latlong': [-39.04198570967633, -3.972272374155126], 'name': '1ª Macro - Fortaleza'}",81,163.69432955223883
2000,"{'latlong': [-40.49827164718406, -4.270228494122716], 'name': '2ª Macro - Sobral'}","{'latlong': [-40.49827164718406, -4.270228494122716], 'name': '2ª Macro - Sobral'}",1416,0.0
2001,"{'latlong': [-38.26279503575439, -5.2411729332342185], 'name': '5ª Macro - Litoral Leste/Jaguaribe'}","{'latlong': [-38.26279503575439, -5.2411729332342185], 'name': '5ª Macro - Litoral Leste/Jaguaribe'}",391,0.0
2001,"{'latlong': [-38.26279503575439, -5.2411729332342185], 'name': '5ª Macro - Litoral Leste/Jaguaribe'}","{'latlong': [-39.04198570967633, -3.972272374155126], 'name': '1ª Macro - Fortaleza'}",65,140.29094146329456
2001,"{'latlong': [-39.04198570967633, -3.972272374155126], 'name': '1ª Macro - Fortaleza'}","{'latlong': [-39.04198570967633, -3.972272374155126], 'name': '1ª Macro - Fortaleza'}",3872,0.0
2001,"{'latlong': [-39.4424043736871, -6.6823328399832285], 'name': '3ª Macro - Cariri'}","{'latlong': [-39.04198570967633, -3.972272374155126], 'name': '1ª Macro - Fortaleza'}",50,238.1362922408207
2001,"{'latlong': [-39.4424043736871, -6.6823328399832285], 'name': '3ª Macro - Cariri'}","{'latlong': [-39.4424043736871, -6.6823328399832285], 'name': '3ª Macro - Cariri'}",1572,0.0
2001,"{'latlong': [-39.4424043736871, -6.6823328399832285], 'name': '3ª Macro - Cariri'}","{'latlong': [-39.5970436535868, -5.3600126499898675], 'name': '4ª Macro - Sertão Central'}",1,114.99291452469504
2001,"{'latlong': [-39.5970436535868, -5.3600126499898675], 'name': '4ª Macro - Sertão Central'}","{'latlong': [-38.26279503575439, -5.2411729332342185], 'name': '5ª Macro - Litoral Leste/Jaguaribe'}",2,148.47845738572832
2001,"{'latlong': [-39.5970436535868, -5.3600126499898675], 'name': '4ª Macro - Sertão Central'}","{'latlong': [-39.04198570967633, -3.972272374155126], 'name': '1ª Macro - Fortaleza'}",66,134.60427573279884
2001,"{'latlong': [-39.5970436535868, -5.3600126499898675], 'name': '4ª Macro - Sertão Central'}","{'latlong': [-39.5970436535868, -5.3600126499898675], 'name': '4ª Macro - Sertão Central'}",490,0.0
2001,"{'latlong': [-39.5970436535868, -5.3600126499898675], 'name': '4ª Macro - Sertão Central'}","{'latlong': [-40.49827164718406, -4.270228494122716], 'name': '2ª Macro - Sobral'}",1,136.6063403884904
2001,"{'latlong': [-40.49827164718406, -4.270228494122716], 'name': '2ª Macro - Sobral'}","{'latlong': [-39.04198570967633, -3.972272374155126], 'name': '1ª Macro - Fortaleza'}",60,163.69432955223883
2001,"{'latlong': [-40.49827164718406, -4.270228494122716], 'name': '2ª Macro - Sobral'}","{'latlong': [-40.49827164718406, -4.270228494122716], 'name': '2ª Macro - Sobral'}",1469,0.0
2002,"{'latlong': [-38.26279503575439, -5.2411729332342185], 'name': '5ª Macro - Litoral Leste/Jaguaribe'}","{'latlong': [-38.26279503575439, -5.2411729332342185], 'name': '5ª Macro - Litoral Leste/Jaguaribe'}",528,0.0
2002,"{'latlong': [-38.26279503575439, -5.2411729332342185], 'name': '5ª Macro - Litoral Leste/Jaguaribe'}","{'latlong': [-39.04198570967633, -3.972272374155126], 'name': '1ª Macro - Fortaleza'}",108,140.29094146329456
2002,"{'latlong': [-39.04198570967633, -3.972272374155126], 'name': '1ª Macro - Fortaleza'}","{'latlong': [-38.26279503575439, -5.2411729332342185], 'name': '5ª Macro - Litoral Leste/Jaguaribe'}",5,140.29094146329456
2002,"{'latlong': [-39.04198570967633, -3.972272374155126], 'name': '1ª Macro - Fortaleza'}","{'latlong': [-39.04198570967633, -3.972272374155126], 'name': '1ª Macro - Fortaleza'}",5485,0.0
2002,"{'latlong': [-39.04198570967633, -3.972272374155126], 'name': '1ª Macro - Fortaleza'}","{'latlong': [-40.49827164718406, -4.270228494122716], 'name': '2ª Macro - Sobral'}",3,163.69432955223883
2002,"{'latlong': [-39.4424043736871, -6.6823328399832285], 'name': '3ª Macro - Cariri'}","{'latlong': [-39.04198570967633, -3.972272374155126], 'name': '1ª Macro - Fortaleza'}",62,238.1362922408207
2002,"{'latlong': [-39.4424043736871, -6.6823328399832285], 'name': '3ª Macro - Cariri'}","{'latlong': [-39.4424043736871, -6.6823328399832285], 'name': '3ª Macro - Cariri'}",1774,0.0
2002,"{'latlong': [-39.5970436535868, -5.3600126499898675], 'name': '4ª Macro - Sertão Central'}","{'latlong': [-38.26279503575439, -5.2411729332342185], 'name': '5ª Macro - Litoral Leste/Jaguaribe'}",1,148.47845738572832
2002,"{'latlong': [-39.5970436535868, -5.3600126499898675], 'name': '4ª Macro - Sertão Central'}","{'latlong': [-39.04198570967633, -3.972272374155126], 'name': '1ª Macro - Fortaleza'}",66,134.60427573279884
2002,"{'latlong': [-39.5970436535868, -5.3600126499898675], 'name': '4ª Macro - Sertão Central'}","{'latlong': [-39.4424043736871, -6.6823328399832285], 'name': '3ª Macro - Cariri'}",2,114.99291452469504
2002,"{'latlong': [-39.5970436535868, -5.3600126499898675], 'name': '4ª Macro - Sertão Central'}","{'latlong': [-39.5970436535868, -5.3600126499898675], 'name': '4ª Macro - Sertão Central'}",863,0.0
2002,"{'latlong': [-40.49827164718406, -4.270228494122716], 'name': '2ª Macro - Sobral'}","{'latlong': [-39.04198570967633, -3.972272374155126], 'name': '1ª Macro - Fortaleza'}",80,163.69432955223883
2002,"{'latlong': [-40.49827164718406, -4.270228494122716], 'name': '2ª Macro - Sobral'}","{'latlong': [-40.49827164718406, -4.270228494122716], 'name': '2ª Macro - Sobral'}",2131,0.0
2003,"{'latlong': [-38.26279503575439, -5.2411729332342185], 'name': '5ª Macro - Litoral Leste/Jaguaribe'}","{'latlong': [-38.26279503575439, -5.2411729332342185], 'name': '5ª Macro - Litoral Leste/Jaguaribe'}",509,0.0
2003,"{'latlong': [-38.26279503575439, -5.2411729332342185], 'name': '5ª Macro - Litoral Leste/Jaguaribe'}","{'latlong': [-39.04198570967633, -3.972272374155126], 'name': '1ª Macro - Fortaleza'}",95,140.29094146329456
2003,"{'latlong': [-38.26279503575439, -5.2411729332342185], 'name': '5ª Macro - Litoral Leste/Jaguaribe'}","{'latlong': [-39.4424043736871, -6.6823328399832285], 'name': '3ª Macro - Cariri'}",1,181.09845882673415
2003,"{'latlong': [-39.04198570967633, -3.972272374155126], 'name': '1ª Macro - Fortaleza'}","{'latlong': [-38.26279503575439, -5.2411729332342185], 'name': '5ª Macro - Litoral Leste/Jaguaribe'}",1,140.29094146329456
2003,"{'latlong': [-39.04198570967633, -3.972272374155126], 'name': '1ª Macro - Fortaleza'}","{'latlong': [-39.04198570967633, -3.972272374155126], 'name': '1ª Macro - Fortaleza'}",5472,0.0
2003,"{'latlong': [-39.04198570967633, -3.972272374155126], 'name': '1ª Macro - Fortaleza'}","{'latlong': [-39.5970436535868, -5.3600126499898675], 'name': '4ª Macro - Sertão Central'}",1,134.60427573279884
2003,"{'latlong': [-39.04198570967633, -3.972272374155126], 'name': '1ª Macro - Fortaleza'}","{'latlong': [-40.49827164718406, -4.270228494122716], 'name': '2ª Macro - Sobral'}",1,163.69432955223883
2003,"{'latlong': [-39.4424043736871, -6.6823328399832285], 'name': '3ª Macro - Cariri'}","{'latlong': [-39.04198570967633, -3.972272374155126], 'name': '1ª Macro - Fortaleza'}",74,238.1362922408207
2003,"{'latlong': [-39.4424043736871, -6.6823328399832285], 'name': '3ª Macro - Cariri'}","{'latlong': [-39.4424043736871, -6.6823328399832285], 'name': '3ª Macro - Cariri'}",1526,0.0
2003,"{'latlong': [-39.5970436535868, -5.3600126499898675], 'name': '4ª Macro - Sertão Central'}","{'latlong': [-39.04198570967633, -3.972272374155126], 'name': '1ª Macro - Fortaleza'}",90,134.60427573279884
2003,"{'latlong': [-39.5970436535868, -5.3600126499898675], 'name': '4ª Macro - Sertão Central'}","{'latlong': [-39.4424043736871, -6.6823328399832285], 'name': '3ª Macro - Cariri'}",4,114.99291452469504
2003,"{'latlong': [-39.5970436535868, -5.3600126499898675], 'name': '4ª Macro - Sertão Central'}","{'latlong': [-39.5970436535868, -5.3600126499898675], 'name': '4ª Macro - Sertão Central'}",702,0.0
2003,"{'latlong': [-40.49827164718406, -4.270228494122716], 'name': '2ª Macro - Sobral'}","{'latlong': [-39.04198570967633, -3.972272374155126], 'name': '1ª Macro - Fortaleza'}",92,163.69432955223883
2003,"{'latlong': [-40.49827164718406, -4.270228494122716], 'name': '2ª Macro - Sobral'}","{'latlong': [-40.49827164718406, -4.270228494122716], 'name': '2ª Macro - Sobral'}",1805,0.0
2004,"{'latlong': [-38.26279503575439, -5.2411729332342185], 'name': '5ª Macro - Litoral Leste/Jaguaribe'}","{'latlong': [-38.26279503575439, -5.2411729332342185], 'name': '5ª Macro - Litoral Leste/Jaguaribe'}",586,0.0
2004,"{'latlong': [-38.26279503575439, -5.2411729332342185], 'name': '5ª Macro - Litoral Leste/Jaguaribe'}","{'latlong': [-39.04198570967633, -3.972272374155126], 'name': '1ª Macro - Fortaleza'}",83,140.29094146329456
2004,"{'latlong': [-39.04198570967633, -3.972272374155126], 'name': '1ª Macro - Fortaleza'}","{'latlong': [-38.26279503575439, -5.2411729332342185], 'name': '5ª Macro - Litoral Leste/Jaguaribe'}",7,140.29094146329456
2004,"{'latlong': [-39.04198570967633, -3.972272374155126], 'name': '1ª Macro - Fortaleza'}","{'latlong': [-39.04198570967633, -3.972272374155126], 'name': '1ª Macro - Fortaleza'}",5294,0.0
2004,"{'latlong': [-39.4424043736871, -6.6823328399832285], 'name': '3ª Macro - Cariri'}","{'latlong': [-39.04198570967633, -3.972272374155126], 'name': '1ª Macro - Fortaleza'}",54,238.1362922408207
2004,"{'latlong': [-39.4424043736871, -6.6823328399832285], 'name': '3ª Macro - Cariri'}","{'latlong': [-39.4424043736871, -6.6823328399832285], 'name': '3ª Macro - Cariri'}",2038,0.0
2004,"{'latlong': [-39.4424043736871, -6.6823328399832285], 'name': '3ª Macro - Cariri'}","{'latlong': [-39.5970436535868, -5.3600126499898675], 'name': '4ª Macro - Sertão Central'}",2,114.99291452469504
2004,"{'latlong': [-39.5970436535868, -5.3600126499898675], 'name': '4ª Macro - Sertão Central'}","{'latlong': [-39.04198570967633, -3.972272374155126], 'name': '1ª Macro - Fortaleza'}",71,134.60427573279884
2004,"{'latlong': [-39.5970436535868, -5.3600126499898675], 'name': '4ª Macro - Sertão Central'}","{'latlong': [-39.4424043736871, -6.6823328399832285], 'name': '3ª Macro - Cariri'}",2,114.99291452469504
2004,"{'latlong': [-39.5970436535868, -5.3600126499898675], 'name': '4ª Macro - Sertão Central'}","{'latlong': [-39.5970436535868, -5.3600126499898675], 'name': '4ª Macro - Sertão Central'}",684,0.0
2004,"{'latlong': [-40.49827164718406, -4.270228494122716], 'name': '2ª Macro - Sobral'}","{'latlong': [-39.04198570967633, -3.972272374155126], 'name': '1ª Macro - Fortaleza'}",66,163.69432955223883
2004,"{'latlong': [-40.49827164718406, -4.270228494122716], 'name': '2ª Macro - Sobral'}","{'latlong': [-39.5970436535868, -5.3600126499898675], 'name': '4ª Macro - Sertão Central'}",2,136.6063403884904
2004,"{'latlong': [-40.49827164718406, -4.270228494122716], 'name': '2ª Macro - Sobral'}","{'latlong': [-40.49827164718406, -4.270228494122716], 'name': '2ª Macro - Sobral'}",1619,0.0
2005,"{'latlong': [-38.26279503575439, -5.2411729332342185], 'name': '5ª Macro - Litoral Leste/Jaguaribe'}","{'latlong': [-38.26279503575439, -5.2411729332342185], 'name': '5ª Macro - Litoral Leste/Jaguaribe'}",520,0.0
2005,"{'latlong': [-38.26279503575439, -5.2411729332342185], 'name': '5ª Macro - Litoral Leste/Jaguaribe'}","{'latlong': [-39.04198570967633, -3.972272374155126], 'name': '1ª Macro - Fortaleza'}",61,140.29094146329456
2005,"{'latlong': [-39.04198570967633, -3.972272374155126], 'name': '1ª Macro - Fortaleza'}","{'latlong': [-38.26279503575439, -5.2411729332342185], 'name': '5ª Macro - Litoral Leste/Jaguaribe'}",7,140.29094146329456
2005,"{'latlong': [-39.04198570967633, -3.972272374155126], 'name': '1ª Macro - Fortaleza'}","{'latlong': [-39.04198570967633, -3.972272374155126], 'name': '1ª Macro - Fortaleza'}",5750,0.0
2005,"{'latlong': [-39.04198570967633, -3.972272374155126], 'name': '1ª Macro - Fortaleza'}","{'latlong': [-40.49827164718406, -4.270228494122716], 'name': '2ª Macro - Sobral'}",1,163.69432955223883
2005,"{'latlong': [-39.4424043736871, -6.6823328399832285], 'name': '3ª Macro - Cariri'}","{'latlong': [-39.04198570967633, -3.972272374155126], 'name': '1ª Macro - Fortaleza'}",47,238.1362922408207
2005,"{'latlong': [-39.4424043736871, -6.6823328399832285], 'name': '3ª Macro - Cariri'}","{'latlong': [-39.4424043736871, -6.6823328399832285], 'name': '3ª Macro - Cariri'}",2103,0.0
2005,"{'latlong': [-39.4424043736871, -6.6823328399832285], 'name': '3ª Macro - Cariri'}","{'latlong': [-39.5970436535868, -5.3600126499898675], 'name': '4ª Macro - Sertão Central'}",1,114.99291452469504
2005,"{'latlong': [-39.5970436535868, -5.3600126499898675], 'name': '4ª Macro - Sertão Central'}","{'latlong': [-38.26279503575439, -5.2411729332342185], 'name': '5ª Macro - Litoral Leste/Jaguaribe'}",1,148.47845738572832
2005,"{'latlong': [-39.5970436535868, -5.3600126499898675], 'name': '4ª Macro - Sertão Central'}","{'latlong': [-39.04198570967633, -3.972272374155126], 'name': '1ª Macro - Fortaleza'}",51,134.60427573279884
2005,"{'latlong': [-39.5970436535868, -5.3600126499898675], 'name': '4ª Macro - Sertão Central'}","{'latlong': [-39.4424043736871, -6.6823328399832285], 'name': '3ª Macro - Cariri'}",1,114.99291452469504
2005,"{'latlong': [-39.5970436535868, -5.3600126499898675], 'name': '4ª Macro - Sertão Central'}","{'latlong': [-39.5970436535868, -5.3600126499898675], 'name': '4ª Macro - Sertão Central'}",697,0.0
2005,"{'latlong': [-40.49827164718406, -4.270228494122716], 'name': '2ª Macro - Sobral'}","{'latlong': [-39.04198570967633, -3.972272374155126], 'name': '1ª Macro - Fortaleza'}",44,163.69432955223883
2005,"{'latlong': [-40.49827164718406, -4.270228494122716], 'name': '2ª Macro - Sobral'}","{'latlong': [-40.49827164718406, -4.270228494122716], 'name': '2ª Macro - Sobral'}",1550,0.0
2006,"{'latlong': [-38.26279503575439, -5.2411729332342185], 'name': '5ª Macro - Litoral Leste/Jaguaribe'}","{'latlong': [-38.26279503575439, -5.2411729332342185], 'name': '5ª Macro - Litoral Leste/Jaguaribe'}",449,0.0
2006,"{'latlong': [-38.26279503575439, -5.2411729332342185], 'name': '5ª Macro - Litoral Leste/Jaguaribe'}","{'latlong': [-39.04198570967633, -3.972272374155126], 'name': '1ª Macro - Fortaleza'}",60,140.29094146329456
2006,"{'latlong': [-39.04198570967633, -3.972272374155126], 'name': '1ª Macro - Fortaleza'}","{'latlong': [-38.26279503575439, -5.2411729332342185], 'name': '5ª Macro - Litoral Leste/Jaguaribe'}",7,140.29094146329456
2006,"{'latlong': [-39.04198570967633, -3.972272374155126], 'name': '1ª Macro - Fortaleza'}","{'latlong': [-39.04198570967633, -3.972272374155126], 'name': '1ª Macro - Fortaleza'}",5756,0.0
2006,"{'latlong': [-39.4424043736871, -6.6823328399832285], 'name': '3ª Macro - Cariri'}","{'latlong': [-39.04198570967633, -3.972272374155126], 'name': '1ª Macro - Fortaleza'}",58,238.1362922408207
2006,"{'latlong': [-39.4424043736871, -6.6823328399832285], 'name': '3ª Macro - Cariri'}","{'latlong': [-39.4424043736871, -6.6823328399832285], 'name': '3ª Macro - Cariri'}",2390,0.0
2006,"{'latlong': [-39.4424043736871, -6.6823328399832285], 'name': '3ª Macro - Cariri'}","{'latlong': [-39.5970436535868, -5.3600126499898675], 'name': '4ª Macro - Sertão Central'}",1,114.99291452469504
2006,"{'latlong': [-39.5970436535868, -5.3600126499898675], 'name': '4ª Macro - Sertão Central'}","{'latlong': [-39.04198570967633, -3.972272374155126], 'name': '1ª Macro - Fortaleza'}",81,134.60427573279884
2006,"{'latlong': [-39.5970436535868, -5.3600126499898675], 'name': '4ª Macro - Sertão Central'}","{'latlong': [-39.5970436535868, -5.3600126499898675], 'name': '4ª Macro - Sertão Central'}",623,0.0
2006,"{'latlong': [-40.49827164718406, -4.270228494122716], 'name': '2ª Macro - Sobral'}","{'latlong': [-39.04198570967633, -3.972272374155126], 'name': '1ª Macro - Fortaleza'}",54,163.69432955223883
2006,"{'latlong': [-40.49827164718406, -4.270228494122716], 'name': '2ª Macro - Sobral'}","{'latlong': [-40.49827164718406, -4.270228494122716], 'name': '2ª Macro - Sobral'}",1906,0.0
2007,"{'latlong': [-38.26279503575439, -5.2411729332342185], 'name': '5ª Macro - Litoral Leste/Jaguaribe'}","{'latlong': [-38.26279503575439, -5.2411729332342185], 'name': '5ª Macro - Litoral Leste/Jaguaribe'}",493,0.0
2007,"{'latlong': [-38.26279503575439, -5.2411729332342185], 'name': '5ª Macro - Litoral Leste/Jaguaribe'}","{'latlong': [-39.04198570967633, -3.972272374155126], 'name': '1ª Macro - Fortaleza'}",104,140.29094146329456
2007,"{'latlong': [-38.26279503575439, -5.2411729332342185], 'name': '5ª Macro - Litoral Leste/Jaguaribe'}","{'latlong': [-39.4424043736871, -6.6823328399832285], 'name': '3ª Macro - Cariri'}",1,181.09845882673415
2007,"{'latlong': [-39.04198570967633, -3.972272374155126], 'name': '1ª Macro - Fortaleza'}","{'latlong': [-38.26279503575439, -5.2411729332342185], 'name': '5ª Macro - Litoral Leste/Jaguaribe'}",5,140.29094146329456
2007,"{'latlong': [-39.04198570967633, -3.972272374155126], 'name': '1ª Macro - Fortaleza'}","{'latlong': [-39.04198570967633, -3.972272374155126], 'name': '1ª Macro - Fortaleza'}",6150,0.0
2007,"{'latlong': [-39.04198570967633, -3.972272374155126], 'name': '1ª Macro - Fortaleza'}","{'latlong': [-39.5970436535868, -5.3600126499898675], 'name': '4ª Macro - Sertão Central'}",1,134.60427573279884
2007,"{'latlong': [-39.04198570967633, -3.972272374155126], 'name': '1ª Macro - Fortaleza'}","{'latlong': [-40.49827164718406, -4.270228494122716], 'name': '2ª Macro - Sobral'}",1,163.69432955223883
2007,"{'latlong': [-39.4424043736871, -6.6823328399832285], 'name': '3ª Macro - Cariri'}","{'latlong': [-39.04198570967633, -3.972272374155126], 'name': '1ª Macro - Fortaleza'}",67,238.1362922408207
2007,"{'latlong': [-39.4424043736871, -6.6823328399832285], 'name': '3ª Macro - Cariri'}","{'latlong': [-39.4424043736871, -6.6823328399832285], 'name': '3ª Macro - Cariri'}",2015,0.0
2007,"{'latlong': [-39.4424043736871, -6.6823328399832285], 'name': '3ª Macro - Cariri'}","{'latlong': [-39.5970436535868, -5.3600126499898675], 'name': '4ª Macro - Sertão Central'}",1,114.99291452469504
2007,"{'latlong': [-39.5970436535868, -5.3600126499898675], 'name': '4ª Macro - Sertão Central'}","{'latlong': [-39.04198570967633, -3.972272374155126], 'name': '1ª Macro - Fortaleza'}",93,134.60427573279884
2007,"{'latlong': [-39.5970436535868, -5.3600126499898675], 'name': '4ª Macro - Sertão Central'}","{'latlong': [-39.5970436535868, -5.3600126499898675], 'name': '4ª Macro - Sertão Central'}",609,0.0
2007,"{'latlong': [-40.49827164718406, -4.270228494122716], 'name': '2ª Macro - Sobral'}","{'latlong': [-39.04198570967633, -3.972272374155126], 'name': '1ª Macro - Fortaleza'}",68,163.69432955223883
2007,"{'latlong': [-40.49827164718406, -4.270228494122716], 'name': '2ª Macro - Sobral'}","{'latlong': [-40.49827164718406, -4.270228494122716], 'name': '2ª Macro - Sobral'}",2149,0.0
2008,"{'latlong': [-38.26279503575439, -5.2411729332342185], 'name': '5ª Macro - Litoral Leste/Jaguaribe'}","{'latlong': [-38.26279503575439, -5.2411729332342185], 'name': '5ª Macro - Litoral Leste/Jaguaribe'}",454,0.0
2008,"{'latlong': [-38.26279503575439, -5.2411729332342185], 'name': '5ª Macro - Litoral Leste/Jaguaribe'}","{'latlong': [-39.04198570967633, -3.972272374155126], 'name': '1ª Macro - Fortaleza'}",92,140.29094146329456
2008,"{'latlong': [-38.26279503575439, -5.2411729332342185], 'name': '5ª Macro - Litoral Leste/Jaguaribe'}","{'latlong': [-39.4424043736871, -6.6823328399832285], 'name': '3ª Macro - Cariri'}",3,181.09845882673415
2008,"{'latlong': [-39.04198570967633, -3.972272374155126], 'name': '1ª Macro - Fortaleza'}","{'latlong': [-38.26279503575439, -5.2411729332342185], 'name': '5ª Macro - Litoral Leste/Jaguaribe'}",6,140.29094146329456
2008,"{'latlong': [-39.04198570967633, -3.972272374155126], 'name': '1ª Macro - Fortaleza'}","{'latlong': [-39.04198570967633, -3.972272374155126], 'name': '1ª Macro - Fortaleza'}",5741,0.0
2008,"{'latlong': [-39.04198570967633, -3.972272374155126], 'name': '1ª Macro - Fortaleza'}","{'latlong': [-39.5970436535868, -5.3600126499898675], 'name': '4ª Macro - Sertão Central'}",1,134.60427573279884
2008,"{'latlong': [-39.04198570967633, -3.972272374155126], 'name': '1ª Macro - Fortaleza'}","{'latlong': [-40.49827164718406, -4.270228494122716], 'name': '2ª Macro - Sobral'}",5,163.69432955223883
2008,"{'latlong': [-39.4424043736871, -6.6823328399832285], 'name': '3ª Macro - Cariri'}","{'latlong': [-39.04198570967633, -3.972272374155126], 'name': '1ª Macro - Fortaleza'}",56,238.1362922408207
2008,"{'latlong': [-39.4424043736871, -6.6823328399832285], 'name': '3ª Macro - Cariri'}","{'latlong': [-39.4424043736871, -6.6823328399832285], 'name': '3ª Macro - Cariri'}",2566,0.0
2008,"{'latlong': [-39.5970436535868, -5.3600126499898675], 'name': '4ª Macro - Sertão Central'}","{'latlong': [-39.04198570967633, -3.972272374155126], 'name': '1ª Macro - Fortaleza'}",76,134.60427573279884
2008,"{'latlong': [-39.5970436535868, -5.3600126499898675], 'name': '4ª Macro - Sertão Central'}","{'latlong': [-39.5970436535868, -5.3600126499898675], 'name': '4ª Macro - Sertão Central'}",778,0.0
2008,"{'latlong': [-40.49827164718406, -4.270228494122716], 'name': '2ª Macro - Sobral'}","{'latlong': [-39.04198570967633, -3.972272374155126], 'name': '1ª Macro - Fortaleza'}",61,163.69432955223883
2008,"{'latlong': [-40.49827164718406, -4.270228494122716], 'name': '2ª Macro - Sobral'}","{'latlong': [-40.49827164718406, -4.270228494122716], 'name': '2ª Macro - Sobral'}",2374,0.0
2009,"{'latlong': [-38.26279503575439, -5.2411729332342185], 'name': '5ª Macro - Litoral Leste/Jaguaribe'}","{'latlong': [-38.26279503575439, -5.2411729332342185], 'name': '5ª Macro - Litoral Leste/Jaguaribe'}",439,0.0
2009,"{'latlong': [-38.26279503575439, -5.2411729332342185], 'name': '5ª Macro - Litoral Leste/Jaguaribe'}","{'latlong': [-39.04198570967633, -3.972272374155126], 'name': '1ª Macro - Fortaleza'}",66,140.29094146329456
2009,"{'latlong': [-39.04198570967633, -3.972272374155126], 'name': '1ª Macro - Fortaleza'}","{'latlong': [-38.26279503575439, -5.2411729332342185], 'name': '5ª Macro - Litoral Leste/Jaguaribe'}",18,140.29094146329456
2009,"{'latlong': [-39.04198570967633, -3.972272374155126], 'name': '1ª Macro - Fortaleza'}","{'latlong': [-39.04198570967633, -3.972272374155126], 'name': '1ª Macro - Fortaleza'}",5560,0.0
2009,"{'latlong': [-39.04198570967633, -3.972272374155126], 'name': '1ª Macro - Fortaleza'}","{'latlong': [-39.4424043736871, -6.6823328399832285], 'name': '3ª Macro - Cariri'}",1,238.1362922408207
2009,"{'latlong': [-39.04198570967633, -3.972272374155126], 'name': '1ª Macro - Fortaleza'}","{'latlong': [-40.49827164718406, -4.270228494122716], 'name': '2ª Macro - Sobral'}",4,163.69432955223883
2009,"{'latlong': [-39.4424043736871, -6.6823328399832285], 'name': '3ª Macro - Cariri'}","{'latlong': [-39.04198570967633, -3.972272374155126], 'name': '1ª Macro - Fortaleza'}",45,238.1362922408207
2009,"{'latlong': [-39.4424043736871, -6.6823328399832285], 'name': '3ª Macro - Cariri'}","{'latlong': [-39.4424043736871, -6.6823328399832285], 'name': '3ª Macro - Cariri'}",2323,0.0
2009,"{'latlong': [-39.4424043736871, -6.6823328399832285], 'name': '3ª Macro - Cariri'}","{'latlong': [-40.49827164718406, -4.270228494122716], 'name': '2ª Macro - Sobral'}",1,237.07015549816794
2009,"{'latlong': [-39.5970436535868, -5.3600126499898675], 'name': '4ª Macro - Sertão Central'}","{'latlong': [-39.04198570967633, -3.972272374155126], 'name': '1ª Macro - Fortaleza'}",67,134.60427573279884
2009,"{'latlong': [-39.5970436535868, -5.3600126499898675], 'name': '4ª Macro - Sertão Central'}","{'latlong': [-39.5970436535868, -5.3600126499898675], 'name': '4ª Macro - Sertão Central'}",878,0.0
2009,"{'latlong': [-40.49827164718406, -4.270228494122716], 'name': '2ª Macro - Sobral'}","{'latlong': [-39.04198570967633, -3.972272374155126], 'name': '1ª Macro - Fortaleza'}",75,163.69432955223883
2009,"{'latlong': [-40.49827164718406, -4.270228494122716], 'name': '2ª Macro - Sobral'}","{'latlong': [-39.5970436535868, -5.3600126499898675], 'name': '4ª Macro - Sertão Central'}",2,136.6063403884904
2009,"{'latlong': [-40.49827164718406, -4.270228494122716], 'name': '2ª Macro - Sobral'}","{'latlong': [-40.49827164718406, -4.270228494122716], 'name': '2ª Macro - Sobral'}",2512,0.0
2010,"{'latlong': [-38.26279503575439, -5.2411729332342185], 'name': '5ª Macro - Litoral Leste/Jaguaribe'}","{'latlong': [-38.26279503575439, -5.2411729332342185], 'name': '5ª Macro - Litoral Leste/Jaguaribe'}",375,0.0
2010,"{'latlong': [-38.26279503575439, -5.2411729332342185], 'name': '5ª Macro - Litoral Leste/Jaguaribe'}","{'latlong': [-39.04198570967633, -3.972272374155126], 'name': '1ª Macro - Fortaleza'}",70,140.29094146329456
2010,"{'latlong': [-38.26279503575439, -5.2411729332342185], 'name': '5ª Macro - Litoral Leste/Jaguaribe'}","{'latlong': [-39.4424043736871, -6.6823328399832285], 'name': '3ª Macro - Cariri'}",1,181.09845882673415
2010,"{'latlong': [-39.04198570967633, -3.972272374155126], 'name': '1ª Macro - Fortaleza'}","{'latlong': [-38.26279503575439, -5.2411729332342185], 'name': '5ª Macro - Litoral Leste/Jaguaribe'}",18,140.29094146329456
2010,"{'latlong': [-39.04198570967633, -3.972272374155126], 'name': '1ª Macro - Fortaleza'}","{'latlong': [-39.04198570967633, -3.972272374155126], 'name': '1ª Macro - Fortaleza'}",4994,0.0
2010,"{'latlong': [-39.04198570967633, -3.972272374155126], 'name': '1ª Macro - Fortaleza'}","{'latlong': [-40.49827164718406, -4.270228494122716], 'name': '2ª Macro - Sobral'}",5,163.69432955223883
2010,"{'latlong': [-39.4424043736871, -6.6823328399832285], 'name': '3ª Macro - Cariri'}","{'latlong': [-39.04198570967633, -3.972272374155126], 'name': '1ª Macro - Fortaleza'}",44,238.1362922408207
2010,"{'latlong': [-39.4424043736871, -6.6823328399832285], 'name': '3ª Macro - Cariri'}","{'latlong': [-39.4424043736871, -6.6823328399832285], 'name': '3ª Macro - Cariri'}",1848,0.0
2010,"{'latlong': [-39.4424043736871, -6.6823328399832285], 'name': '3ª Macro - Cariri'}","{'latlong': [-39.5970436535868, -5.3600126499898675], 'name': '4ª Macro - Sertão Central'}",1,114.99291452469504
2010,"{'latlong': [-39.5970436535868, -5.3600126499898675], 'name': '4ª Macro - Sertão Central'}","{'latlong': [-39.04198570967633, -3.972272374155126], 'name': '1ª Macro - Fortaleza'}",67,134.60427573279884
2010,"{'latlong': [-39.5970436535868, -5.3600126499898675], 'name': '4ª Macro - Sertão Central'}","{'latlong': [-39.5970436535868, -5.3600126499898675], 'name': '4ª Macro - Sertão Central'}",634,0.0
2010,"{'latlong': [-40.49827164718406, -4.270228494122716], 'name': '2ª Macro - Sobral'}","{'latlong': [-39.04198570967633, -3.972272374155126], 'name': '1ª Macro - Fortaleza'}",51,163.69432955223883
2010,"{'latlong': [-40.49827164718406, -4.270228494122716], 'name': '2ª Macro - Sobral'}","{'latlong': [-39.4424043736871, -6.6823328399832285], 'name': '3ª Macro - Cariri'}",1,237.07015549816794
2010,"{'latlong': [-40.49827164718406, -4.270228494122716], 'name': '2ª Macro - Sobral'}","{'latlong': [-39.5970436535868, -5.3600126499898675], 'name': '4ª Macro - Sertão Central'}",3,136.6063403884904
2010,"{'latlong': [-40.49827164718406, -4.270228494122716], 'name': '2ª Macro - Sobral'}","{'latlong': [-40.49827164718406, -4.270228494122716], 'name': '2ª Macro - Sobral'}",2002,0.0
2011,"{'latlong': [-38.26279503575439, -5.2411729332342185], 'name': '5ª Macro - Litoral Leste/Jaguaribe'}","{'latlong': [-38.26279503575439, -5.2411729332342185], 'name': '5ª Macro - Litoral Leste/Jaguaribe'}",389,0.0
2011,"{'latlong': [-38.26279503575439, -5.2411729332342185], 'name': '5ª Macro - Litoral Leste/Jaguaribe'}","{'latlong': [-39.04198570967633, -3.972272374155126], 'name': '1ª Macro - Fortaleza'}",76,140.29094146329456
2011,"{'latlong': [-38.26279503575439, -5.2411729332342185], 'name': '5ª Macro - Litoral Leste/Jaguaribe'}","{'latlong': [-39.4424043736871, -6.6823328399832285], 'name': '3ª Macro - Cariri'}",2,181.09845882673415
2011,"{'latlong': [-39.04198570967633, -3.972272374155126], 'name': '1ª Macro - Fortaleza'}","{'latlong': [-38.26279503575439, -5.2411729332342185], 'name': '5ª Macro - Litoral Leste/Jaguaribe'}",11,140.29094146329456
2011,"{'latlong': [-39.04198570967633, -3.972272374155126], 'name': '1ª Macro - Fortaleza'}","{'latlong': [-39.04198570967633, -3.972272374155126], 'name': '1ª Macro - Fortaleza'}",4430,0.0
2011,"{'latlong': [-39.04198570967633, -3.972272374155126], 'name': '1ª Macro - Fortaleza'}","{'latlong': [-39.4424043736871, -6.6823328399832285], 'name': '3ª Macro - Cariri'}",2,238.1362922408207
2011,"{'latlong': [-39.4424043736871, -6.6823328399832285], 'name': '3ª Macro - Cariri'}","{'latlong': [-39.04198570967633, -3.972272374155126], 'name': '1ª Macro - Fortaleza'}",44,238.1362922408207
2011,"{'latlong': [-39.4424043736871, -6.6823328399832285], 'name': '3ª Macro - Cariri'}","{'latlong': [-39.4424043736871, -6.6823328399832285], 'name': '3ª Macro - Cariri'}",1897,0.0
2011,"{'latlong': [-39.4424043736871, -6.6823328399832285], 'name': '3ª Macro - Cariri'}","{'latlong': [-39.5970436535868, -5.3600126499898675], 'name': '4ª Macro - Sertão Central'}",2,114.99291452469504
2011,"{'latlong': [-39.5970436535868, -5.3600126499898675], 'name': '4ª Macro - Sertão Central'}","{'latlong': [-39.04198570967633, -3.972272374155126], 'name': '1ª Macro - Fortaleza'}",86,134.60427573279884
2011,"{'latlong': [-39.5970436535868, -5.3600126499898675], 'name': '4ª Macro - Sertão Central'}","{'latlong': [-39.4424043736871, -6.6823328399832285], 'name': '3ª Macro - Cariri'}",1,114.99291452469504
2011,"{'latlong': [-39.5970436535868, -5.3600126499898675], 'name': '4ª Macro - Sertão Central'}","{'latlong': [-39.5970436535868, -5.3600126499898675], 'name': '4ª Macro - Sertão Central'}",754,0.0
2011,"{'latlong': [-40.49827164718406, -4.270228494122716], 'name': '2ª Macro - Sobral'}","{'latlong': [-39.04198570967633, -3.972272374155126], 'name': '1ª Macro - Fortaleza'}",34,163.69432955223883
2011,"{'latlong': [-40.49827164718406, -4.270228494122716], 'name': '2ª Macro - Sobral'}","{'latlong': [-39.5970436535868, -5.3600126499898675], 'name': '4ª Macro - Sertão Central'}",3,136.6063403884904
2011,"{'latlong': [-40.49827164718406, -4.270228494122716], 'name': '2ª Macro - Sobral'}","{'latlong': [-40.49827164718406, -4.270228494122716], 'name': '2ª Macro - Sobral'}",2292,0.0
2012,"{'latlong': [-38.26279503575439, -5.2411729332342185], 'name': '5ª Macro - Litoral Leste/Jaguaribe'}","{'latlong': [-38.26279503575439, -5.2411729332342185], 'name': '5ª Macro - Litoral Leste/Jaguaribe'}",331,0.0
2012,"{'latlong': [-38.26279503575439, -5.2411729332342185], 'name': '5ª Macro - Litoral Leste/Jaguaribe'}","{'latlong': [-39.04198570967633, -3.972272374155126], 'name': '1ª Macro - Fortaleza'}",72,140.29094146329456
2012,"{'latlong': [-38.26279503575439, -5.2411729332342185], 'name': '5ª Macro - Litoral Leste/Jaguaribe'}","{'latlong': [-39.4424043736871, -6.6823328399832285], 'name': '3ª Macro - Cariri'}",1,181.09845882673415
2012,"{'latlong': [-38.26279503575439, -5.2411729332342185], 'name': '5ª Macro - Litoral Leste/Jaguaribe'}","{'latlong': [-39.5970436535868, -5.3600126499898675], 'name': '4ª Macro - Sertão Central'}",1,148.47845738572832
2012,"{'latlong': [-39.04198570967633, -3.972272374155126], 'name': '1ª Macro - Fortaleza'}","{'latlong': [-38.26279503575439, -5.2411729332342185], 'name': '5ª Macro - Litoral Leste/Jaguaribe'}",2,140.29094146329456
2012,"{'latlong': [-39.04198570967633, -3.972272374155126], 'name': '1ª Macro - Fortaleza'}","{'latlong': [-39.04198570967633, -3.972272374155126], 'name': '1ª Macro - Fortaleza'}",3427,0.0
2012,"{'latlong': [-39.04198570967633, -3.972272374155126], 'name': '1ª Macro - Fortaleza'}","{'latlong': [-39.4424043736871, -6.6823328399832285], 'name': '3ª Macro - Cariri'}",1,238.1362922408207
2012,"{'latlong': [-39.04198570967633, -3.972272374155126], 'name': '1ª Macro - Fortaleza'}","{'latlong': [-39.5970436535868, -5.3600126499898675], 'name': '4ª Macro - Sertão Central'}",1,134.60427573279884
2012,"{'latlong': [-39.04198570967633, -3.972272374155126], 'name': '1ª Macro - Fortaleza'}","{'latlong': [-40.49827164718406, -4.270228494122716], 'name': '2ª Macro - Sobral'}",1,163.69432955223883
2012,"{'latlong': [-39.4424043736871, -6.6823328399832285], 'name': '3ª Macro - Cariri'}","{'latlong': [-39.04198570967633, -3.972272374155126], 'name': '1ª Macro - Fortaleza'}",41,238.1362922408207
2012,"{'latlong': [-39.4424043736871, -6.6823328399832285], 'name': '3ª Macro - Cariri'}","{'latlong': [-39.4424043736871, -6.6823328399832285], 'name': '3ª Macro - Cariri'}",1543,0.0
2012,"{'latlong': [-39.4424043736871, -6.6823328399832285], 'name': '3ª Macro - Cariri'}","{'latlong': [-39.5970436535868, -5.3600126499898675], 'name': '4ª Macro - Sertão Central'}",1,114.99291452469504
2012,"{'latlong': [-39.5970436535868, -5.3600126499898675], 'name': '4ª Macro - Sertão Central'}","{'latlong': [-39.04198570967633, -3.972272374155126], 'name': '1ª Macro - Fortaleza'}",75,134.60427573279884
2012,"{'latlong': [-39.5970436535868, -5.3600126499898675], 'name': '4ª Macro - Sertão Central'}","{'latlong': [-39.4424043736871, -6.6823328399832285], 'name': '3ª Macro - Cariri'}",1,114.99291452469504
2012,"{'latlong': [-39.5970436535868, -5.3600126499898675], 'name': '4ª Macro - Sertão Central'}","{'latlong': [-39.5970436535868, -5.3600126499898675], 'name': '4ª Macro - Sertão Central'}",574,0.0
2012,"{'latlong': [-40.49827164718406, -4.270228494122716], 'name': '2ª Macro - Sobral'}","{'latlong': [-39.04198570967633, -3.972272374155126], 'name': '1ª Macro - Fortaleza'}",24,163.69432955223883
2012,"{'latlong': [-40.49827164718406, -4.270228494122716], 'name': '2ª Macro - Sobral'}","{'latlong': [-40.49827164718406, -4.270228494122716], 'name': '2ª Macro - Sobral'}",1948,0.0
2013,"{'latlong': [-38.26279503575439, -5.2411729332342185], 'name': '5ª Macro - Litoral Leste/Jaguaribe'}","{'latlong': [-38.26279503575439, -5.2411729332342185], 'name': '5ª Macro - Litoral Leste/Jaguaribe'}",399,0.0
2013,"{'latlong': [-38.26279503575439, -5.2411729332342185], 'name': '5ª Macro - Litoral Leste/Jaguaribe'}","{'latlong': [-39.04198570967633, -3.972272374155126], 'name': '1ª Macro - Fortaleza'}",83,140.29094146329456
2013,"{'latlong': [-38.26279503575439, -5.2411729332342185], 'name': '5ª Macro - Litoral Leste/Jaguaribe'}","{'latlong': [-39.4424043736871, -6.6823328399832285], 'name': '3ª Macro - Cariri'}",1,181.09845882673415
2013,"{'latlong': [-39.04198570967633, -3.972272374155126], 'name': '1ª Macro - Fortaleza'}","{'latlong': [-38.26279503575439, -5.2411729332342185], 'name': '5ª Macro - Litoral Leste/Jaguaribe'}",2,140.29094146329456
2013,"{'latlong': [-39.04198570967633, -3.972272374155126], 'name': '1ª Macro - Fortaleza'}","{'latlong': [-39.04198570967633, -3.972272374155126], 'name': '1ª Macro - Fortaleza'}",3479,0.0
2013,"{'latlong': [-39.04198570967633, -3.972272374155126], 'name': '1ª Macro - Fortaleza'}","{'latlong': [-39.4424043736871, -6.6823328399832285], 'name': '3ª Macro - Cariri'}",1,238.1362922408207
2013,"{'latlong': [-39.04198570967633, -3.972272374155126], 'name': '1ª Macro - Fortaleza'}","{'latlong': [-39.5970436535868, -5.3600126499898675], 'name': '4ª Macro - Sertão Central'}",2,134.60427573279884
2013,"{'latlong': [-39.04198570967633, -3.972272374155126], 'name': '1ª Macro - Fortaleza'}","{'latlong': [-40.49827164718406, -4.270228494122716], 'name': '2ª Macro - Sobral'}",6,163.69432955223883
2013,"{'latlong': [-39.4424043736871, -6.6823328399832285], 'name': '3ª Macro - Cariri'}","{'latlong': [-39.04198570967633, -3.972272374155126], 'name': '1ª Macro - Fortaleza'}",35,238.1362922408207
2013,"{'latlong': [-39.4424043736871, -6.6823328399832285], 'name': '3ª Macro - Cariri'}","{'latlong': [-39.4424043736871, -6.6823328399832285], 'name': '3ª Macro - Cariri'}",1514,0.0
2013,"{'latlong': [-39.4424043736871, -6.6823328399832285], 'name': '3ª Macro - Cariri'}","{'latlong': [-39.5970436535868, -5.3600126499898675], 'name': '4ª Macro - Sertão Central'}",1,114.99291452469504
2013,"{'latlong': [-39.5970436535868, -5.3600126499898675], 'name': '4ª Macro - Sertão Central'}","{'latlong': [-39.04198570967633, -3.972272374155126], 'name': '1ª Macro - Fortaleza'}",77,134.60427573279884
2013,"{'latlong': [-39.5970436535868, -5.3600126499898675], 'name': '4ª Macro - Sertão Central'}","{'latlong': [-39.5970436535868, -5.3600126499898675], 'name': '4ª Macro - Sertão Central'}",546,0.0
2013,"{'latlong': [-40.49827164718406, -4.270228494122716], 'name': '2ª Macro - Sobral'}","{'latlong': [-39.04198570967633, -3.972272374155126], 'name': '1ª Macro - Fortaleza'}",61,163.69432955223883
2013,"{'latlong': [-40.49827164718406, -4.270228494122716], 'name': '2ª Macro - Sobral'}","{'latlong': [-39.4424043736871, -6.6823328399832285], 'name': '3ª Macro - Cariri'}",1,237.07015549816794
2013,"{'latlong': [-40.49827164718406, -4.270228494122716], 'name': '2ª Macro - Sobral'}","{'latlong': [-40.49827164718406, -4.270228494122716], 'name': '2ª Macro - Sobral'}",1708,0.0
2014,"{'latlong': [-38.26279503575439, -5.2411729332342185], 'name': '5ª Macro - Litoral Leste/Jaguaribe'}","{'latlong': [-38.26279503575439, -5.2411729332342185], 'name': '5ª Macro - Litoral Leste/Jaguaribe'}",380,0.0
2014,"{'latlong': [-38.26279503575439, -5.2411729332342185], 'name': '5ª Macro - Litoral Leste/Jaguaribe'}","{'latlong': [-39.04198570967633, -3.972272374155126], 'name': '1ª Macro - Fortaleza'}",61,140.29094146329456
2014,"{'latlong': [-38.26279503575439, -5.2411729332342185], 'name': '5ª Macro - Litoral Leste/Jaguaribe'}","{'latlong': [-39.4424043736871, -6.6823328399832285], 'name': '3ª Macro - Cariri'}",2,181.09845882673415
2014,"{'latlong': [-39.04198570967633, -3.972272374155126], 'name': '1ª Macro - Fortaleza'}","{'latlong': [-38.26279503575439, -5.2411729332342185], 'name': '5ª Macro - Litoral Leste/Jaguaribe'}",2,140.29094146329456
2014,"{'latlong': [-39.04198570967633, -3.972272374155126], 'name': '1ª Macro - Fortaleza'}","{'latlong': [-39.04198570967633, -3.972272374155126], 'name': '1ª Macro - Fortaleza'}",3330,0.0
2014,"{'latlong': [-39.04198570967633, -3.972272374155126], 'name': '1ª Macro - Fortaleza'}","{'latlong': [-39.4424043736871, -6.6823328399832285], 'name': '3ª Macro - Cariri'}",1,238.1362922408207
2014,"{'latlong': [-39.04198570967633, -3.972272374155126], 'name': '1ª Macro - Fortaleza'}","{'latlong': [-39.5970436535868, -5.3600126499898675], 'name': '4ª Macro - Sertão Central'}",2,134.60427573279884
2014,"{'latlong': [-39.4424043736871, -6.6823328399832285], 'name': '3ª Macro - Cariri'}","{'latlong': [-39.04198570967633, -3.972272374155126], 'name': '1ª Macro - Fortaleza'}",32,238.1362922408207
2014,"{'latlong': [-39.4424043736871, -6.6823328399832285], 'name': '3ª Macro - Cariri'}","{'latlong': [-39.4424043736871, -6.6823328399832285], 'name': '3ª Macro - Cariri'}",1555,0.0
2014,"{'latlong': [-39.5970436535868, -5.3600126499898675], 'name': '4ª Macro - Sertão Central'}","{'latlong': [-39.04198570967633, -3.972272374155126], 'name': '1ª Macro - Fortaleza'}",120,134.60427573279884
2014,"{'latlong': [-39.5970436535868, -5.3600126499898675], 'name': '4ª Macro - Sertão Central'}","{'latlong': [-39.4424043736871, -6.6823328399832285], 'name': '3ª Macro - Cariri'}",1,114.99291452469504
2014,"{'latlong': [-39.5970436535868, -5.3600126499898675], 'name': '4ª Macro - Sertão Central'}","{'latlong': [-39.5970436535868, -5.3600126499898675], 'name': '4ª Macro - Sertão Central'}",444,0.0
2014,"{'latlong': [-40.49827164718406, -4.270228494122716], 'name': '2ª Macro - Sobral'}","{'latlong': [-39.04198570967633, -3.972272374155126], 'name': '1ª Macro - Fortaleza'}",47,163.69432955223883
2014,"{'latlong': [-40.49827164718406, -4.270228494122716], 'name': '2ª Macro - Sobral'}","{'latlong': [-39.5970436535868, -5.3600126499898675], 'name': '4ª Macro - Sertão Central'}",1,136.6063403884904
2014,"{'latlong': [-40.49827164718406, -4.270228494122716], 'name': '2ª Macro - Sobral'}","{'latlong': [-40.49827164718406, -4.270228494122716], 'name': '2ª Macro - Sobral'}",1555,0.0
2015,"{'latlong': [-38.26279503575439, -5.2411729332342185], 'name': '5ª Macro - Litoral Leste/Jaguaribe'}","{'latlong': [-38.26279503575439, -5.2411729332342185], 'name': '5ª Macro - Litoral Leste/Jaguaribe'}",364,0.0
2015,"{'latlong': [-38.26279503575439, -5.2411729332342185], 'name': '5ª Macro - Litoral Leste/Jaguaribe'}","{'latlong': [-39.04198570967633, -3.972272374155126], 'name': '1ª Macro - Fortaleza'}",66,140.29094146329456
2015,"{'latlong': [-38.26279503575439, -5.2411729332342185], 'name': '5ª Macro - Litoral Leste/Jaguaribe'}","{'latlong': [-39.4424043736871, -6.6823328399832285], 'name': '3ª Macro - Cariri'}",1,181.09845882673415
2015,"{'latlong': [-39.04198570967633, -3.972272374155126], 'name': '1ª Macro - Fortaleza'}","{'latlong': [-38.26279503575439, -5.2411729332342185], 'name': '5ª Macro - Litoral Leste/Jaguaribe'}",5,140.29094146329456
2015,"{'latlong': [-39.04198570967633, -3.972272374155126], 'name': '1ª Macro - Fortaleza'}","{'latlong': [-39.04198570967633, -3.972272374155126], 'name': '1ª Macro - Fortaleza'}",2951,0.0
2015,"{'latlong': [-39.04198570967633, -3.972272374155126], 'name': '1ª Macro - Fortaleza'}","{'latlong': [-39.5970436535868, -5.3600126499898675], 'name': '4ª Macro - Sertão Central'}",2,134.60427573279884
2015,"{'latlong': [-39.04198570967633, -3.972272374155126], 'name': '1ª Macro - Fortaleza'}","{'latlong': [-40.49827164718406, -4.270228494122716], 'name': '2ª Macro - Sobral'}",2,163.69432955223883
2015,"{'latlong': [-39.4424043736871, -6.6823328399832285], 'name': '3ª Macro - Cariri'}","{'latlong': [-39.04198570967633, -3.972272374155126], 'name': '1ª Macro - Fortaleza'}",41,238.1362922408207
2015,"{'latlong': [-39.4424043736871, -6.6823328399832285], 'name': '3ª Macro - Cariri'}","{'latlong': [-39.4424043736871, -6.6823328399832285], 'name': '3ª Macro - Cariri'}",1268,0.0
2015,"{'latlong': [-39.5970436535868, -5.3600126499898675], 'name': '4ª Macro - Sertão Central'}","{'latlong': [-39.04198570967633, -3.972272374155126], 'name': '1ª Macro - Fortaleza'}",121,134.60427573279884
2015,"{'latlong': [-39.5970436535868, -5.3600126499898675], 'name': '4ª Macro - Sertão Central'}","{'latlong': [-39.5970436535868, -5.3600126499898675], 'name': '4ª Macro - Sertão Central'}",396,0.0
2015,"{'latlong': [-40.49827164718406, -4.270228494122716], 'name': '2ª Macro - Sobral'}","{'latlong': [-39.04198570967633, -3.972272374155126], 'name': '1ª Macro - Fortaleza'}",49,163.69432955223883
2015,"{'latlong': [-40.49827164718406, -4.270228494122716], 'name': '2ª Macro - Sobral'}","{'latlong': [-39.5970436535868, -5.3600126499898675], 'name': '4ª Macro - Sertão Central'}",2,136.6063403884904
2015,"{'latlong': [-40.49827164718406, -4.270228494122716], 'name': '2ª Macro - Sobral'}","{'latlong': [-40.49827164718406, -4.270228494122716], 'name': '2ª Macro - Sobral'}",1282,0.0
2016,"{'latlong': [-38.26279503575439, -5.2411729332342185], 'name': '5ª Macro - Litoral Leste/Jaguaribe'}","{'latlong': [-38.26279503575439, -5.2411729332342185], 'name': '5ª Macro - Litoral Leste/Jaguaribe'}",320,0.0
2016,"{'latlong': [-38.26279503575439, -5.2411729332342185], 'name': '5ª Macro - Litoral Leste/Jaguaribe'}","{'latlong': [-39.04198570967633, -3.972272374155126], 'name': '1ª Macro - Fortaleza'}",51,140.29094146329456
2016,"{'latlong': [-38.26279503575439, -5.2411729332342185], 'name': '5ª Macro - Litoral Leste/Jaguaribe'}","{'latlong': [-39.4424043736871, -6.6823328399832285], 'name': '3ª Macro - Cariri'}",1,181.09845882673415
2016,"{'latlong': [-39.04198570967633, -3.972272374155126], 'name': '1ª Macro - Fortaleza'}","{'latlong': [-39.04198570967633, -3.972272374155126], 'name': '1ª Macro - Fortaleza'}",2686,0.0
2016,"{'latlong': [-39.04198570967633, -3.972272374155126], 'name': '1ª Macro - Fortaleza'}","{'latlong': [-40.49827164718406, -4.270228494122716], 'name': '2ª Macro - Sobral'}",1,163.69432955223883
2016,"{'latlong': [-39.4424043736871, -6.6823328399832285], 'name': '3ª Macro - Cariri'}","{'latlong': [-39.04198570967633, -3.972272374155126], 'name': '1ª Macro - Fortaleza'}",38,238.1362922408207
2016,"{'latlong': [-39.4424043736871, -6.6823328399832285], 'name': '3ª Macro - Cariri'}","{'latlong': [-39.4424043736871, -6.6823328399832285], 'name': '3ª Macro - Cariri'}",1225,0.0
2016,"{'latlong': [-39.5970436535868, -5.3600126499898675], 'name': '4ª Macro - Sertão Central'}","{'latlong': [-39.04198570967633, -3.972272374155126], 'name': '1ª Macro - Fortaleza'}",90,134.60427573279884
2016,"{'latlong': [-39.5970436535868, -5.3600126499898675], 'name': '4ª Macro - Sertão Central'}","{'latlong': [-39.5970436535868, -5.3600126499898675], 'name': '4ª Macro - Sertão Central'}",342,0.0
2016,"{'latlong': [-39.5970436535868, -5.3600126499898675], 'name': '4ª Macro - Sertão Central'}","{'latlong': [-40.49827164718406, -4.270228494122716], 'name': '2ª Macro - Sobral'}",1,136.6063403884904
2016,"{'latlong': [-40.49827164718406, -4.270228494122716], 'name': '2ª Macro - Sobral'}","{'latlong': [-39.04198570967633, -3.972272374155126], 'name': '1ª Macro - Fortaleza'}",52,163.69432955223883
2016,"{'latlong': [-40.49827164718406, -4.270228494122716], 'name': '2ª Macro - Sobral'}","{'latlong': [-40.49827164718406, -4.270228494122716], 'name': '2ª Macro - Sobral'}",1344,0.0
2017,"{'latlong': [-38.26279503575439, -5.2411729332342185], 'name': '5ª Macro - Litoral Leste/Jaguaribe'}","{'latlong': [-38.26279503575439, -5.2411729332342185], 'name': '5ª Macro - Litoral Leste/Jaguaribe'}",333,0.0
2017,"{'latlong': [-38.26279503575439, -5.2411729332342185], 'name': '5ª Macro - Litoral Leste/Jaguaribe'}","{'latlong': [-39.04198570967633, -3.972272374155126], 'name': '1ª Macro - Fortaleza'}",60,140.29094146329456
2017,"{'latlong': [-39.04198570967633, -3.972272374155126], 'name': '1ª Macro - Fortaleza'}","{'latlong': [-38.26279503575439, -5.2411729332342185], 'name': '5ª Macro - Litoral Leste/Jaguaribe'}",6,140.29094146329456
2017,"{'latlong': [-39.04198570967633, -3.972272374155126], 'name': '1ª Macro - Fortaleza'}","{'latlong': [-39.04198570967633, -3.972272374155126], 'name': '1ª Macro - Fortaleza'}",2830,0.0
2017,"{'latlong': [-39.04198570967633, -3.972272374155126], 'name': '1ª Macro - Fortaleza'}","{'latlong': [-39.4424043736871, -6.6823328399832285], 'name': '3ª Macro - Cariri'}",9,238.1362922408207
2017,"{'latlong': [-39.04198570967633, -3.972272374155126], 'name': '1ª Macro - Fortaleza'}","{'latlong': [-40.49827164718406, -4.270228494122716], 'name': '2ª Macro - Sobral'}",1,163.69432955223883
2017,"{'latlong': [-39.4424043736871, -6.6823328399832285], 'name': '3ª Macro - Cariri'}","{'latlong': [-39.04198570967633, -3.972272374155126], 'name': '1ª Macro - Fortaleza'}",50,238.1362922408207
2017,"{'latlong': [-39.4424043736871, -6.6823328399832285], 'name': '3ª Macro - Cariri'}","{'latlong': [-39.4424043736871, -6.6823328399832285], 'name': '3ª Macro - Cariri'}",1089,0.0
2017,"{'latlong': [-39.5970436535868, -5.3600126499898675], 'name': '4ª Macro - Sertão Central'}","{'latlong': [-39.04198570967633, -3.972272374155126], 'name': '1ª Macro - Fortaleza'}",56,134.60427573279884
2017,"{'latlong': [-39.5970436535868, -5.3600126499898675], 'name': '4ª Macro - Sertão Central'}","{'latlong': [-39.4424043736871, -6.6823328399832285], 'name': '3ª Macro - Cariri'}",2,114.99291452469504
2017,"{'latlong': [-39.5970436535868, -5.3600126499898675], 'name': '4ª Macro - Sertão Central'}","{'latlong': [-39.5970436535868, -5.3600126499898675], 'name': '4ª Macro - Sertão Central'}",320,0.0
2017,"{'latlong': [-39.5970436535868, -5.3600126499898675], 'name': '4ª Macro - Sertão Central'}","{'latlong': [-40.49827164718406, -4.270228494122716], 'name': '2ª Macro - Sobral'}",1,136.6063403884904
2017,"{'latlong': [-40.49827164718406, -4.270228494122716], 'name': '2ª Macro - Sobral'}","{'latlong': [-39.04198570967633, -3.972272374155126], 'name': '1ª Macro - Fortaleza'}",41,163.69432955223883
2017,"{'latlong': [-40.49827164718406, -4.270228494122716], 'name': '2ª Macro - Sobral'}","{'latlong': [-39.5970436535868, -5.3600126499898675], 'name': '4ª Macro - Sertão Central'}",1,136.6063403884904
2017,"{'latlong': [-40.49827164718406, -4.270228494122716], 'name': '2ª Macro - Sobral'}","{'latlong': [-40.49827164718406, -4.270228494122716], 'name': '2ª Macro - Sobral'}",1193,0.0
2018,"{'latlong': [-38.26279503575439, -5.2411729332342185], 'name': '5ª Macro - Litoral Leste/Jaguaribe'}","{'latlong': [-38.26279503575439, -5.2411729332342185], 'name': '5ª Macro - Litoral Leste/Jaguaribe'}",191,0.0
2018,"{'latlong': [-38.26279503575439, -5.2411729332342185], 'name': '5ª Macro - Litoral Leste/Jaguaribe'}","{'latlong': [-39.04198570967633, -3.972272374155126], 'name': '1ª Macro - Fortaleza'}",97,140.29094146329456
2018,"{'latlong': [-39.04198570967633, -3.972272374155126], 'name': '1ª Macro - Fortaleza'}","{'latlong': [-38.26279503575439, -5.2411729332342185], 'name': '5ª Macro - Litoral Leste/Jaguaribe'}",5,140.29094146329456
2018,"{'latlong': [-39.04198570967633, -3.972272374155126], 'name': '1ª Macro - Fortaleza'}","{'latlong': [-39.04198570967633, -3.972272374155126], 'name': '1ª Macro - Fortaleza'}",2819,0.0
2018,"{'latlong': [-39.04198570967633, -3.972272374155126], 'name': '1ª Macro - Fortaleza'}","{'latlong': [-39.5970436535868, -5.3600126499898675], 'name': '4ª Macro - Sertão Central'}",2,134.60427573279884
2018,"{'latlong': [-39.04198570967633, -3.972272374155126], 'name': '1ª Macro - Fortaleza'}","{'latlong': [-40.49827164718406, -4.270228494122716], 'name': '2ª Macro - Sobral'}",3,163.69432955223883
2018,"{'latlong': [-39.4424043736871, -6.6823328399832285], 'name': '3ª Macro - Cariri'}","{'latlong': [-39.04198570967633, -3.972272374155126], 'name': '1ª Macro - Fortaleza'}",44,238.1362922408207
2018,"{'latlong': [-39.4424043736871, -6.6823328399832285], 'name': '3ª Macro - Cariri'}","{'latlong': [-39.4424043736871, -6.6823328399832285], 'name': '3ª Macro - Cariri'}",872,0.0
2018,"{'latlong': [-39.4424043736871, -6.6823328399832285], 'name': '3ª Macro - Cariri'}","{'latlong': [-39.5970436535868, -5.3600126499898675], 'name': '4ª Macro - Sertão Central'}",1,114.99291452469504
2018,"{'latlong': [-39.4424043736871, -6.6823328399832285], 'name': '3ª Macro - Cariri'}","{'latlong': [-40.49827164718406, -4.270228494122716], 'name': '2ª Macro - Sobral'}",2,237.07015549816794
2018,"{'latlong': [-39.5970436535868, -5.3600126499898675], 'name': '4ª Macro - Sertão Central'}","{'latlong': [-39.04198570967633, -3.972272374155126], 'name': '1ª Macro - Fortaleza'}",73,134.60427573279884
2018,"{'latlong': [-39.5970436535868, -5.3600126499898675], 'name': '4ª Macro - Sertão Central'}","{'latlong': [-39.5970436535868, -5.3600126499898675], 'name': '4ª Macro - Sertão Central'}",345,0.0
2018,"{'latlong': [-40.49827164718406, -4.270228494122716], 'name': '2ª Macro - Sobral'}","{'latlong': [-39.04198570967633, -3.972272374155126], 'name': '1ª Macro - Fortaleza'}",57,163.69432955223883
2018,"{'latlong': [-40.49827164718406, -4.270228494122716], 'name': '2ª Macro - Sobral'}","{'latlong': [-40.49827164718406, -4.270228494122716], 'name': '2ª Macro - Sobral'}",1156,0.0
2019,"{'latlong': [-38.26279503575439, -5.2411729332342185], 'name': '5ª Macro - Litoral Leste/Jaguaribe'}","{'latlong': [-38.26279503575439, -5.2411729332342185], 'name': '5ª Macro - Litoral Leste/Jaguaribe'}",163,0.0
2019,"{'latlong': [-38.26279503575439, -5.2411729332342185], 'name': '5ª Macro - Litoral Leste/Jaguaribe'}","{'latlong': [-39.04198570967633, -3.972272374155126], 'name': '1ª Macro - Fortaleza'}",71,140.29094146329456
2019,"{'latlong': [-38.26279503575439, -5.2411729332342185], 'name': '5ª Macro - Litoral Leste/Jaguaribe'}","{'latlong': [-39.4424043736871, -6.6823328399832285], 'name': '3ª Macro - Cariri'}",1,181.09845882673415
2019,"{'latlong': [-38.26279503575439, -5.2411729332342185], 'name': '5ª Macro - Litoral Leste/Jaguaribe'}","{'latlong': [-39.5970436535868, -5.3600126499898675], 'name': '4ª Macro - Sertão Central'}",3,148.47845738572832
2019,"{'latlong': [-39.04198570967633, -3.972272374155126], 'name': '1ª Macro - Fortaleza'}","{'latlong': [-38.26279503575439, -5.2411729332342185], 'name': '5ª Macro - Litoral Leste/Jaguaribe'}",6,140.29094146329456
2019,"{'latlong': [-39.04198570967633, -3.972272374155126], 'name': '1ª Macro - Fortaleza'}","{'latlong': [-39.04198570967633, -3.972272374155126], 'name': '1ª Macro - Fortaleza'}",2751,0.0
2019,"{'latlong': [-39.04198570967633, -3.972272374155126], 'name': '1ª Macro - Fortaleza'}","{'latlong': [-40.49827164718406, -4.270228494122716], 'name': '2ª Macro - Sobral'}",2,163.69432955223883
2019,"{'latlong': [-39.4424043736871, -6.6823328399832285], 'name': '3ª Macro - Cariri'}","{'latlong': [-38.26279503575439, -5.2411729332342185], 'name': '5ª Macro - Litoral Leste/Jaguaribe'}",2,181.09845882673415
2019,"{'latlong': [-39.4424043736871, -6.6823328399832285], 'name': '3ª Macro - Cariri'}","{'latlong': [-39.04198570967633, -3.972272374155126], 'name': '1ª Macro - Fortaleza'}",56,238.1362922408207
2019,"{'latlong': [-39.4424043736871, -6.6823328399832285], 'name': '3ª Macro - Cariri'}","{'latlong': [-39.4424043736871, -6.6823328399832285], 'name': '3ª Macro - Cariri'}",834,0.0
2019,"{'latlong': [-39.4424043736871, -6.6823328399832285], 'name': '3ª Macro - Cariri'}","{'latlong': [-39.5970436535868, -5.3600126499898675], 'name': '4ª Macro - Sertão Central'}",1,114.99291452469504
2019,"{'latlong': [-39.5970436535868, -5.3600126499898675], 'name': '4ª Macro - Sertão Central'}","{'latlong': [-39.04198570967633, -3.972272374155126], 'name': '1ª Macro - Fortaleza'}",62,134.60427573279884
2019,"{'latlong': [-39.5970436535868, -5.3600126499898675], 'name': '4ª Macro - Sertão Central'}","{'latlong': [-39.4424043736871, -6.6823328399832285], 'name': '3ª Macro - Cariri'}",1,114.99291452469504
2019,"{'latlong': [-39.5970436535868, -5.3600126499898675], 'name': '4ª Macro - Sertão Central'}","{'latlong': [-39.5970436535868, -5.3600126499898675], 'name': '4ª Macro - Sertão Central'}",351,0.0
2019,"{'latlong': [-40.49827164718406, -4.270228494122716], 'name': '2ª Macro - Sobral'}","{'latlong': [-39.04198570967633, -3.972272374155126], 'name': '1ª Macro - Fortaleza'}",69,163.69432955223883
2019,"{'latlong': [-40.49827164718406, -4.270228494122716], 'name': '2ª Macro - Sobral'}","{'latlong': [-39.5970436535868, -5.3600126499898675], 'name': '4ª Macro - Sertão Central'}",1,136.6063403884904
2019,"{'latlong': [-40.49827164718406, -4.270228494122716], 'name': '2ª Macro - Sobral'}","{'latlong': [-40.49827164718406, -4.270228494122716], 'name': '2ª Macro - Sobral'}",1198,0.0
2020,"{'latlong': [-38.26279503575439, -5.2411729332342185], 'name': '5ª Macro - Litoral Leste/Jaguaribe'}","{'latlong': [-38.26279503575439, -5.2411729332342185], 'name': '5ª Macro - Litoral Leste/Jaguaribe'}",244,0.0
2020,"{'latlong': [-38.26279503575439, -5.2411729332342185], 'name': '5ª Macro - Litoral Leste/Jaguaribe'}","{'latlong': [-39.04198570967633, -3.972272374155126], 'name': '1ª Macro - Fortaleza'}",36,140.29094146329456
2020,"{'latlong': [-38.26279503575439, -5.2411729332342185], 'name': '5ª Macro - Litoral Leste/Jaguaribe'}","{'latlong': [-39.5970436535868, -5.3600126499898675], 'name': '4ª Macro - Sertão Central'}",15,148.47845738572832
2020,"{'latlong': [-39.04198570967633, -3.972272374155126], 'name': '1ª Macro - Fortaleza'}","{'latlong': [-38.26279503575439, -5.2411729332342185], 'name': '5ª Macro - Litoral Leste/Jaguaribe'}",1,140.29094146329456
2020,"{'latlong': [-39.04198570967633, -3.972272374155126], 'name': '1ª Macro - Fortaleza'}","{'latlong': [-39.04198570967633, -3.972272374155126], 'name': '1ª Macro - Fortaleza'}",3754,0.0
2020,"{'latlong': [-39.04198570967633, -3.972272374155126], 'name': '1ª Macro - Fortaleza'}","{'latlong': [-39.4424043736871, -6.6823328399832285], 'name': '3ª Macro - Cariri'}",1,238.1362922408207
2020,"{'latlong': [-39.04198570967633, -3.972272374155126], 'name': '1ª Macro - Fortaleza'}","{'latlong': [-39.5970436535868, -5.3600126499898675], 'name': '4ª Macro - Sertão Central'}",21,134.60427573279884
2020,"{'latlong': [-39.04198570967633, -3.972272374155126], 'name': '1ª Macro - Fortaleza'}","{'latlong': [-40.49827164718406, -4.270228494122716], 'name': '2ª Macro - Sobral'}",6,163.69432955223883
2020,"{'latlong': [-39.4424043736871, -6.6823328399832285], 'name': '3ª Macro - Cariri'}","{'latlong': [-39.04198570967633, -3.972272374155126], 'name': '1ª Macro - Fortaleza'}",30,238.1362922408207
2020,"{'latlong': [-39.4424043736871, -6.6823328399832285], 'name': '3ª Macro - Cariri'}","{'latlong': [-39.4424043736871, -6.6823328399832285], 'name': '3ª Macro - Cariri'}",361,0.0
2020,"{'latlong': [-39.4424043736871, -6.6823328399832285], 'name': '3ª Macro - Cariri'}","{'latlong': [-39.5970436535868, -5.3600126499898675], 'name': '4ª Macro - Sertão Central'}",1,114.99291452469504
2020,"{'latlong': [-39.5970436535868, -5.3600126499898675], 'name': '4ª Macro - Sertão Central'}","{'latlong': [-38.26279503575439, -5.2411729332342185], 'name': '5ª Macro - Litoral Leste/Jaguaribe'}",1,148.47845738572832
2020,"{'latlong': [-39.5970436535868, -5.3600126499898675], 'name': '4ª Macro - Sertão Central'}","{'latlong': [-39.04198570967633, -3.972272374155126], 'name': '1ª Macro - Fortaleza'}",36,134.60427573279884
2020,"{'latlong': [-39.5970436535868, -5.3600126499898675], 'name': '4ª Macro - Sertão Central'}","{'latlong': [-39.4424043736871, -6.6823328399832285], 'name': '3ª Macro - Cariri'}",1,114.99291452469504
2020,"{'latlong': [-39.5970436535868, -5.3600126499898675], 'name': '4ª Macro - Sertão Central'}","{'latlong': [-39.5970436535868, -5.3600126499898675], 'name': '4ª Macro - Sertão Central'}",183,0.0
2020,"{'latlong': [-40.49827164718406, -4.270228494122716], 'name': '2ª Macro - Sobral'}","{'latlong': [-39.04198570967633, -3.972272374155126], 'name': '1ª Macro - Fortaleza'}",20,163.69432955223883
2020,"{'latlong': [-40.49827164718406, -4.270228494122716], 'name': '2ª Macro - Sobral'}","{'latlong': [-39.5970436535868, -5.3600126499898675], 'name': '4ª Macro - Sertão Central'}",1,136.6063403884904
2020,"{'latlong': [-40.49827164718406, -4.270228494122716], 'name': '2ª Macro - Sobral'}","{'latlong': [-40.49827164718406, -4.270228494122716], 'name': '2ª Macro - Sobral'}",591,0.0
