year,from,to,hospitalizations
1994,"{'latlong': [-41.74084505657541, -21.799306433880908], 'name': 'Macrorregião III'}","{'latlong': [-41.74084505657541, -21.799306433880908], 'name': 'Macrorregião III'}",648
1994,"{'latlong': [-41.74084505657541, -21.799306433880908], 'name': 'Macrorregião III'}","{'latlong': [-42.78374566691811, -22.435006717319105], 'name': 'Macrorregião II'}",6
1994,"{'latlong': [-42.78374566691811, -22.435006717319105], 'name': 'Macrorregião II'}","{'latlong': [-41.74084505657541, -21.799306433880908], 'name': 'Macrorregião III'}",12
1994,"{'latlong': [-42.78374566691811, -22.435006717319105], 'name': 'Macrorregião II'}","{'latlong': [-42.78374566691811, -22.435006717319105], 'name': 'Macrorregião II'}",2577
1994,"{'latlong': [-42.78374566691811, -22.435006717319105], 'name': 'Macrorregião II'}","{'latlong': [-43.93088259914695, -22.50640773396086], 'name': 'Metropolitana I'}",17
1994,"{'latlong': [-43.93088259914695, -22.50640773396086], 'name': 'Metropolitana I'}","{'latlong': [-42.78374566691811, -22.435006717319105], 'name': 'Macrorregião II'}",9
1994,"{'latlong': [-43.93088259914695, -22.50640773396086], 'name': 'Metropolitana I'}","{'latlong': [-43.93088259914695, -22.50640773396086], 'name': 'Metropolitana I'}",421
1995,"{'latlong': [-41.74084505657541, -21.799306433880908], 'name': 'Macrorregião III'}","{'latlong': [-41.74084505657541, -21.799306433880908], 'name': 'Macrorregião III'}",7345
1995,"{'latlong': [-41.74084505657541, -21.799306433880908], 'name': 'Macrorregião III'}","{'latlong': [-42.78374566691811, -22.435006717319105], 'name': 'Macrorregião II'}",85
1995,"{'latlong': [-41.74084505657541, -21.799306433880908], 'name': 'Macrorregião III'}","{'latlong': [-43.93088259914695, -22.50640773396086], 'name': 'Metropolitana I'}",2
1995,"{'latlong': [-42.78374566691811, -22.435006717319105], 'name': 'Macrorregião II'}","{'latlong': [-41.74084505657541, -21.799306433880908], 'name': 'Macrorregião III'}",116
1995,"{'latlong': [-42.78374566691811, -22.435006717319105], 'name': 'Macrorregião II'}","{'latlong': [-42.78374566691811, -22.435006717319105], 'name': 'Macrorregião II'}",30635
1995,"{'latlong': [-42.78374566691811, -22.435006717319105], 'name': 'Macrorregião II'}","{'latlong': [-43.93088259914695, -22.50640773396086], 'name': 'Metropolitana I'}",498
1995,"{'latlong': [-43.93088259914695, -22.50640773396086], 'name': 'Metropolitana I'}","{'latlong': [-41.74084505657541, -21.799306433880908], 'name': 'Macrorregião III'}",2
1995,"{'latlong': [-43.93088259914695, -22.50640773396086], 'name': 'Metropolitana I'}","{'latlong': [-42.78374566691811, -22.435006717319105], 'name': 'Macrorregião II'}",87
1995,"{'latlong': [-43.93088259914695, -22.50640773396086], 'name': 'Metropolitana I'}","{'latlong': [-43.93088259914695, -22.50640773396086], 'name': 'Metropolitana I'}",5142
1996,"{'latlong': [-41.74084505657541, -21.799306433880908], 'name': 'Macrorregião III'}","{'latlong': [-41.74084505657541, -21.799306433880908], 'name': 'Macrorregião III'}",5750
1996,"{'latlong': [-41.74084505657541, -21.799306433880908], 'name': 'Macrorregião III'}","{'latlong': [-42.78374566691811, -22.435006717319105], 'name': 'Macrorregião II'}",91
1996,"{'latlong': [-41.74084505657541, -21.799306433880908], 'name': 'Macrorregião III'}","{'latlong': [-43.93088259914695, -22.50640773396086], 'name': 'Metropolitana I'}",2
1996,"{'latlong': [-42.78374566691811, -22.435006717319105], 'name': 'Macrorregião II'}","{'latlong': [-41.74084505657541, -21.799306433880908], 'name': 'Macrorregião III'}",84
1996,"{'latlong': [-42.78374566691811, -22.435006717319105], 'name': 'Macrorregião II'}","{'latlong': [-42.78374566691811, -22.435006717319105], 'name': 'Macrorregião II'}",33227
1996,"{'latlong': [-42.78374566691811, -22.435006717319105], 'name': 'Macrorregião II'}","{'latlong': [-43.93088259914695, -22.50640773396086], 'name': 'Metropolitana I'}",260
1996,"{'latlong': [-43.93088259914695, -22.50640773396086], 'name': 'Metropolitana I'}","{'latlong': [-41.74084505657541, -21.799306433880908], 'name': 'Macrorregião III'}",1
1996,"{'latlong': [-43.93088259914695, -22.50640773396086], 'name': 'Metropolitana I'}","{'latlong': [-42.78374566691811, -22.435006717319105], 'name': 'Macrorregião II'}",82
1996,"{'latlong': [-43.93088259914695, -22.50640773396086], 'name': 'Metropolitana I'}","{'latlong': [-43.93088259914695, -22.50640773396086], 'name': 'Metropolitana I'}",5002
1997,"{'latlong': [-41.74084505657541, -21.799306433880908], 'name': 'Macrorregião III'}","{'latlong': [-41.74084505657541, -21.799306433880908], 'name': 'Macrorregião III'}",5094
1997,"{'latlong': [-41.74084505657541, -21.799306433880908], 'name': 'Macrorregião III'}","{'latlong': [-42.78374566691811, -22.435006717319105], 'name': 'Macrorregião II'}",74
1997,"{'latlong': [-41.74084505657541, -21.799306433880908], 'name': 'Macrorregião III'}","{'latlong': [-43.93088259914695, -22.50640773396086], 'name': 'Metropolitana I'}",1
1997,"{'latlong': [-42.78374566691811, -22.435006717319105], 'name': 'Macrorregião II'}","{'latlong': [-41.74084505657541, -21.799306433880908], 'name': 'Macrorregião III'}",46
1997,"{'latlong': [-42.78374566691811, -22.435006717319105], 'name': 'Macrorregião II'}","{'latlong': [-42.78374566691811, -22.435006717319105], 'name': 'Macrorregião II'}",34094
1997,"{'latlong': [-42.78374566691811, -22.435006717319105], 'name': 'Macrorregião II'}","{'latlong': [-43.93088259914695, -22.50640773396086], 'name': 'Metropolitana I'}",237
1997,"{'latlong': [-43.93088259914695, -22.50640773396086], 'name': 'Metropolitana I'}","{'latlong': [-41.74084505657541, -21.799306433880908], 'name': 'Macrorregião III'}",3
1997,"{'latlong': [-43.93088259914695, -22.50640773396086], 'name': 'Metropolitana I'}","{'latlong': [-42.78374566691811, -22.435006717319105], 'name': 'Macrorregião II'}",83
1997,"{'latlong': [-43.93088259914695, -22.50640773396086], 'name': 'Metropolitana I'}","{'latlong': [-43.93088259914695, -22.50640773396086], 'name': 'Metropolitana I'}",4496
1998,"{'latlong': [-41.74084505657541, -21.799306433880908], 'name': 'Macrorregião III'}","{'latlong': [-41.74084505657541, -21.799306433880908], 'name': 'Macrorregião III'}",447
1998,"{'latlong': [-41.74084505657541, -21.799306433880908], 'name': 'Macrorregião III'}","{'latlong': [-42.78374566691811, -22.435006717319105], 'name': 'Macrorregião II'}",33
1998,"{'latlong': [-42.78374566691811, -22.435006717319105], 'name': 'Macrorregião II'}","{'latlong': [-41.74084505657541, -21.799306433880908], 'name': 'Macrorregião III'}",7
1998,"{'latlong': [-42.78374566691811, -22.435006717319105], 'name': 'Macrorregião II'}","{'latlong': [-42.78374566691811, -22.435006717319105], 'name': 'Macrorregião II'}",10473
1998,"{'latlong': [-42.78374566691811, -22.435006717319105], 'name': 'Macrorregião II'}","{'latlong': [-43.93088259914695, -22.50640773396086], 'name': 'Metropolitana I'}",28
1998,"{'latlong': [-43.93088259914695, -22.50640773396086], 'name': 'Metropolitana I'}","{'latlong': [-42.78374566691811, -22.435006717319105], 'name': 'Macrorregião II'}",51
1998,"{'latlong': [-43.93088259914695, -22.50640773396086], 'name': 'Metropolitana I'}","{'latlong': [-43.93088259914695, -22.50640773396086], 'name': 'Metropolitana I'}",405
1999,"{'latlong': [-41.74084505657541, -21.799306433880908], 'name': 'Macrorregião III'}","{'latlong': [-41.74084505657541, -21.799306433880908], 'name': 'Macrorregião III'}",573
1999,"{'latlong': [-41.74084505657541, -21.799306433880908], 'name': 'Macrorregião III'}","{'latlong': [-42.78374566691811, -22.435006717319105], 'name': 'Macrorregião II'}",58
1999,"{'latlong': [-42.78374566691811, -22.435006717319105], 'name': 'Macrorregião II'}","{'latlong': [-41.74084505657541, -21.799306433880908], 'name': 'Macrorregião III'}",7
1999,"{'latlong': [-42.78374566691811, -22.435006717319105], 'name': 'Macrorregião II'}","{'latlong': [-42.78374566691811, -22.435006717319105], 'name': 'Macrorregião II'}",10775
1999,"{'latlong': [-42.78374566691811, -22.435006717319105], 'name': 'Macrorregião II'}","{'latlong': [-43.93088259914695, -22.50640773396086], 'name': 'Metropolitana I'}",30
1999,"{'latlong': [-43.93088259914695, -22.50640773396086], 'name': 'Metropolitana I'}","{'latlong': [-41.74084505657541, -21.799306433880908], 'name': 'Macrorregião III'}",1
1999,"{'latlong': [-43.93088259914695, -22.50640773396086], 'name': 'Metropolitana I'}","{'latlong': [-42.78374566691811, -22.435006717319105], 'name': 'Macrorregião II'}",51
1999,"{'latlong': [-43.93088259914695, -22.50640773396086], 'name': 'Metropolitana I'}","{'latlong': [-43.93088259914695, -22.50640773396086], 'name': 'Metropolitana I'}",452
2000,"{'latlong': [-41.74084505657541, -21.799306433880908], 'name': 'Macrorregião III'}","{'latlong': [-41.74084505657541, -21.799306433880908], 'name': 'Macrorregião III'}",596
2000,"{'latlong': [-41.74084505657541, -21.799306433880908], 'name': 'Macrorregião III'}","{'latlong': [-42.78374566691811, -22.435006717319105], 'name': 'Macrorregião II'}",42
2000,"{'latlong': [-42.78374566691811, -22.435006717319105], 'name': 'Macrorregião II'}","{'latlong': [-41.74084505657541, -21.799306433880908], 'name': 'Macrorregião III'}",6
2000,"{'latlong': [-42.78374566691811, -22.435006717319105], 'name': 'Macrorregião II'}","{'latlong': [-42.78374566691811, -22.435006717319105], 'name': 'Macrorregião II'}",10265
2000,"{'latlong': [-42.78374566691811, -22.435006717319105], 'name': 'Macrorregião II'}","{'latlong': [-43.93088259914695, -22.50640773396086], 'name': 'Metropolitana I'}",23
2000,"{'latlong': [-43.93088259914695, -22.50640773396086], 'name': 'Metropolitana I'}","{'latlong': [-41.74084505657541, -21.799306433880908], 'name': 'Macrorregião III'}",1
2000,"{'latlong': [-43.93088259914695, -22.50640773396086], 'name': 'Metropolitana I'}","{'latlong': [-42.78374566691811, -22.435006717319105], 'name': 'Macrorregião II'}",71
2000,"{'latlong': [-43.93088259914695, -22.50640773396086], 'name': 'Metropolitana I'}","{'latlong': [-43.93088259914695, -22.50640773396086], 'name': 'Metropolitana I'}",475
2001,"{'latlong': [-41.74084505657541, -21.799306433880908], 'name': 'Macrorregião III'}","{'latlong': [-41.74084505657541, -21.799306433880908], 'name': 'Macrorregião III'}",604
2001,"{'latlong': [-41.74084505657541, -21.799306433880908], 'name': 'Macrorregião III'}","{'latlong': [-42.78374566691811, -22.435006717319105], 'name': 'Macrorregião II'}",28
2001,"{'latlong': [-42.78374566691811, -22.435006717319105], 'name': 'Macrorregião II'}","{'latlong': [-41.74084505657541, -21.799306433880908], 'name': 'Macrorregião III'}",2
2001,"{'latlong': [-42.78374566691811, -22.435006717319105], 'name': 'Macrorregião II'}","{'latlong': [-42.78374566691811, -22.435006717319105], 'name': 'Macrorregião II'}",10298
2001,"{'latlong': [-42.78374566691811, -22.435006717319105], 'name': 'Macrorregião II'}","{'latlong': [-43.93088259914695, -22.50640773396086], 'name': 'Metropolitana I'}",38
2001,"{'latlong': [-43.93088259914695, -22.50640773396086], 'name': 'Metropolitana I'}","{'latlong': [-42.78374566691811, -22.435006717319105], 'name': 'Macrorregião II'}",60
2001,"{'latlong': [-43.93088259914695, -22.50640773396086], 'name': 'Metropolitana I'}","{'latlong': [-43.93088259914695, -22.50640773396086], 'name': 'Metropolitana I'}",475
2002,"{'latlong': [-41.74084505657541, -21.799306433880908], 'name': 'Macrorregião III'}","{'latlong': [-41.74084505657541, -21.799306433880908], 'name': 'Macrorregião III'}",1439
2002,"{'latlong': [-41.74084505657541, -21.799306433880908], 'name': 'Macrorregião III'}","{'latlong': [-42.78374566691811, -22.435006717319105], 'name': 'Macrorregião II'}",37
2002,"{'latlong': [-42.78374566691811, -22.435006717319105], 'name': 'Macrorregião II'}","{'latlong': [-41.74084505657541, -21.799306433880908], 'name': 'Macrorregião III'}",5
2002,"{'latlong': [-42.78374566691811, -22.435006717319105], 'name': 'Macrorregião II'}","{'latlong': [-42.78374566691811, -22.435006717319105], 'name': 'Macrorregião II'}",11055
2002,"{'latlong': [-42.78374566691811, -22.435006717319105], 'name': 'Macrorregião II'}","{'latlong': [-43.93088259914695, -22.50640773396086], 'name': 'Metropolitana I'}",71
2002,"{'latlong': [-43.93088259914695, -22.50640773396086], 'name': 'Metropolitana I'}","{'latlong': [-41.74084505657541, -21.799306433880908], 'name': 'Macrorregião III'}",1
2002,"{'latlong': [-43.93088259914695, -22.50640773396086], 'name': 'Metropolitana I'}","{'latlong': [-42.78374566691811, -22.435006717319105], 'name': 'Macrorregião II'}",87
2002,"{'latlong': [-43.93088259914695, -22.50640773396086], 'name': 'Metropolitana I'}","{'latlong': [-43.93088259914695, -22.50640773396086], 'name': 'Metropolitana I'}",977
2003,"{'latlong': [-41.74084505657541, -21.799306433880908], 'name': 'Macrorregião III'}","{'latlong': [-41.74084505657541, -21.799306433880908], 'name': 'Macrorregião III'}",1374
2003,"{'latlong': [-41.74084505657541, -21.799306433880908], 'name': 'Macrorregião III'}","{'latlong': [-42.78374566691811, -22.435006717319105], 'name': 'Macrorregião II'}",39
2003,"{'latlong': [-42.78374566691811, -22.435006717319105], 'name': 'Macrorregião II'}","{'latlong': [-41.74084505657541, -21.799306433880908], 'name': 'Macrorregião III'}",8
2003,"{'latlong': [-42.78374566691811, -22.435006717319105], 'name': 'Macrorregião II'}","{'latlong': [-42.78374566691811, -22.435006717319105], 'name': 'Macrorregião II'}",10589
2003,"{'latlong': [-42.78374566691811, -22.435006717319105], 'name': 'Macrorregião II'}","{'latlong': [-43.93088259914695, -22.50640773396086], 'name': 'Metropolitana I'}",37
2003,"{'latlong': [-43.93088259914695, -22.50640773396086], 'name': 'Metropolitana I'}","{'latlong': [-42.78374566691811, -22.435006717319105], 'name': 'Macrorregião II'}",67
2003,"{'latlong': [-43.93088259914695, -22.50640773396086], 'name': 'Metropolitana I'}","{'latlong': [-43.93088259914695, -22.50640773396086], 'name': 'Metropolitana I'}",836
2004,"{'latlong': [-41.74084505657541, -21.799306433880908], 'name': 'Macrorregião III'}","{'latlong': [-41.74084505657541, -21.799306433880908], 'name': 'Macrorregião III'}",1191
2004,"{'latlong': [-41.74084505657541, -21.799306433880908], 'name': 'Macrorregião III'}","{'latlong': [-42.78374566691811, -22.435006717319105], 'name': 'Macrorregião II'}",52
2004,"{'latlong': [-42.78374566691811, -22.435006717319105], 'name': 'Macrorregião II'}","{'latlong': [-41.74084505657541, -21.799306433880908], 'name': 'Macrorregião III'}",1
2004,"{'latlong': [-42.78374566691811, -22.435006717319105], 'name': 'Macrorregião II'}","{'latlong': [-42.78374566691811, -22.435006717319105], 'name': 'Macrorregião II'}",11450
2004,"{'latlong': [-42.78374566691811, -22.435006717319105], 'name': 'Macrorregião II'}","{'latlong': [-43.93088259914695, -22.50640773396086], 'name': 'Metropolitana I'}",32
2004,"{'latlong': [-43.93088259914695, -22.50640773396086], 'name': 'Metropolitana I'}","{'latlong': [-42.78374566691811, -22.435006717319105], 'name': 'Macrorregião II'}",57
2004,"{'latlong': [-43.93088259914695, -22.50640773396086], 'name': 'Metropolitana I'}","{'latlong': [-43.93088259914695, -22.50640773396086], 'name': 'Metropolitana I'}",766
2005,"{'latlong': [-41.74084505657541, -21.799306433880908], 'name': 'Macrorregião III'}","{'latlong': [-41.74084505657541, -21.799306433880908], 'name': 'Macrorregião III'}",1038
2005,"{'latlong': [-41.74084505657541, -21.799306433880908], 'name': 'Macrorregião III'}","{'latlong': [-42.78374566691811, -22.435006717319105], 'name': 'Macrorregião II'}",29
2005,"{'latlong': [-42.78374566691811, -22.435006717319105], 'name': 'Macrorregião II'}","{'latlong': [-41.74084505657541, -21.799306433880908], 'name': 'Macrorregião III'}",2
2005,"{'latlong': [-42.78374566691811, -22.435006717319105], 'name': 'Macrorregião II'}","{'latlong': [-42.78374566691811, -22.435006717319105], 'name': 'Macrorregião II'}",10677
2005,"{'latlong': [-42.78374566691811, -22.435006717319105], 'name': 'Macrorregião II'}","{'latlong': [-43.93088259914695, -22.50640773396086], 'name': 'Metropolitana I'}",43
2005,"{'latlong': [-43.93088259914695, -22.50640773396086], 'name': 'Metropolitana I'}","{'latlong': [-42.78374566691811, -22.435006717319105], 'name': 'Macrorregião II'}",52
2005,"{'latlong': [-43.93088259914695, -22.50640773396086], 'name': 'Metropolitana I'}","{'latlong': [-43.93088259914695, -22.50640773396086], 'name': 'Metropolitana I'}",831
2006,"{'latlong': [-41.74084505657541, -21.799306433880908], 'name': 'Macrorregião III'}","{'latlong': [-41.74084505657541, -21.799306433880908], 'name': 'Macrorregião III'}",1141
2006,"{'latlong': [-41.74084505657541, -21.799306433880908], 'name': 'Macrorregião III'}","{'latlong': [-42.78374566691811, -22.435006717319105], 'name': 'Macrorregião II'}",34
2006,"{'latlong': [-42.78374566691811, -22.435006717319105], 'name': 'Macrorregião II'}","{'latlong': [-41.74084505657541, -21.799306433880908], 'name': 'Macrorregião III'}",4
2006,"{'latlong': [-42.78374566691811, -22.435006717319105], 'name': 'Macrorregião II'}","{'latlong': [-42.78374566691811, -22.435006717319105], 'name': 'Macrorregião II'}",9938
2006,"{'latlong': [-42.78374566691811, -22.435006717319105], 'name': 'Macrorregião II'}","{'latlong': [-43.93088259914695, -22.50640773396086], 'name': 'Metropolitana I'}",49
2006,"{'latlong': [-43.93088259914695, -22.50640773396086], 'name': 'Metropolitana I'}","{'latlong': [-42.78374566691811, -22.435006717319105], 'name': 'Macrorregião II'}",49
2006,"{'latlong': [-43.93088259914695, -22.50640773396086], 'name': 'Metropolitana I'}","{'latlong': [-43.93088259914695, -22.50640773396086], 'name': 'Metropolitana I'}",782
2007,"{'latlong': [-41.74084505657541, -21.799306433880908], 'name': 'Macrorregião III'}","{'latlong': [-41.74084505657541, -21.799306433880908], 'name': 'Macrorregião III'}",1264
2007,"{'latlong': [-41.74084505657541, -21.799306433880908], 'name': 'Macrorregião III'}","{'latlong': [-42.78374566691811, -22.435006717319105], 'name': 'Macrorregião II'}",26
2007,"{'latlong': [-42.78374566691811, -22.435006717319105], 'name': 'Macrorregião II'}","{'latlong': [-41.74084505657541, -21.799306433880908], 'name': 'Macrorregião III'}",4
2007,"{'latlong': [-42.78374566691811, -22.435006717319105], 'name': 'Macrorregião II'}","{'latlong': [-42.78374566691811, -22.435006717319105], 'name': 'Macrorregião II'}",10434
2007,"{'latlong': [-42.78374566691811, -22.435006717319105], 'name': 'Macrorregião II'}","{'latlong': [-43.93088259914695, -22.50640773396086], 'name': 'Metropolitana I'}",115
2007,"{'latlong': [-43.93088259914695, -22.50640773396086], 'name': 'Metropolitana I'}","{'latlong': [-42.78374566691811, -22.435006717319105], 'name': 'Macrorregião II'}",38
2007,"{'latlong': [-43.93088259914695, -22.50640773396086], 'name': 'Metropolitana I'}","{'latlong': [-43.93088259914695, -22.50640773396086], 'name': 'Metropolitana I'}",760
2008,"{'latlong': [-41.74084505657541, -21.799306433880908], 'name': 'Macrorregião III'}","{'latlong': [-41.74084505657541, -21.799306433880908], 'name': 'Macrorregião III'}",1786
2008,"{'latlong': [-41.74084505657541, -21.799306433880908], 'name': 'Macrorregião III'}","{'latlong': [-42.78374566691811, -22.435006717319105], 'name': 'Macrorregião II'}",35
2008,"{'latlong': [-42.78374566691811, -22.435006717319105], 'name': 'Macrorregião II'}","{'latlong': [-41.74084505657541, -21.799306433880908], 'name': 'Macrorregião III'}",3
2008,"{'latlong': [-42.78374566691811, -22.435006717319105], 'name': 'Macrorregião II'}","{'latlong': [-42.78374566691811, -22.435006717319105], 'name': 'Macrorregião II'}",9819
2008,"{'latlong': [-42.78374566691811, -22.435006717319105], 'name': 'Macrorregião II'}","{'latlong': [-43.93088259914695, -22.50640773396086], 'name': 'Metropolitana I'}",26
2008,"{'latlong': [-43.93088259914695, -22.50640773396086], 'name': 'Metropolitana I'}","{'latlong': [-42.78374566691811, -22.435006717319105], 'name': 'Macrorregião II'}",44
2008,"{'latlong': [-43.93088259914695, -22.50640773396086], 'name': 'Metropolitana I'}","{'latlong': [-43.93088259914695, -22.50640773396086], 'name': 'Metropolitana I'}",596
2009,"{'latlong': [-41.74084505657541, -21.799306433880908], 'name': 'Macrorregião III'}","{'latlong': [-41.74084505657541, -21.799306433880908], 'name': 'Macrorregião III'}",1753
2009,"{'latlong': [-41.74084505657541, -21.799306433880908], 'name': 'Macrorregião III'}","{'latlong': [-42.78374566691811, -22.435006717319105], 'name': 'Macrorregião II'}",41
2009,"{'latlong': [-41.74084505657541, -21.799306433880908], 'name': 'Macrorregião III'}","{'latlong': [-43.93088259914695, -22.50640773396086], 'name': 'Metropolitana I'}",1
2009,"{'latlong': [-42.78374566691811, -22.435006717319105], 'name': 'Macrorregião II'}","{'latlong': [-41.74084505657541, -21.799306433880908], 'name': 'Macrorregião III'}",3
2009,"{'latlong': [-42.78374566691811, -22.435006717319105], 'name': 'Macrorregião II'}","{'latlong': [-42.78374566691811, -22.435006717319105], 'name': 'Macrorregião II'}",10745
2009,"{'latlong': [-42.78374566691811, -22.435006717319105], 'name': 'Macrorregião II'}","{'latlong': [-43.93088259914695, -22.50640773396086], 'name': 'Metropolitana I'}",14
2009,"{'latlong': [-43.93088259914695, -22.50640773396086], 'name': 'Metropolitana I'}","{'latlong': [-42.78374566691811, -22.435006717319105], 'name': 'Macrorregião II'}",35
2009,"{'latlong': [-43.93088259914695, -22.50640773396086], 'name': 'Metropolitana I'}","{'latlong': [-43.93088259914695, -22.50640773396086], 'name': 'Metropolitana I'}",452
2010,"{'latlong': [-41.74084505657541, -21.799306433880908], 'name': 'Macrorregião III'}","{'latlong': [-41.74084505657541, -21.799306433880908], 'name': 'Macrorregião III'}",1416
2010,"{'latlong': [-41.74084505657541, -21.799306433880908], 'name': 'Macrorregião III'}","{'latlong': [-42.78374566691811, -22.435006717319105], 'name': 'Macrorregião II'}",43
2010,"{'latlong': [-41.74084505657541, -21.799306433880908], 'name': 'Macrorregião III'}","{'latlong': [-43.93088259914695, -22.50640773396086], 'name': 'Metropolitana I'}",1
2010,"{'latlong': [-42.78374566691811, -22.435006717319105], 'name': 'Macrorregião II'}","{'latlong': [-41.74084505657541, -21.799306433880908], 'name': 'Macrorregião III'}",3
2010,"{'latlong': [-42.78374566691811, -22.435006717319105], 'name': 'Macrorregião II'}","{'latlong': [-42.78374566691811, -22.435006717319105], 'name': 'Macrorregião II'}",9754
2010,"{'latlong': [-42.78374566691811, -22.435006717319105], 'name': 'Macrorregião II'}","{'latlong': [-43.93088259914695, -22.50640773396086], 'name': 'Metropolitana I'}",10
2010,"{'latlong': [-43.93088259914695, -22.50640773396086], 'name': 'Metropolitana I'}","{'latlong': [-42.78374566691811, -22.435006717319105], 'name': 'Macrorregião II'}",24
2010,"{'latlong': [-43.93088259914695, -22.50640773396086], 'name': 'Metropolitana I'}","{'latlong': [-43.93088259914695, -22.50640773396086], 'name': 'Metropolitana I'}",538
2011,"{'latlong': [-41.74084505657541, -21.799306433880908], 'name': 'Macrorregião III'}","{'latlong': [-41.74084505657541, -21.799306433880908], 'name': 'Macrorregião III'}",1176
2011,"{'latlong': [-41.74084505657541, -21.799306433880908], 'name': 'Macrorregião III'}","{'latlong': [-42.78374566691811, -22.435006717319105], 'name': 'Macrorregião II'}",32
2011,"{'latlong': [-42.78374566691811, -22.435006717319105], 'name': 'Macrorregião II'}","{'latlong': [-41.74084505657541, -21.799306433880908], 'name': 'Macrorregião III'}",3
2011,"{'latlong': [-42.78374566691811, -22.435006717319105], 'name': 'Macrorregião II'}","{'latlong': [-42.78374566691811, -22.435006717319105], 'name': 'Macrorregião II'}",7165
2011,"{'latlong': [-42.78374566691811, -22.435006717319105], 'name': 'Macrorregião II'}","{'latlong': [-43.93088259914695, -22.50640773396086], 'name': 'Metropolitana I'}",3
2011,"{'latlong': [-43.93088259914695, -22.50640773396086], 'name': 'Metropolitana I'}","{'latlong': [-42.78374566691811, -22.435006717319105], 'name': 'Macrorregião II'}",43
2011,"{'latlong': [-43.93088259914695, -22.50640773396086], 'name': 'Metropolitana I'}","{'latlong': [-43.93088259914695, -22.50640773396086], 'name': 'Metropolitana I'}",498
2012,"{'latlong': [-41.74084505657541, -21.799306433880908], 'name': 'Macrorregião III'}","{'latlong': [-41.74084505657541, -21.799306433880908], 'name': 'Macrorregião III'}",1257
2012,"{'latlong': [-41.74084505657541, -21.799306433880908], 'name': 'Macrorregião III'}","{'latlong': [-42.78374566691811, -22.435006717319105], 'name': 'Macrorregião II'}",37
2012,"{'latlong': [-42.78374566691811, -22.435006717319105], 'name': 'Macrorregião II'}","{'latlong': [-41.74084505657541, -21.799306433880908], 'name': 'Macrorregião III'}",4
2012,"{'latlong': [-42.78374566691811, -22.435006717319105], 'name': 'Macrorregião II'}","{'latlong': [-42.78374566691811, -22.435006717319105], 'name': 'Macrorregião II'}",5916
2012,"{'latlong': [-42.78374566691811, -22.435006717319105], 'name': 'Macrorregião II'}","{'latlong': [-43.93088259914695, -22.50640773396086], 'name': 'Metropolitana I'}",3
2012,"{'latlong': [-43.93088259914695, -22.50640773396086], 'name': 'Metropolitana I'}","{'latlong': [-42.78374566691811, -22.435006717319105], 'name': 'Macrorregião II'}",34
2012,"{'latlong': [-43.93088259914695, -22.50640773396086], 'name': 'Metropolitana I'}","{'latlong': [-43.93088259914695, -22.50640773396086], 'name': 'Metropolitana I'}",506
2013,"{'latlong': [-41.74084505657541, -21.799306433880908], 'name': 'Macrorregião III'}","{'latlong': [-41.74084505657541, -21.799306433880908], 'name': 'Macrorregião III'}",970
2013,"{'latlong': [-41.74084505657541, -21.799306433880908], 'name': 'Macrorregião III'}","{'latlong': [-42.78374566691811, -22.435006717319105], 'name': 'Macrorregião II'}",37
2013,"{'latlong': [-42.78374566691811, -22.435006717319105], 'name': 'Macrorregião II'}","{'latlong': [-41.74084505657541, -21.799306433880908], 'name': 'Macrorregião III'}",2
2013,"{'latlong': [-42.78374566691811, -22.435006717319105], 'name': 'Macrorregião II'}","{'latlong': [-42.78374566691811, -22.435006717319105], 'name': 'Macrorregião II'}",5468
2013,"{'latlong': [-42.78374566691811, -22.435006717319105], 'name': 'Macrorregião II'}","{'latlong': [-43.93088259914695, -22.50640773396086], 'name': 'Metropolitana I'}",17
2013,"{'latlong': [-43.93088259914695, -22.50640773396086], 'name': 'Metropolitana I'}","{'latlong': [-42.78374566691811, -22.435006717319105], 'name': 'Macrorregião II'}",26
2013,"{'latlong': [-43.93088259914695, -22.50640773396086], 'name': 'Metropolitana I'}","{'latlong': [-43.93088259914695, -22.50640773396086], 'name': 'Metropolitana I'}",286
2014,"{'latlong': [-41.74084505657541, -21.799306433880908], 'name': 'Macrorregião III'}","{'latlong': [-41.74084505657541, -21.799306433880908], 'name': 'Macrorregião III'}",799
2014,"{'latlong': [-41.74084505657541, -21.799306433880908], 'name': 'Macrorregião III'}","{'latlong': [-42.78374566691811, -22.435006717319105], 'name': 'Macrorregião II'}",28
2014,"{'latlong': [-42.78374566691811, -22.435006717319105], 'name': 'Macrorregião II'}","{'latlong': [-41.74084505657541, -21.799306433880908], 'name': 'Macrorregião III'}",2
2014,"{'latlong': [-42.78374566691811, -22.435006717319105], 'name': 'Macrorregião II'}","{'latlong': [-42.78374566691811, -22.435006717319105], 'name': 'Macrorregião II'}",5109
2014,"{'latlong': [-42.78374566691811, -22.435006717319105], 'name': 'Macrorregião II'}","{'latlong': [-43.93088259914695, -22.50640773396086], 'name': 'Metropolitana I'}",8
2014,"{'latlong': [-43.93088259914695, -22.50640773396086], 'name': 'Metropolitana I'}","{'latlong': [-42.78374566691811, -22.435006717319105], 'name': 'Macrorregião II'}",32
2014,"{'latlong': [-43.93088259914695, -22.50640773396086], 'name': 'Metropolitana I'}","{'latlong': [-43.93088259914695, -22.50640773396086], 'name': 'Metropolitana I'}",289
2015,"{'latlong': [-41.74084505657541, -21.799306433880908], 'name': 'Macrorregião III'}","{'latlong': [-41.74084505657541, -21.799306433880908], 'name': 'Macrorregião III'}",905
2015,"{'latlong': [-41.74084505657541, -21.799306433880908], 'name': 'Macrorregião III'}","{'latlong': [-42.78374566691811, -22.435006717319105], 'name': 'Macrorregião II'}",37
2015,"{'latlong': [-42.78374566691811, -22.435006717319105], 'name': 'Macrorregião II'}","{'latlong': [-41.74084505657541, -21.799306433880908], 'name': 'Macrorregião III'}",6
2015,"{'latlong': [-42.78374566691811, -22.435006717319105], 'name': 'Macrorregião II'}","{'latlong': [-42.78374566691811, -22.435006717319105], 'name': 'Macrorregião II'}",4420
2015,"{'latlong': [-42.78374566691811, -22.435006717319105], 'name': 'Macrorregião II'}","{'latlong': [-43.93088259914695, -22.50640773396086], 'name': 'Metropolitana I'}",7
2015,"{'latlong': [-43.93088259914695, -22.50640773396086], 'name': 'Metropolitana I'}","{'latlong': [-42.78374566691811, -22.435006717319105], 'name': 'Macrorregião II'}",37
2015,"{'latlong': [-43.93088259914695, -22.50640773396086], 'name': 'Metropolitana I'}","{'latlong': [-43.93088259914695, -22.50640773396086], 'name': 'Metropolitana I'}",603
2016,"{'latlong': [-41.74084505657541, -21.799306433880908], 'name': 'Macrorregião III'}","{'latlong': [-41.74084505657541, -21.799306433880908], 'name': 'Macrorregião III'}",825
2016,"{'latlong': [-41.74084505657541, -21.799306433880908], 'name': 'Macrorregião III'}","{'latlong': [-42.78374566691811, -22.435006717319105], 'name': 'Macrorregião II'}",26
2016,"{'latlong': [-42.78374566691811, -22.435006717319105], 'name': 'Macrorregião II'}","{'latlong': [-41.74084505657541, -21.799306433880908], 'name': 'Macrorregião III'}",4
2016,"{'latlong': [-42.78374566691811, -22.435006717319105], 'name': 'Macrorregião II'}","{'latlong': [-42.78374566691811, -22.435006717319105], 'name': 'Macrorregião II'}",4011
2016,"{'latlong': [-42.78374566691811, -22.435006717319105], 'name': 'Macrorregião II'}","{'latlong': [-43.93088259914695, -22.50640773396086], 'name': 'Metropolitana I'}",10
2016,"{'latlong': [-43.93088259914695, -22.50640773396086], 'name': 'Metropolitana I'}","{'latlong': [-42.78374566691811, -22.435006717319105], 'name': 'Macrorregião II'}",36
2016,"{'latlong': [-43.93088259914695, -22.50640773396086], 'name': 'Metropolitana I'}","{'latlong': [-43.93088259914695, -22.50640773396086], 'name': 'Metropolitana I'}",629
2017,"{'latlong': [-41.74084505657541, -21.799306433880908], 'name': 'Macrorregião III'}","{'latlong': [-41.74084505657541, -21.799306433880908], 'name': 'Macrorregião III'}",774
2017,"{'latlong': [-41.74084505657541, -21.799306433880908], 'name': 'Macrorregião III'}","{'latlong': [-42.78374566691811, -22.435006717319105], 'name': 'Macrorregião II'}",32
2017,"{'latlong': [-42.78374566691811, -22.435006717319105], 'name': 'Macrorregião II'}","{'latlong': [-41.74084505657541, -21.799306433880908], 'name': 'Macrorregião III'}",3
2017,"{'latlong': [-42.78374566691811, -22.435006717319105], 'name': 'Macrorregião II'}","{'latlong': [-42.78374566691811, -22.435006717319105], 'name': 'Macrorregião II'}",3857
2017,"{'latlong': [-42.78374566691811, -22.435006717319105], 'name': 'Macrorregião II'}","{'latlong': [-43.93088259914695, -22.50640773396086], 'name': 'Metropolitana I'}",20
2017,"{'latlong': [-43.93088259914695, -22.50640773396086], 'name': 'Metropolitana I'}","{'latlong': [-42.78374566691811, -22.435006717319105], 'name': 'Macrorregião II'}",13
2017,"{'latlong': [-43.93088259914695, -22.50640773396086], 'name': 'Metropolitana I'}","{'latlong': [-43.93088259914695, -22.50640773396086], 'name': 'Metropolitana I'}",641
2018,"{'latlong': [-41.74084505657541, -21.799306433880908], 'name': 'Macrorregião III'}","{'latlong': [-41.74084505657541, -21.799306433880908], 'name': 'Macrorregião III'}",852
2018,"{'latlong': [-41.74084505657541, -21.799306433880908], 'name': 'Macrorregião III'}","{'latlong': [-42.78374566691811, -22.435006717319105], 'name': 'Macrorregião II'}",44
2018,"{'latlong': [-41.74084505657541, -21.799306433880908], 'name': 'Macrorregião III'}","{'latlong': [-43.93088259914695, -22.50640773396086], 'name': 'Metropolitana I'}",1
2018,"{'latlong': [-42.78374566691811, -22.435006717319105], 'name': 'Macrorregião II'}","{'latlong': [-41.74084505657541, -21.799306433880908], 'name': 'Macrorregião III'}",4
2018,"{'latlong': [-42.78374566691811, -22.435006717319105], 'name': 'Macrorregião II'}","{'latlong': [-42.78374566691811, -22.435006717319105], 'name': 'Macrorregião II'}",4001
2018,"{'latlong': [-42.78374566691811, -22.435006717319105], 'name': 'Macrorregião II'}","{'latlong': [-43.93088259914695, -22.50640773396086], 'name': 'Metropolitana I'}",31
2018,"{'latlong': [-43.93088259914695, -22.50640773396086], 'name': 'Metropolitana I'}","{'latlong': [-42.78374566691811, -22.435006717319105], 'name': 'Macrorregião II'}",19
2018,"{'latlong': [-43.93088259914695, -22.50640773396086], 'name': 'Metropolitana I'}","{'latlong': [-43.93088259914695, -22.50640773396086], 'name': 'Metropolitana I'}",662
2019,"{'latlong': [-41.74084505657541, -21.799306433880908], 'name': 'Macrorregião III'}","{'latlong': [-41.74084505657541, -21.799306433880908], 'name': 'Macrorregião III'}",679
2019,"{'latlong': [-41.74084505657541, -21.799306433880908], 'name': 'Macrorregião III'}","{'latlong': [-42.78374566691811, -22.435006717319105], 'name': 'Macrorregião II'}",35
2019,"{'latlong': [-42.78374566691811, -22.435006717319105], 'name': 'Macrorregião II'}","{'latlong': [-41.74084505657541, -21.799306433880908], 'name': 'Macrorregião III'}",6
2019,"{'latlong': [-42.78374566691811, -22.435006717319105], 'name': 'Macrorregião II'}","{'latlong': [-42.78374566691811, -22.435006717319105], 'name': 'Macrorregião II'}",3672
2019,"{'latlong': [-42.78374566691811, -22.435006717319105], 'name': 'Macrorregião II'}","{'latlong': [-43.93088259914695, -22.50640773396086], 'name': 'Metropolitana I'}",27
2019,"{'latlong': [-43.93088259914695, -22.50640773396086], 'name': 'Metropolitana I'}","{'latlong': [-42.78374566691811, -22.435006717319105], 'name': 'Macrorregião II'}",24
2019,"{'latlong': [-43.93088259914695, -22.50640773396086], 'name': 'Metropolitana I'}","{'latlong': [-43.93088259914695, -22.50640773396086], 'name': 'Metropolitana I'}",595
2020,"{'latlong': [-41.74084505657541, -21.799306433880908], 'name': 'Macrorregião III'}","{'latlong': [-41.74084505657541, -21.799306433880908], 'name': 'Macrorregião III'}",570
2020,"{'latlong': [-41.74084505657541, -21.799306433880908], 'name': 'Macrorregião III'}","{'latlong': [-42.78374566691811, -22.435006717319105], 'name': 'Macrorregião II'}",17
2020,"{'latlong': [-41.74084505657541, -21.799306433880908], 'name': 'Macrorregião III'}","{'latlong': [-43.93088259914695, -22.50640773396086], 'name': 'Metropolitana I'}",15
2020,"{'latlong': [-42.78374566691811, -22.435006717319105], 'name': 'Macrorregião II'}","{'latlong': [-41.74084505657541, -21.799306433880908], 'name': 'Macrorregião III'}",16
2020,"{'latlong': [-42.78374566691811, -22.435006717319105], 'name': 'Macrorregião II'}","{'latlong': [-42.78374566691811, -22.435006717319105], 'name': 'Macrorregião II'}",6035
2020,"{'latlong': [-42.78374566691811, -22.435006717319105], 'name': 'Macrorregião II'}","{'latlong': [-43.93088259914695, -22.50640773396086], 'name': 'Metropolitana I'}",374
2020,"{'latlong': [-43.93088259914695, -22.50640773396086], 'name': 'Metropolitana I'}","{'latlong': [-42.78374566691811, -22.435006717319105], 'name': 'Macrorregião II'}",13
2020,"{'latlong': [-43.93088259914695, -22.50640773396086], 'name': 'Metropolitana I'}","{'latlong': [-43.93088259914695, -22.50640773396086], 'name': 'Metropolitana I'}",643
