year,all
1994,37.18631349554043
1995,29.786354698163986
1996,32.76113858215265
1997,13.512694202349373
1998,9.149159150516672
1999,7.958692654970127
2000,5.731717871051493
2001,24.05620111961417
2002,21.67297922247864
2003,29.151762320293457
2004,6.162231878272352
2005,25.57663629956728
2006,28.173672331474908
2007,33.796187127673456
2008,37.010367709250716
2009,44.54524638064431
2010,35.76904798683429
2011,6.5450089520631085
2012,58.73340096408026
2013,54.44063272551723
2014,43.365316403799206
2015,41.807591360532946
2016,43.79015670652166
2017,45.359292472318266
2018,45.879305481658655
2019,54.56030616246414
2020,46.89643786780998
