year,from,to,hospitalizations
1998,"{'latlong': [-35.45993547543438, -8.237977282077168], 'name': 'Metropolitana'}","{'latlong': [-35.45993547543438, -8.237977282077168], 'name': 'Metropolitana'}",4646
1998,"{'latlong': [-35.45993547543438, -8.237977282077168], 'name': 'Metropolitana'}","{'latlong': [-36.44705331304556, -8.597091004271139], 'name': 'Agreste'}",4
1998,"{'latlong': [-35.45993547543438, -8.237977282077168], 'name': 'Metropolitana'}","{'latlong': [-39.95936095628068, -8.364764974735124], 'name': 'Vale do S.Francisco e Araripe'}",1
1998,"{'latlong': [-36.44705331304556, -8.597091004271139], 'name': 'Agreste'}","{'latlong': [-35.45993547543438, -8.237977282077168], 'name': 'Metropolitana'}",113
1998,"{'latlong': [-36.44705331304556, -8.597091004271139], 'name': 'Agreste'}","{'latlong': [-36.44705331304556, -8.597091004271139], 'name': 'Agreste'}",794
1998,"{'latlong': [-36.44705331304556, -8.597091004271139], 'name': 'Agreste'}","{'latlong': [-37.865288937823316, -8.306290795258281], 'name': 'Sertão'}",5
1998,"{'latlong': [-36.44705331304556, -8.597091004271139], 'name': 'Agreste'}","{'latlong': [-39.95936095628068, -8.364764974735124], 'name': 'Vale do S.Francisco e Araripe'}",1
1998,"{'latlong': [-37.865288937823316, -8.306290795258281], 'name': 'Sertão'}","{'latlong': [-35.45993547543438, -8.237977282077168], 'name': 'Metropolitana'}",33
1998,"{'latlong': [-37.865288937823316, -8.306290795258281], 'name': 'Sertão'}","{'latlong': [-36.44705331304556, -8.597091004271139], 'name': 'Agreste'}",7
1998,"{'latlong': [-37.865288937823316, -8.306290795258281], 'name': 'Sertão'}","{'latlong': [-37.865288937823316, -8.306290795258281], 'name': 'Sertão'}",305
1998,"{'latlong': [-37.865288937823316, -8.306290795258281], 'name': 'Sertão'}","{'latlong': [-39.95936095628068, -8.364764974735124], 'name': 'Vale do S.Francisco e Araripe'}",1
1998,"{'latlong': [-39.95936095628068, -8.364764974735124], 'name': 'Vale do S.Francisco e Araripe'}","{'latlong': [-35.45993547543438, -8.237977282077168], 'name': 'Metropolitana'}",8
1998,"{'latlong': [-39.95936095628068, -8.364764974735124], 'name': 'Vale do S.Francisco e Araripe'}","{'latlong': [-36.44705331304556, -8.597091004271139], 'name': 'Agreste'}",2
1998,"{'latlong': [-39.95936095628068, -8.364764974735124], 'name': 'Vale do S.Francisco e Araripe'}","{'latlong': [-37.865288937823316, -8.306290795258281], 'name': 'Sertão'}",1
1998,"{'latlong': [-39.95936095628068, -8.364764974735124], 'name': 'Vale do S.Francisco e Araripe'}","{'latlong': [-39.95936095628068, -8.364764974735124], 'name': 'Vale do S.Francisco e Araripe'}",248
1999,"{'latlong': [-35.45993547543438, -8.237977282077168], 'name': 'Metropolitana'}","{'latlong': [-35.45993547543438, -8.237977282077168], 'name': 'Metropolitana'}",4453
1999,"{'latlong': [-35.45993547543438, -8.237977282077168], 'name': 'Metropolitana'}","{'latlong': [-36.44705331304556, -8.597091004271139], 'name': 'Agreste'}",13
1999,"{'latlong': [-36.44705331304556, -8.597091004271139], 'name': 'Agreste'}","{'latlong': [-35.45993547543438, -8.237977282077168], 'name': 'Metropolitana'}",142
1999,"{'latlong': [-36.44705331304556, -8.597091004271139], 'name': 'Agreste'}","{'latlong': [-36.44705331304556, -8.597091004271139], 'name': 'Agreste'}",860
1999,"{'latlong': [-36.44705331304556, -8.597091004271139], 'name': 'Agreste'}","{'latlong': [-37.865288937823316, -8.306290795258281], 'name': 'Sertão'}",5
1999,"{'latlong': [-37.865288937823316, -8.306290795258281], 'name': 'Sertão'}","{'latlong': [-35.45993547543438, -8.237977282077168], 'name': 'Metropolitana'}",43
1999,"{'latlong': [-37.865288937823316, -8.306290795258281], 'name': 'Sertão'}","{'latlong': [-36.44705331304556, -8.597091004271139], 'name': 'Agreste'}",5
1999,"{'latlong': [-37.865288937823316, -8.306290795258281], 'name': 'Sertão'}","{'latlong': [-37.865288937823316, -8.306290795258281], 'name': 'Sertão'}",382
1999,"{'latlong': [-37.865288937823316, -8.306290795258281], 'name': 'Sertão'}","{'latlong': [-39.95936095628068, -8.364764974735124], 'name': 'Vale do S.Francisco e Araripe'}",2
1999,"{'latlong': [-39.95936095628068, -8.364764974735124], 'name': 'Vale do S.Francisco e Araripe'}","{'latlong': [-35.45993547543438, -8.237977282077168], 'name': 'Metropolitana'}",13
1999,"{'latlong': [-39.95936095628068, -8.364764974735124], 'name': 'Vale do S.Francisco e Araripe'}","{'latlong': [-36.44705331304556, -8.597091004271139], 'name': 'Agreste'}",3
1999,"{'latlong': [-39.95936095628068, -8.364764974735124], 'name': 'Vale do S.Francisco e Araripe'}","{'latlong': [-37.865288937823316, -8.306290795258281], 'name': 'Sertão'}",2
1999,"{'latlong': [-39.95936095628068, -8.364764974735124], 'name': 'Vale do S.Francisco e Araripe'}","{'latlong': [-39.95936095628068, -8.364764974735124], 'name': 'Vale do S.Francisco e Araripe'}",294
2000,"{'latlong': [-35.45993547543438, -8.237977282077168], 'name': 'Metropolitana'}","{'latlong': [-35.45993547543438, -8.237977282077168], 'name': 'Metropolitana'}",4719
2000,"{'latlong': [-35.45993547543438, -8.237977282077168], 'name': 'Metropolitana'}","{'latlong': [-36.44705331304556, -8.597091004271139], 'name': 'Agreste'}",9
2000,"{'latlong': [-35.45993547543438, -8.237977282077168], 'name': 'Metropolitana'}","{'latlong': [-37.865288937823316, -8.306290795258281], 'name': 'Sertão'}",1
2000,"{'latlong': [-35.45993547543438, -8.237977282077168], 'name': 'Metropolitana'}","{'latlong': [-39.95936095628068, -8.364764974735124], 'name': 'Vale do S.Francisco e Araripe'}",1
2000,"{'latlong': [-36.44705331304556, -8.597091004271139], 'name': 'Agreste'}","{'latlong': [-35.45993547543438, -8.237977282077168], 'name': 'Metropolitana'}",136
2000,"{'latlong': [-36.44705331304556, -8.597091004271139], 'name': 'Agreste'}","{'latlong': [-36.44705331304556, -8.597091004271139], 'name': 'Agreste'}",1008
2000,"{'latlong': [-36.44705331304556, -8.597091004271139], 'name': 'Agreste'}","{'latlong': [-37.865288937823316, -8.306290795258281], 'name': 'Sertão'}",6
2000,"{'latlong': [-36.44705331304556, -8.597091004271139], 'name': 'Agreste'}","{'latlong': [-39.95936095628068, -8.364764974735124], 'name': 'Vale do S.Francisco e Araripe'}",1
2000,"{'latlong': [-37.865288937823316, -8.306290795258281], 'name': 'Sertão'}","{'latlong': [-35.45993547543438, -8.237977282077168], 'name': 'Metropolitana'}",42
2000,"{'latlong': [-37.865288937823316, -8.306290795258281], 'name': 'Sertão'}","{'latlong': [-36.44705331304556, -8.597091004271139], 'name': 'Agreste'}",7
2000,"{'latlong': [-37.865288937823316, -8.306290795258281], 'name': 'Sertão'}","{'latlong': [-37.865288937823316, -8.306290795258281], 'name': 'Sertão'}",434
2000,"{'latlong': [-37.865288937823316, -8.306290795258281], 'name': 'Sertão'}","{'latlong': [-39.95936095628068, -8.364764974735124], 'name': 'Vale do S.Francisco e Araripe'}",3
2000,"{'latlong': [-39.95936095628068, -8.364764974735124], 'name': 'Vale do S.Francisco e Araripe'}","{'latlong': [-35.45993547543438, -8.237977282077168], 'name': 'Metropolitana'}",19
2000,"{'latlong': [-39.95936095628068, -8.364764974735124], 'name': 'Vale do S.Francisco e Araripe'}","{'latlong': [-36.44705331304556, -8.597091004271139], 'name': 'Agreste'}",1
2000,"{'latlong': [-39.95936095628068, -8.364764974735124], 'name': 'Vale do S.Francisco e Araripe'}","{'latlong': [-37.865288937823316, -8.306290795258281], 'name': 'Sertão'}",1
2000,"{'latlong': [-39.95936095628068, -8.364764974735124], 'name': 'Vale do S.Francisco e Araripe'}","{'latlong': [-39.95936095628068, -8.364764974735124], 'name': 'Vale do S.Francisco e Araripe'}",297
2001,"{'latlong': [-35.45993547543438, -8.237977282077168], 'name': 'Metropolitana'}","{'latlong': [-35.45993547543438, -8.237977282077168], 'name': 'Metropolitana'}",5069
2001,"{'latlong': [-35.45993547543438, -8.237977282077168], 'name': 'Metropolitana'}","{'latlong': [-36.44705331304556, -8.597091004271139], 'name': 'Agreste'}",22
2001,"{'latlong': [-35.45993547543438, -8.237977282077168], 'name': 'Metropolitana'}","{'latlong': [-37.865288937823316, -8.306290795258281], 'name': 'Sertão'}",2
2001,"{'latlong': [-36.44705331304556, -8.597091004271139], 'name': 'Agreste'}","{'latlong': [-35.45993547543438, -8.237977282077168], 'name': 'Metropolitana'}",167
2001,"{'latlong': [-36.44705331304556, -8.597091004271139], 'name': 'Agreste'}","{'latlong': [-36.44705331304556, -8.597091004271139], 'name': 'Agreste'}",1104
2001,"{'latlong': [-36.44705331304556, -8.597091004271139], 'name': 'Agreste'}","{'latlong': [-37.865288937823316, -8.306290795258281], 'name': 'Sertão'}",6
2001,"{'latlong': [-36.44705331304556, -8.597091004271139], 'name': 'Agreste'}","{'latlong': [-39.95936095628068, -8.364764974735124], 'name': 'Vale do S.Francisco e Araripe'}",2
2001,"{'latlong': [-37.865288937823316, -8.306290795258281], 'name': 'Sertão'}","{'latlong': [-35.45993547543438, -8.237977282077168], 'name': 'Metropolitana'}",46
2001,"{'latlong': [-37.865288937823316, -8.306290795258281], 'name': 'Sertão'}","{'latlong': [-36.44705331304556, -8.597091004271139], 'name': 'Agreste'}",9
2001,"{'latlong': [-37.865288937823316, -8.306290795258281], 'name': 'Sertão'}","{'latlong': [-37.865288937823316, -8.306290795258281], 'name': 'Sertão'}",526
2001,"{'latlong': [-37.865288937823316, -8.306290795258281], 'name': 'Sertão'}","{'latlong': [-39.95936095628068, -8.364764974735124], 'name': 'Vale do S.Francisco e Araripe'}",4
2001,"{'latlong': [-39.95936095628068, -8.364764974735124], 'name': 'Vale do S.Francisco e Araripe'}","{'latlong': [-35.45993547543438, -8.237977282077168], 'name': 'Metropolitana'}",19
2001,"{'latlong': [-39.95936095628068, -8.364764974735124], 'name': 'Vale do S.Francisco e Araripe'}","{'latlong': [-36.44705331304556, -8.597091004271139], 'name': 'Agreste'}",5
2001,"{'latlong': [-39.95936095628068, -8.364764974735124], 'name': 'Vale do S.Francisco e Araripe'}","{'latlong': [-37.865288937823316, -8.306290795258281], 'name': 'Sertão'}",8
2001,"{'latlong': [-39.95936095628068, -8.364764974735124], 'name': 'Vale do S.Francisco e Araripe'}","{'latlong': [-39.95936095628068, -8.364764974735124], 'name': 'Vale do S.Francisco e Araripe'}",344
2002,"{'latlong': [-35.45993547543438, -8.237977282077168], 'name': 'Metropolitana'}","{'latlong': [-35.45993547543438, -8.237977282077168], 'name': 'Metropolitana'}",4465
2002,"{'latlong': [-35.45993547543438, -8.237977282077168], 'name': 'Metropolitana'}","{'latlong': [-36.44705331304556, -8.597091004271139], 'name': 'Agreste'}",15
2002,"{'latlong': [-36.44705331304556, -8.597091004271139], 'name': 'Agreste'}","{'latlong': [-35.45993547543438, -8.237977282077168], 'name': 'Metropolitana'}",80
2002,"{'latlong': [-36.44705331304556, -8.597091004271139], 'name': 'Agreste'}","{'latlong': [-36.44705331304556, -8.597091004271139], 'name': 'Agreste'}",1009
2002,"{'latlong': [-36.44705331304556, -8.597091004271139], 'name': 'Agreste'}","{'latlong': [-37.865288937823316, -8.306290795258281], 'name': 'Sertão'}",5
2002,"{'latlong': [-37.865288937823316, -8.306290795258281], 'name': 'Sertão'}","{'latlong': [-35.45993547543438, -8.237977282077168], 'name': 'Metropolitana'}",31
2002,"{'latlong': [-37.865288937823316, -8.306290795258281], 'name': 'Sertão'}","{'latlong': [-36.44705331304556, -8.597091004271139], 'name': 'Agreste'}",4
2002,"{'latlong': [-37.865288937823316, -8.306290795258281], 'name': 'Sertão'}","{'latlong': [-37.865288937823316, -8.306290795258281], 'name': 'Sertão'}",475
2002,"{'latlong': [-37.865288937823316, -8.306290795258281], 'name': 'Sertão'}","{'latlong': [-39.95936095628068, -8.364764974735124], 'name': 'Vale do S.Francisco e Araripe'}",2
2002,"{'latlong': [-39.95936095628068, -8.364764974735124], 'name': 'Vale do S.Francisco e Araripe'}","{'latlong': [-35.45993547543438, -8.237977282077168], 'name': 'Metropolitana'}",7
2002,"{'latlong': [-39.95936095628068, -8.364764974735124], 'name': 'Vale do S.Francisco e Araripe'}","{'latlong': [-36.44705331304556, -8.597091004271139], 'name': 'Agreste'}",4
2002,"{'latlong': [-39.95936095628068, -8.364764974735124], 'name': 'Vale do S.Francisco e Araripe'}","{'latlong': [-37.865288937823316, -8.306290795258281], 'name': 'Sertão'}",5
2002,"{'latlong': [-39.95936095628068, -8.364764974735124], 'name': 'Vale do S.Francisco e Araripe'}","{'latlong': [-39.95936095628068, -8.364764974735124], 'name': 'Vale do S.Francisco e Araripe'}",380
2003,"{'latlong': [-35.45993547543438, -8.237977282077168], 'name': 'Metropolitana'}","{'latlong': [-35.45993547543438, -8.237977282077168], 'name': 'Metropolitana'}",4004
2003,"{'latlong': [-35.45993547543438, -8.237977282077168], 'name': 'Metropolitana'}","{'latlong': [-36.44705331304556, -8.597091004271139], 'name': 'Agreste'}",8
2003,"{'latlong': [-36.44705331304556, -8.597091004271139], 'name': 'Agreste'}","{'latlong': [-35.45993547543438, -8.237977282077168], 'name': 'Metropolitana'}",54
2003,"{'latlong': [-36.44705331304556, -8.597091004271139], 'name': 'Agreste'}","{'latlong': [-36.44705331304556, -8.597091004271139], 'name': 'Agreste'}",862
2003,"{'latlong': [-36.44705331304556, -8.597091004271139], 'name': 'Agreste'}","{'latlong': [-37.865288937823316, -8.306290795258281], 'name': 'Sertão'}",14
2003,"{'latlong': [-37.865288937823316, -8.306290795258281], 'name': 'Sertão'}","{'latlong': [-35.45993547543438, -8.237977282077168], 'name': 'Metropolitana'}",14
2003,"{'latlong': [-37.865288937823316, -8.306290795258281], 'name': 'Sertão'}","{'latlong': [-36.44705331304556, -8.597091004271139], 'name': 'Agreste'}",4
2003,"{'latlong': [-37.865288937823316, -8.306290795258281], 'name': 'Sertão'}","{'latlong': [-37.865288937823316, -8.306290795258281], 'name': 'Sertão'}",448
2003,"{'latlong': [-37.865288937823316, -8.306290795258281], 'name': 'Sertão'}","{'latlong': [-39.95936095628068, -8.364764974735124], 'name': 'Vale do S.Francisco e Araripe'}",2
2003,"{'latlong': [-39.95936095628068, -8.364764974735124], 'name': 'Vale do S.Francisco e Araripe'}","{'latlong': [-35.45993547543438, -8.237977282077168], 'name': 'Metropolitana'}",3
2003,"{'latlong': [-39.95936095628068, -8.364764974735124], 'name': 'Vale do S.Francisco e Araripe'}","{'latlong': [-37.865288937823316, -8.306290795258281], 'name': 'Sertão'}",10
2003,"{'latlong': [-39.95936095628068, -8.364764974735124], 'name': 'Vale do S.Francisco e Araripe'}","{'latlong': [-39.95936095628068, -8.364764974735124], 'name': 'Vale do S.Francisco e Araripe'}",319
2004,"{'latlong': [-35.45993547543438, -8.237977282077168], 'name': 'Metropolitana'}","{'latlong': [-35.45993547543438, -8.237977282077168], 'name': 'Metropolitana'}",3914
2004,"{'latlong': [-35.45993547543438, -8.237977282077168], 'name': 'Metropolitana'}","{'latlong': [-36.44705331304556, -8.597091004271139], 'name': 'Agreste'}",8
2004,"{'latlong': [-36.44705331304556, -8.597091004271139], 'name': 'Agreste'}","{'latlong': [-35.45993547543438, -8.237977282077168], 'name': 'Metropolitana'}",78
2004,"{'latlong': [-36.44705331304556, -8.597091004271139], 'name': 'Agreste'}","{'latlong': [-36.44705331304556, -8.597091004271139], 'name': 'Agreste'}",940
2004,"{'latlong': [-36.44705331304556, -8.597091004271139], 'name': 'Agreste'}","{'latlong': [-37.865288937823316, -8.306290795258281], 'name': 'Sertão'}",10
2004,"{'latlong': [-37.865288937823316, -8.306290795258281], 'name': 'Sertão'}","{'latlong': [-35.45993547543438, -8.237977282077168], 'name': 'Metropolitana'}",19
2004,"{'latlong': [-37.865288937823316, -8.306290795258281], 'name': 'Sertão'}","{'latlong': [-36.44705331304556, -8.597091004271139], 'name': 'Agreste'}",3
2004,"{'latlong': [-37.865288937823316, -8.306290795258281], 'name': 'Sertão'}","{'latlong': [-37.865288937823316, -8.306290795258281], 'name': 'Sertão'}",499
2004,"{'latlong': [-37.865288937823316, -8.306290795258281], 'name': 'Sertão'}","{'latlong': [-39.95936095628068, -8.364764974735124], 'name': 'Vale do S.Francisco e Araripe'}",3
2004,"{'latlong': [-39.95936095628068, -8.364764974735124], 'name': 'Vale do S.Francisco e Araripe'}","{'latlong': [-35.45993547543438, -8.237977282077168], 'name': 'Metropolitana'}",12
2004,"{'latlong': [-39.95936095628068, -8.364764974735124], 'name': 'Vale do S.Francisco e Araripe'}","{'latlong': [-37.865288937823316, -8.306290795258281], 'name': 'Sertão'}",4
2004,"{'latlong': [-39.95936095628068, -8.364764974735124], 'name': 'Vale do S.Francisco e Araripe'}","{'latlong': [-39.95936095628068, -8.364764974735124], 'name': 'Vale do S.Francisco e Araripe'}",348
2005,"{'latlong': [-35.45993547543438, -8.237977282077168], 'name': 'Metropolitana'}","{'latlong': [-35.45993547543438, -8.237977282077168], 'name': 'Metropolitana'}",4129
2005,"{'latlong': [-35.45993547543438, -8.237977282077168], 'name': 'Metropolitana'}","{'latlong': [-36.44705331304556, -8.597091004271139], 'name': 'Agreste'}",4
2005,"{'latlong': [-36.44705331304556, -8.597091004271139], 'name': 'Agreste'}","{'latlong': [-35.45993547543438, -8.237977282077168], 'name': 'Metropolitana'}",62
2005,"{'latlong': [-36.44705331304556, -8.597091004271139], 'name': 'Agreste'}","{'latlong': [-36.44705331304556, -8.597091004271139], 'name': 'Agreste'}",1034
2005,"{'latlong': [-36.44705331304556, -8.597091004271139], 'name': 'Agreste'}","{'latlong': [-37.865288937823316, -8.306290795258281], 'name': 'Sertão'}",9
2005,"{'latlong': [-37.865288937823316, -8.306290795258281], 'name': 'Sertão'}","{'latlong': [-35.45993547543438, -8.237977282077168], 'name': 'Metropolitana'}",21
2005,"{'latlong': [-37.865288937823316, -8.306290795258281], 'name': 'Sertão'}","{'latlong': [-36.44705331304556, -8.597091004271139], 'name': 'Agreste'}",7
2005,"{'latlong': [-37.865288937823316, -8.306290795258281], 'name': 'Sertão'}","{'latlong': [-37.865288937823316, -8.306290795258281], 'name': 'Sertão'}",542
2005,"{'latlong': [-37.865288937823316, -8.306290795258281], 'name': 'Sertão'}","{'latlong': [-39.95936095628068, -8.364764974735124], 'name': 'Vale do S.Francisco e Araripe'}",3
2005,"{'latlong': [-39.95936095628068, -8.364764974735124], 'name': 'Vale do S.Francisco e Araripe'}","{'latlong': [-35.45993547543438, -8.237977282077168], 'name': 'Metropolitana'}",9
2005,"{'latlong': [-39.95936095628068, -8.364764974735124], 'name': 'Vale do S.Francisco e Araripe'}","{'latlong': [-37.865288937823316, -8.306290795258281], 'name': 'Sertão'}",11
2005,"{'latlong': [-39.95936095628068, -8.364764974735124], 'name': 'Vale do S.Francisco e Araripe'}","{'latlong': [-39.95936095628068, -8.364764974735124], 'name': 'Vale do S.Francisco e Araripe'}",411
2006,"{'latlong': [-35.45993547543438, -8.237977282077168], 'name': 'Metropolitana'}","{'latlong': [-35.45993547543438, -8.237977282077168], 'name': 'Metropolitana'}",4104
2006,"{'latlong': [-35.45993547543438, -8.237977282077168], 'name': 'Metropolitana'}","{'latlong': [-36.44705331304556, -8.597091004271139], 'name': 'Agreste'}",11
2006,"{'latlong': [-36.44705331304556, -8.597091004271139], 'name': 'Agreste'}","{'latlong': [-35.45993547543438, -8.237977282077168], 'name': 'Metropolitana'}",66
2006,"{'latlong': [-36.44705331304556, -8.597091004271139], 'name': 'Agreste'}","{'latlong': [-36.44705331304556, -8.597091004271139], 'name': 'Agreste'}",1069
2006,"{'latlong': [-36.44705331304556, -8.597091004271139], 'name': 'Agreste'}","{'latlong': [-37.865288937823316, -8.306290795258281], 'name': 'Sertão'}",13
2006,"{'latlong': [-37.865288937823316, -8.306290795258281], 'name': 'Sertão'}","{'latlong': [-35.45993547543438, -8.237977282077168], 'name': 'Metropolitana'}",24
2006,"{'latlong': [-37.865288937823316, -8.306290795258281], 'name': 'Sertão'}","{'latlong': [-36.44705331304556, -8.597091004271139], 'name': 'Agreste'}",6
2006,"{'latlong': [-37.865288937823316, -8.306290795258281], 'name': 'Sertão'}","{'latlong': [-37.865288937823316, -8.306290795258281], 'name': 'Sertão'}",629
2006,"{'latlong': [-37.865288937823316, -8.306290795258281], 'name': 'Sertão'}","{'latlong': [-39.95936095628068, -8.364764974735124], 'name': 'Vale do S.Francisco e Araripe'}",2
2006,"{'latlong': [-39.95936095628068, -8.364764974735124], 'name': 'Vale do S.Francisco e Araripe'}","{'latlong': [-35.45993547543438, -8.237977282077168], 'name': 'Metropolitana'}",6
2006,"{'latlong': [-39.95936095628068, -8.364764974735124], 'name': 'Vale do S.Francisco e Araripe'}","{'latlong': [-36.44705331304556, -8.597091004271139], 'name': 'Agreste'}",1
2006,"{'latlong': [-39.95936095628068, -8.364764974735124], 'name': 'Vale do S.Francisco e Araripe'}","{'latlong': [-39.95936095628068, -8.364764974735124], 'name': 'Vale do S.Francisco e Araripe'}",430
2007,"{'latlong': [-35.45993547543438, -8.237977282077168], 'name': 'Metropolitana'}","{'latlong': [-35.45993547543438, -8.237977282077168], 'name': 'Metropolitana'}",3749
2007,"{'latlong': [-35.45993547543438, -8.237977282077168], 'name': 'Metropolitana'}","{'latlong': [-36.44705331304556, -8.597091004271139], 'name': 'Agreste'}",17
2007,"{'latlong': [-36.44705331304556, -8.597091004271139], 'name': 'Agreste'}","{'latlong': [-35.45993547543438, -8.237977282077168], 'name': 'Metropolitana'}",89
2007,"{'latlong': [-36.44705331304556, -8.597091004271139], 'name': 'Agreste'}","{'latlong': [-36.44705331304556, -8.597091004271139], 'name': 'Agreste'}",1135
2007,"{'latlong': [-36.44705331304556, -8.597091004271139], 'name': 'Agreste'}","{'latlong': [-37.865288937823316, -8.306290795258281], 'name': 'Sertão'}",13
2007,"{'latlong': [-37.865288937823316, -8.306290795258281], 'name': 'Sertão'}","{'latlong': [-35.45993547543438, -8.237977282077168], 'name': 'Metropolitana'}",36
2007,"{'latlong': [-37.865288937823316, -8.306290795258281], 'name': 'Sertão'}","{'latlong': [-36.44705331304556, -8.597091004271139], 'name': 'Agreste'}",6
2007,"{'latlong': [-37.865288937823316, -8.306290795258281], 'name': 'Sertão'}","{'latlong': [-37.865288937823316, -8.306290795258281], 'name': 'Sertão'}",684
2007,"{'latlong': [-37.865288937823316, -8.306290795258281], 'name': 'Sertão'}","{'latlong': [-39.95936095628068, -8.364764974735124], 'name': 'Vale do S.Francisco e Araripe'}",2
2007,"{'latlong': [-39.95936095628068, -8.364764974735124], 'name': 'Vale do S.Francisco e Araripe'}","{'latlong': [-35.45993547543438, -8.237977282077168], 'name': 'Metropolitana'}",15
2007,"{'latlong': [-39.95936095628068, -8.364764974735124], 'name': 'Vale do S.Francisco e Araripe'}","{'latlong': [-37.865288937823316, -8.306290795258281], 'name': 'Sertão'}",7
2007,"{'latlong': [-39.95936095628068, -8.364764974735124], 'name': 'Vale do S.Francisco e Araripe'}","{'latlong': [-39.95936095628068, -8.364764974735124], 'name': 'Vale do S.Francisco e Araripe'}",452
2008,"{'latlong': [-35.45993547543438, -8.237977282077168], 'name': 'Metropolitana'}","{'latlong': [-35.45993547543438, -8.237977282077168], 'name': 'Metropolitana'}",4378
2008,"{'latlong': [-35.45993547543438, -8.237977282077168], 'name': 'Metropolitana'}","{'latlong': [-36.44705331304556, -8.597091004271139], 'name': 'Agreste'}",10
2008,"{'latlong': [-36.44705331304556, -8.597091004271139], 'name': 'Agreste'}","{'latlong': [-35.45993547543438, -8.237977282077168], 'name': 'Metropolitana'}",105
2008,"{'latlong': [-36.44705331304556, -8.597091004271139], 'name': 'Agreste'}","{'latlong': [-36.44705331304556, -8.597091004271139], 'name': 'Agreste'}",1245
2008,"{'latlong': [-36.44705331304556, -8.597091004271139], 'name': 'Agreste'}","{'latlong': [-37.865288937823316, -8.306290795258281], 'name': 'Sertão'}",6
2008,"{'latlong': [-37.865288937823316, -8.306290795258281], 'name': 'Sertão'}","{'latlong': [-35.45993547543438, -8.237977282077168], 'name': 'Metropolitana'}",26
2008,"{'latlong': [-37.865288937823316, -8.306290795258281], 'name': 'Sertão'}","{'latlong': [-36.44705331304556, -8.597091004271139], 'name': 'Agreste'}",4
2008,"{'latlong': [-37.865288937823316, -8.306290795258281], 'name': 'Sertão'}","{'latlong': [-37.865288937823316, -8.306290795258281], 'name': 'Sertão'}",735
2008,"{'latlong': [-37.865288937823316, -8.306290795258281], 'name': 'Sertão'}","{'latlong': [-39.95936095628068, -8.364764974735124], 'name': 'Vale do S.Francisco e Araripe'}",3
2008,"{'latlong': [-39.95936095628068, -8.364764974735124], 'name': 'Vale do S.Francisco e Araripe'}","{'latlong': [-35.45993547543438, -8.237977282077168], 'name': 'Metropolitana'}",12
2008,"{'latlong': [-39.95936095628068, -8.364764974735124], 'name': 'Vale do S.Francisco e Araripe'}","{'latlong': [-37.865288937823316, -8.306290795258281], 'name': 'Sertão'}",4
2008,"{'latlong': [-39.95936095628068, -8.364764974735124], 'name': 'Vale do S.Francisco e Araripe'}","{'latlong': [-39.95936095628068, -8.364764974735124], 'name': 'Vale do S.Francisco e Araripe'}",456
2009,"{'latlong': [-35.45993547543438, -8.237977282077168], 'name': 'Metropolitana'}","{'latlong': [-35.45993547543438, -8.237977282077168], 'name': 'Metropolitana'}",4174
2009,"{'latlong': [-35.45993547543438, -8.237977282077168], 'name': 'Metropolitana'}","{'latlong': [-36.44705331304556, -8.597091004271139], 'name': 'Agreste'}",18
2009,"{'latlong': [-36.44705331304556, -8.597091004271139], 'name': 'Agreste'}","{'latlong': [-35.45993547543438, -8.237977282077168], 'name': 'Metropolitana'}",105
2009,"{'latlong': [-36.44705331304556, -8.597091004271139], 'name': 'Agreste'}","{'latlong': [-36.44705331304556, -8.597091004271139], 'name': 'Agreste'}",1312
2009,"{'latlong': [-36.44705331304556, -8.597091004271139], 'name': 'Agreste'}","{'latlong': [-37.865288937823316, -8.306290795258281], 'name': 'Sertão'}",6
2009,"{'latlong': [-36.44705331304556, -8.597091004271139], 'name': 'Agreste'}","{'latlong': [-39.95936095628068, -8.364764974735124], 'name': 'Vale do S.Francisco e Araripe'}",1
2009,"{'latlong': [-37.865288937823316, -8.306290795258281], 'name': 'Sertão'}","{'latlong': [-35.45993547543438, -8.237977282077168], 'name': 'Metropolitana'}",29
2009,"{'latlong': [-37.865288937823316, -8.306290795258281], 'name': 'Sertão'}","{'latlong': [-36.44705331304556, -8.597091004271139], 'name': 'Agreste'}",8
2009,"{'latlong': [-37.865288937823316, -8.306290795258281], 'name': 'Sertão'}","{'latlong': [-37.865288937823316, -8.306290795258281], 'name': 'Sertão'}",909
2009,"{'latlong': [-37.865288937823316, -8.306290795258281], 'name': 'Sertão'}","{'latlong': [-39.95936095628068, -8.364764974735124], 'name': 'Vale do S.Francisco e Araripe'}",3
2009,"{'latlong': [-39.95936095628068, -8.364764974735124], 'name': 'Vale do S.Francisco e Araripe'}","{'latlong': [-35.45993547543438, -8.237977282077168], 'name': 'Metropolitana'}",15
2009,"{'latlong': [-39.95936095628068, -8.364764974735124], 'name': 'Vale do S.Francisco e Araripe'}","{'latlong': [-36.44705331304556, -8.597091004271139], 'name': 'Agreste'}",1
2009,"{'latlong': [-39.95936095628068, -8.364764974735124], 'name': 'Vale do S.Francisco e Araripe'}","{'latlong': [-37.865288937823316, -8.306290795258281], 'name': 'Sertão'}",2
2009,"{'latlong': [-39.95936095628068, -8.364764974735124], 'name': 'Vale do S.Francisco e Araripe'}","{'latlong': [-39.95936095628068, -8.364764974735124], 'name': 'Vale do S.Francisco e Araripe'}",584
2010,"{'latlong': [-35.45993547543438, -8.237977282077168], 'name': 'Metropolitana'}","{'latlong': [-35.45993547543438, -8.237977282077168], 'name': 'Metropolitana'}",4421
2010,"{'latlong': [-35.45993547543438, -8.237977282077168], 'name': 'Metropolitana'}","{'latlong': [-36.44705331304556, -8.597091004271139], 'name': 'Agreste'}",18
2010,"{'latlong': [-36.44705331304556, -8.597091004271139], 'name': 'Agreste'}","{'latlong': [-35.45993547543438, -8.237977282077168], 'name': 'Metropolitana'}",129
2010,"{'latlong': [-36.44705331304556, -8.597091004271139], 'name': 'Agreste'}","{'latlong': [-36.44705331304556, -8.597091004271139], 'name': 'Agreste'}",1462
2010,"{'latlong': [-36.44705331304556, -8.597091004271139], 'name': 'Agreste'}","{'latlong': [-37.865288937823316, -8.306290795258281], 'name': 'Sertão'}",5
2010,"{'latlong': [-37.865288937823316, -8.306290795258281], 'name': 'Sertão'}","{'latlong': [-35.45993547543438, -8.237977282077168], 'name': 'Metropolitana'}",41
2010,"{'latlong': [-37.865288937823316, -8.306290795258281], 'name': 'Sertão'}","{'latlong': [-36.44705331304556, -8.597091004271139], 'name': 'Agreste'}",11
2010,"{'latlong': [-37.865288937823316, -8.306290795258281], 'name': 'Sertão'}","{'latlong': [-37.865288937823316, -8.306290795258281], 'name': 'Sertão'}",1097
2010,"{'latlong': [-37.865288937823316, -8.306290795258281], 'name': 'Sertão'}","{'latlong': [-39.95936095628068, -8.364764974735124], 'name': 'Vale do S.Francisco e Araripe'}",1
2010,"{'latlong': [-39.95936095628068, -8.364764974735124], 'name': 'Vale do S.Francisco e Araripe'}","{'latlong': [-35.45993547543438, -8.237977282077168], 'name': 'Metropolitana'}",8
2010,"{'latlong': [-39.95936095628068, -8.364764974735124], 'name': 'Vale do S.Francisco e Araripe'}","{'latlong': [-36.44705331304556, -8.597091004271139], 'name': 'Agreste'}",4
2010,"{'latlong': [-39.95936095628068, -8.364764974735124], 'name': 'Vale do S.Francisco e Araripe'}","{'latlong': [-37.865288937823316, -8.306290795258281], 'name': 'Sertão'}",3
2010,"{'latlong': [-39.95936095628068, -8.364764974735124], 'name': 'Vale do S.Francisco e Araripe'}","{'latlong': [-39.95936095628068, -8.364764974735124], 'name': 'Vale do S.Francisco e Araripe'}",668
2011,"{'latlong': [-35.45993547543438, -8.237977282077168], 'name': 'Metropolitana'}","{'latlong': [-35.45993547543438, -8.237977282077168], 'name': 'Metropolitana'}",4544
2011,"{'latlong': [-35.45993547543438, -8.237977282077168], 'name': 'Metropolitana'}","{'latlong': [-36.44705331304556, -8.597091004271139], 'name': 'Agreste'}",9
2011,"{'latlong': [-35.45993547543438, -8.237977282077168], 'name': 'Metropolitana'}","{'latlong': [-37.865288937823316, -8.306290795258281], 'name': 'Sertão'}",1
2011,"{'latlong': [-35.45993547543438, -8.237977282077168], 'name': 'Metropolitana'}","{'latlong': [-39.95936095628068, -8.364764974735124], 'name': 'Vale do S.Francisco e Araripe'}",1
2011,"{'latlong': [-36.44705331304556, -8.597091004271139], 'name': 'Agreste'}","{'latlong': [-35.45993547543438, -8.237977282077168], 'name': 'Metropolitana'}",160
2011,"{'latlong': [-36.44705331304556, -8.597091004271139], 'name': 'Agreste'}","{'latlong': [-36.44705331304556, -8.597091004271139], 'name': 'Agreste'}",1507
2011,"{'latlong': [-36.44705331304556, -8.597091004271139], 'name': 'Agreste'}","{'latlong': [-37.865288937823316, -8.306290795258281], 'name': 'Sertão'}",11
2011,"{'latlong': [-37.865288937823316, -8.306290795258281], 'name': 'Sertão'}","{'latlong': [-35.45993547543438, -8.237977282077168], 'name': 'Metropolitana'}",53
2011,"{'latlong': [-37.865288937823316, -8.306290795258281], 'name': 'Sertão'}","{'latlong': [-36.44705331304556, -8.597091004271139], 'name': 'Agreste'}",7
2011,"{'latlong': [-37.865288937823316, -8.306290795258281], 'name': 'Sertão'}","{'latlong': [-37.865288937823316, -8.306290795258281], 'name': 'Sertão'}",1233
2011,"{'latlong': [-37.865288937823316, -8.306290795258281], 'name': 'Sertão'}","{'latlong': [-39.95936095628068, -8.364764974735124], 'name': 'Vale do S.Francisco e Araripe'}",3
2011,"{'latlong': [-39.95936095628068, -8.364764974735124], 'name': 'Vale do S.Francisco e Araripe'}","{'latlong': [-35.45993547543438, -8.237977282077168], 'name': 'Metropolitana'}",12
2011,"{'latlong': [-39.95936095628068, -8.364764974735124], 'name': 'Vale do S.Francisco e Araripe'}","{'latlong': [-37.865288937823316, -8.306290795258281], 'name': 'Sertão'}",5
2011,"{'latlong': [-39.95936095628068, -8.364764974735124], 'name': 'Vale do S.Francisco e Araripe'}","{'latlong': [-39.95936095628068, -8.364764974735124], 'name': 'Vale do S.Francisco e Araripe'}",714
2012,"{'latlong': [-35.45993547543438, -8.237977282077168], 'name': 'Metropolitana'}","{'latlong': [-35.45993547543438, -8.237977282077168], 'name': 'Metropolitana'}",3921
2012,"{'latlong': [-35.45993547543438, -8.237977282077168], 'name': 'Metropolitana'}","{'latlong': [-36.44705331304556, -8.597091004271139], 'name': 'Agreste'}",14
2012,"{'latlong': [-36.44705331304556, -8.597091004271139], 'name': 'Agreste'}","{'latlong': [-35.45993547543438, -8.237977282077168], 'name': 'Metropolitana'}",182
2012,"{'latlong': [-36.44705331304556, -8.597091004271139], 'name': 'Agreste'}","{'latlong': [-36.44705331304556, -8.597091004271139], 'name': 'Agreste'}",1295
2012,"{'latlong': [-36.44705331304556, -8.597091004271139], 'name': 'Agreste'}","{'latlong': [-37.865288937823316, -8.306290795258281], 'name': 'Sertão'}",11
2012,"{'latlong': [-37.865288937823316, -8.306290795258281], 'name': 'Sertão'}","{'latlong': [-35.45993547543438, -8.237977282077168], 'name': 'Metropolitana'}",45
2012,"{'latlong': [-37.865288937823316, -8.306290795258281], 'name': 'Sertão'}","{'latlong': [-36.44705331304556, -8.597091004271139], 'name': 'Agreste'}",9
2012,"{'latlong': [-37.865288937823316, -8.306290795258281], 'name': 'Sertão'}","{'latlong': [-37.865288937823316, -8.306290795258281], 'name': 'Sertão'}",1145
2012,"{'latlong': [-37.865288937823316, -8.306290795258281], 'name': 'Sertão'}","{'latlong': [-39.95936095628068, -8.364764974735124], 'name': 'Vale do S.Francisco e Araripe'}",4
2012,"{'latlong': [-39.95936095628068, -8.364764974735124], 'name': 'Vale do S.Francisco e Araripe'}","{'latlong': [-35.45993547543438, -8.237977282077168], 'name': 'Metropolitana'}",7
2012,"{'latlong': [-39.95936095628068, -8.364764974735124], 'name': 'Vale do S.Francisco e Araripe'}","{'latlong': [-37.865288937823316, -8.306290795258281], 'name': 'Sertão'}",1
2012,"{'latlong': [-39.95936095628068, -8.364764974735124], 'name': 'Vale do S.Francisco e Araripe'}","{'latlong': [-39.95936095628068, -8.364764974735124], 'name': 'Vale do S.Francisco e Araripe'}",701
2013,"{'latlong': [-35.45993547543438, -8.237977282077168], 'name': 'Metropolitana'}","{'latlong': [-35.45993547543438, -8.237977282077168], 'name': 'Metropolitana'}",3476
2013,"{'latlong': [-35.45993547543438, -8.237977282077168], 'name': 'Metropolitana'}","{'latlong': [-36.44705331304556, -8.597091004271139], 'name': 'Agreste'}",35
2013,"{'latlong': [-36.44705331304556, -8.597091004271139], 'name': 'Agreste'}","{'latlong': [-35.45993547543438, -8.237977282077168], 'name': 'Metropolitana'}",219
2013,"{'latlong': [-36.44705331304556, -8.597091004271139], 'name': 'Agreste'}","{'latlong': [-36.44705331304556, -8.597091004271139], 'name': 'Agreste'}",1201
2013,"{'latlong': [-36.44705331304556, -8.597091004271139], 'name': 'Agreste'}","{'latlong': [-37.865288937823316, -8.306290795258281], 'name': 'Sertão'}",5
2013,"{'latlong': [-37.865288937823316, -8.306290795258281], 'name': 'Sertão'}","{'latlong': [-35.45993547543438, -8.237977282077168], 'name': 'Metropolitana'}",53
2013,"{'latlong': [-37.865288937823316, -8.306290795258281], 'name': 'Sertão'}","{'latlong': [-36.44705331304556, -8.597091004271139], 'name': 'Agreste'}",3
2013,"{'latlong': [-37.865288937823316, -8.306290795258281], 'name': 'Sertão'}","{'latlong': [-37.865288937823316, -8.306290795258281], 'name': 'Sertão'}",1001
2013,"{'latlong': [-37.865288937823316, -8.306290795258281], 'name': 'Sertão'}","{'latlong': [-39.95936095628068, -8.364764974735124], 'name': 'Vale do S.Francisco e Araripe'}",6
2013,"{'latlong': [-39.95936095628068, -8.364764974735124], 'name': 'Vale do S.Francisco e Araripe'}","{'latlong': [-35.45993547543438, -8.237977282077168], 'name': 'Metropolitana'}",6
2013,"{'latlong': [-39.95936095628068, -8.364764974735124], 'name': 'Vale do S.Francisco e Araripe'}","{'latlong': [-39.95936095628068, -8.364764974735124], 'name': 'Vale do S.Francisco e Araripe'}",624
2014,"{'latlong': [-35.45993547543438, -8.237977282077168], 'name': 'Metropolitana'}","{'latlong': [-35.45993547543438, -8.237977282077168], 'name': 'Metropolitana'}",3075
2014,"{'latlong': [-35.45993547543438, -8.237977282077168], 'name': 'Metropolitana'}","{'latlong': [-36.44705331304556, -8.597091004271139], 'name': 'Agreste'}",17
2014,"{'latlong': [-35.45993547543438, -8.237977282077168], 'name': 'Metropolitana'}","{'latlong': [-37.865288937823316, -8.306290795258281], 'name': 'Sertão'}",2
2014,"{'latlong': [-36.44705331304556, -8.597091004271139], 'name': 'Agreste'}","{'latlong': [-35.45993547543438, -8.237977282077168], 'name': 'Metropolitana'}",242
2014,"{'latlong': [-36.44705331304556, -8.597091004271139], 'name': 'Agreste'}","{'latlong': [-36.44705331304556, -8.597091004271139], 'name': 'Agreste'}",984
2014,"{'latlong': [-36.44705331304556, -8.597091004271139], 'name': 'Agreste'}","{'latlong': [-37.865288937823316, -8.306290795258281], 'name': 'Sertão'}",7
2014,"{'latlong': [-37.865288937823316, -8.306290795258281], 'name': 'Sertão'}","{'latlong': [-35.45993547543438, -8.237977282077168], 'name': 'Metropolitana'}",58
2014,"{'latlong': [-37.865288937823316, -8.306290795258281], 'name': 'Sertão'}","{'latlong': [-36.44705331304556, -8.597091004271139], 'name': 'Agreste'}",10
2014,"{'latlong': [-37.865288937823316, -8.306290795258281], 'name': 'Sertão'}","{'latlong': [-37.865288937823316, -8.306290795258281], 'name': 'Sertão'}",978
2014,"{'latlong': [-37.865288937823316, -8.306290795258281], 'name': 'Sertão'}","{'latlong': [-39.95936095628068, -8.364764974735124], 'name': 'Vale do S.Francisco e Araripe'}",1
2014,"{'latlong': [-39.95936095628068, -8.364764974735124], 'name': 'Vale do S.Francisco e Araripe'}","{'latlong': [-35.45993547543438, -8.237977282077168], 'name': 'Metropolitana'}",3
2014,"{'latlong': [-39.95936095628068, -8.364764974735124], 'name': 'Vale do S.Francisco e Araripe'}","{'latlong': [-37.865288937823316, -8.306290795258281], 'name': 'Sertão'}",6
2014,"{'latlong': [-39.95936095628068, -8.364764974735124], 'name': 'Vale do S.Francisco e Araripe'}","{'latlong': [-39.95936095628068, -8.364764974735124], 'name': 'Vale do S.Francisco e Araripe'}",571
2015,"{'latlong': [-35.45993547543438, -8.237977282077168], 'name': 'Metropolitana'}","{'latlong': [-35.45993547543438, -8.237977282077168], 'name': 'Metropolitana'}",2651
2015,"{'latlong': [-35.45993547543438, -8.237977282077168], 'name': 'Metropolitana'}","{'latlong': [-36.44705331304556, -8.597091004271139], 'name': 'Agreste'}",27
2015,"{'latlong': [-36.44705331304556, -8.597091004271139], 'name': 'Agreste'}","{'latlong': [-35.45993547543438, -8.237977282077168], 'name': 'Metropolitana'}",229
2015,"{'latlong': [-36.44705331304556, -8.597091004271139], 'name': 'Agreste'}","{'latlong': [-36.44705331304556, -8.597091004271139], 'name': 'Agreste'}",931
2015,"{'latlong': [-36.44705331304556, -8.597091004271139], 'name': 'Agreste'}","{'latlong': [-37.865288937823316, -8.306290795258281], 'name': 'Sertão'}",17
2015,"{'latlong': [-37.865288937823316, -8.306290795258281], 'name': 'Sertão'}","{'latlong': [-35.45993547543438, -8.237977282077168], 'name': 'Metropolitana'}",53
2015,"{'latlong': [-37.865288937823316, -8.306290795258281], 'name': 'Sertão'}","{'latlong': [-36.44705331304556, -8.597091004271139], 'name': 'Agreste'}",27
2015,"{'latlong': [-37.865288937823316, -8.306290795258281], 'name': 'Sertão'}","{'latlong': [-37.865288937823316, -8.306290795258281], 'name': 'Sertão'}",946
2015,"{'latlong': [-37.865288937823316, -8.306290795258281], 'name': 'Sertão'}","{'latlong': [-39.95936095628068, -8.364764974735124], 'name': 'Vale do S.Francisco e Araripe'}",4
2015,"{'latlong': [-39.95936095628068, -8.364764974735124], 'name': 'Vale do S.Francisco e Araripe'}","{'latlong': [-35.45993547543438, -8.237977282077168], 'name': 'Metropolitana'}",8
2015,"{'latlong': [-39.95936095628068, -8.364764974735124], 'name': 'Vale do S.Francisco e Araripe'}","{'latlong': [-37.865288937823316, -8.306290795258281], 'name': 'Sertão'}",3
2015,"{'latlong': [-39.95936095628068, -8.364764974735124], 'name': 'Vale do S.Francisco e Araripe'}","{'latlong': [-39.95936095628068, -8.364764974735124], 'name': 'Vale do S.Francisco e Araripe'}",603
2016,"{'latlong': [-35.45993547543438, -8.237977282077168], 'name': 'Metropolitana'}","{'latlong': [-35.45993547543438, -8.237977282077168], 'name': 'Metropolitana'}",2877
2016,"{'latlong': [-35.45993547543438, -8.237977282077168], 'name': 'Metropolitana'}","{'latlong': [-36.44705331304556, -8.597091004271139], 'name': 'Agreste'}",26
2016,"{'latlong': [-35.45993547543438, -8.237977282077168], 'name': 'Metropolitana'}","{'latlong': [-37.865288937823316, -8.306290795258281], 'name': 'Sertão'}",1
2016,"{'latlong': [-36.44705331304556, -8.597091004271139], 'name': 'Agreste'}","{'latlong': [-35.45993547543438, -8.237977282077168], 'name': 'Metropolitana'}",256
2016,"{'latlong': [-36.44705331304556, -8.597091004271139], 'name': 'Agreste'}","{'latlong': [-36.44705331304556, -8.597091004271139], 'name': 'Agreste'}",906
2016,"{'latlong': [-36.44705331304556, -8.597091004271139], 'name': 'Agreste'}","{'latlong': [-37.865288937823316, -8.306290795258281], 'name': 'Sertão'}",5
2016,"{'latlong': [-37.865288937823316, -8.306290795258281], 'name': 'Sertão'}","{'latlong': [-35.45993547543438, -8.237977282077168], 'name': 'Metropolitana'}",51
2016,"{'latlong': [-37.865288937823316, -8.306290795258281], 'name': 'Sertão'}","{'latlong': [-36.44705331304556, -8.597091004271139], 'name': 'Agreste'}",19
2016,"{'latlong': [-37.865288937823316, -8.306290795258281], 'name': 'Sertão'}","{'latlong': [-37.865288937823316, -8.306290795258281], 'name': 'Sertão'}",639
2016,"{'latlong': [-37.865288937823316, -8.306290795258281], 'name': 'Sertão'}","{'latlong': [-39.95936095628068, -8.364764974735124], 'name': 'Vale do S.Francisco e Araripe'}",5
2016,"{'latlong': [-39.95936095628068, -8.364764974735124], 'name': 'Vale do S.Francisco e Araripe'}","{'latlong': [-35.45993547543438, -8.237977282077168], 'name': 'Metropolitana'}",5
2016,"{'latlong': [-39.95936095628068, -8.364764974735124], 'name': 'Vale do S.Francisco e Araripe'}","{'latlong': [-37.865288937823316, -8.306290795258281], 'name': 'Sertão'}",2
2016,"{'latlong': [-39.95936095628068, -8.364764974735124], 'name': 'Vale do S.Francisco e Araripe'}","{'latlong': [-39.95936095628068, -8.364764974735124], 'name': 'Vale do S.Francisco e Araripe'}",567
2017,"{'latlong': [-35.45993547543438, -8.237977282077168], 'name': 'Metropolitana'}","{'latlong': [-35.45993547543438, -8.237977282077168], 'name': 'Metropolitana'}",2861
2017,"{'latlong': [-35.45993547543438, -8.237977282077168], 'name': 'Metropolitana'}","{'latlong': [-36.44705331304556, -8.597091004271139], 'name': 'Agreste'}",38
2017,"{'latlong': [-35.45993547543438, -8.237977282077168], 'name': 'Metropolitana'}","{'latlong': [-37.865288937823316, -8.306290795258281], 'name': 'Sertão'}",2
2017,"{'latlong': [-35.45993547543438, -8.237977282077168], 'name': 'Metropolitana'}","{'latlong': [-39.95936095628068, -8.364764974735124], 'name': 'Vale do S.Francisco e Araripe'}",2
2017,"{'latlong': [-36.44705331304556, -8.597091004271139], 'name': 'Agreste'}","{'latlong': [-35.45993547543438, -8.237977282077168], 'name': 'Metropolitana'}",254
2017,"{'latlong': [-36.44705331304556, -8.597091004271139], 'name': 'Agreste'}","{'latlong': [-36.44705331304556, -8.597091004271139], 'name': 'Agreste'}",890
2017,"{'latlong': [-36.44705331304556, -8.597091004271139], 'name': 'Agreste'}","{'latlong': [-37.865288937823316, -8.306290795258281], 'name': 'Sertão'}",20
2017,"{'latlong': [-37.865288937823316, -8.306290795258281], 'name': 'Sertão'}","{'latlong': [-35.45993547543438, -8.237977282077168], 'name': 'Metropolitana'}",44
2017,"{'latlong': [-37.865288937823316, -8.306290795258281], 'name': 'Sertão'}","{'latlong': [-36.44705331304556, -8.597091004271139], 'name': 'Agreste'}",24
2017,"{'latlong': [-37.865288937823316, -8.306290795258281], 'name': 'Sertão'}","{'latlong': [-37.865288937823316, -8.306290795258281], 'name': 'Sertão'}",637
2017,"{'latlong': [-37.865288937823316, -8.306290795258281], 'name': 'Sertão'}","{'latlong': [-39.95936095628068, -8.364764974735124], 'name': 'Vale do S.Francisco e Araripe'}",5
2017,"{'latlong': [-39.95936095628068, -8.364764974735124], 'name': 'Vale do S.Francisco e Araripe'}","{'latlong': [-35.45993547543438, -8.237977282077168], 'name': 'Metropolitana'}",2
2017,"{'latlong': [-39.95936095628068, -8.364764974735124], 'name': 'Vale do S.Francisco e Araripe'}","{'latlong': [-37.865288937823316, -8.306290795258281], 'name': 'Sertão'}",1
2017,"{'latlong': [-39.95936095628068, -8.364764974735124], 'name': 'Vale do S.Francisco e Araripe'}","{'latlong': [-39.95936095628068, -8.364764974735124], 'name': 'Vale do S.Francisco e Araripe'}",636
2018,"{'latlong': [-35.45993547543438, -8.237977282077168], 'name': 'Metropolitana'}","{'latlong': [-35.45993547543438, -8.237977282077168], 'name': 'Metropolitana'}",2942
2018,"{'latlong': [-35.45993547543438, -8.237977282077168], 'name': 'Metropolitana'}","{'latlong': [-36.44705331304556, -8.597091004271139], 'name': 'Agreste'}",17
2018,"{'latlong': [-35.45993547543438, -8.237977282077168], 'name': 'Metropolitana'}","{'latlong': [-37.865288937823316, -8.306290795258281], 'name': 'Sertão'}",4
2018,"{'latlong': [-35.45993547543438, -8.237977282077168], 'name': 'Metropolitana'}","{'latlong': [-39.95936095628068, -8.364764974735124], 'name': 'Vale do S.Francisco e Araripe'}",2
2018,"{'latlong': [-36.44705331304556, -8.597091004271139], 'name': 'Agreste'}","{'latlong': [-35.45993547543438, -8.237977282077168], 'name': 'Metropolitana'}",214
2018,"{'latlong': [-36.44705331304556, -8.597091004271139], 'name': 'Agreste'}","{'latlong': [-36.44705331304556, -8.597091004271139], 'name': 'Agreste'}",979
2018,"{'latlong': [-36.44705331304556, -8.597091004271139], 'name': 'Agreste'}","{'latlong': [-37.865288937823316, -8.306290795258281], 'name': 'Sertão'}",21
2018,"{'latlong': [-37.865288937823316, -8.306290795258281], 'name': 'Sertão'}","{'latlong': [-35.45993547543438, -8.237977282077168], 'name': 'Metropolitana'}",68
2018,"{'latlong': [-37.865288937823316, -8.306290795258281], 'name': 'Sertão'}","{'latlong': [-36.44705331304556, -8.597091004271139], 'name': 'Agreste'}",12
2018,"{'latlong': [-37.865288937823316, -8.306290795258281], 'name': 'Sertão'}","{'latlong': [-37.865288937823316, -8.306290795258281], 'name': 'Sertão'}",752
2018,"{'latlong': [-37.865288937823316, -8.306290795258281], 'name': 'Sertão'}","{'latlong': [-39.95936095628068, -8.364764974735124], 'name': 'Vale do S.Francisco e Araripe'}",3
2018,"{'latlong': [-39.95936095628068, -8.364764974735124], 'name': 'Vale do S.Francisco e Araripe'}","{'latlong': [-35.45993547543438, -8.237977282077168], 'name': 'Metropolitana'}",10
2018,"{'latlong': [-39.95936095628068, -8.364764974735124], 'name': 'Vale do S.Francisco e Araripe'}","{'latlong': [-37.865288937823316, -8.306290795258281], 'name': 'Sertão'}",3
2018,"{'latlong': [-39.95936095628068, -8.364764974735124], 'name': 'Vale do S.Francisco e Araripe'}","{'latlong': [-39.95936095628068, -8.364764974735124], 'name': 'Vale do S.Francisco e Araripe'}",543
2019,"{'latlong': [-35.45993547543438, -8.237977282077168], 'name': 'Metropolitana'}","{'latlong': [-35.45993547543438, -8.237977282077168], 'name': 'Metropolitana'}",3030
2019,"{'latlong': [-35.45993547543438, -8.237977282077168], 'name': 'Metropolitana'}","{'latlong': [-36.44705331304556, -8.597091004271139], 'name': 'Agreste'}",21
2019,"{'latlong': [-35.45993547543438, -8.237977282077168], 'name': 'Metropolitana'}","{'latlong': [-37.865288937823316, -8.306290795258281], 'name': 'Sertão'}",2
2019,"{'latlong': [-36.44705331304556, -8.597091004271139], 'name': 'Agreste'}","{'latlong': [-35.45993547543438, -8.237977282077168], 'name': 'Metropolitana'}",197
2019,"{'latlong': [-36.44705331304556, -8.597091004271139], 'name': 'Agreste'}","{'latlong': [-36.44705331304556, -8.597091004271139], 'name': 'Agreste'}",927
2019,"{'latlong': [-36.44705331304556, -8.597091004271139], 'name': 'Agreste'}","{'latlong': [-37.865288937823316, -8.306290795258281], 'name': 'Sertão'}",30
2019,"{'latlong': [-37.865288937823316, -8.306290795258281], 'name': 'Sertão'}","{'latlong': [-35.45993547543438, -8.237977282077168], 'name': 'Metropolitana'}",55
2019,"{'latlong': [-37.865288937823316, -8.306290795258281], 'name': 'Sertão'}","{'latlong': [-36.44705331304556, -8.597091004271139], 'name': 'Agreste'}",21
2019,"{'latlong': [-37.865288937823316, -8.306290795258281], 'name': 'Sertão'}","{'latlong': [-37.865288937823316, -8.306290795258281], 'name': 'Sertão'}",699
2019,"{'latlong': [-39.95936095628068, -8.364764974735124], 'name': 'Vale do S.Francisco e Araripe'}","{'latlong': [-35.45993547543438, -8.237977282077168], 'name': 'Metropolitana'}",8
2019,"{'latlong': [-39.95936095628068, -8.364764974735124], 'name': 'Vale do S.Francisco e Araripe'}","{'latlong': [-36.44705331304556, -8.597091004271139], 'name': 'Agreste'}",1
2019,"{'latlong': [-39.95936095628068, -8.364764974735124], 'name': 'Vale do S.Francisco e Araripe'}","{'latlong': [-37.865288937823316, -8.306290795258281], 'name': 'Sertão'}",8
2019,"{'latlong': [-39.95936095628068, -8.364764974735124], 'name': 'Vale do S.Francisco e Araripe'}","{'latlong': [-39.95936095628068, -8.364764974735124], 'name': 'Vale do S.Francisco e Araripe'}",506
2020,"{'latlong': [-35.45993547543438, -8.237977282077168], 'name': 'Metropolitana'}","{'latlong': [-35.45993547543438, -8.237977282077168], 'name': 'Metropolitana'}",1128
2020,"{'latlong': [-35.45993547543438, -8.237977282077168], 'name': 'Metropolitana'}","{'latlong': [-36.44705331304556, -8.597091004271139], 'name': 'Agreste'}",9
2020,"{'latlong': [-35.45993547543438, -8.237977282077168], 'name': 'Metropolitana'}","{'latlong': [-37.865288937823316, -8.306290795258281], 'name': 'Sertão'}",1
2020,"{'latlong': [-36.44705331304556, -8.597091004271139], 'name': 'Agreste'}","{'latlong': [-35.45993547543438, -8.237977282077168], 'name': 'Metropolitana'}",63
2020,"{'latlong': [-36.44705331304556, -8.597091004271139], 'name': 'Agreste'}","{'latlong': [-36.44705331304556, -8.597091004271139], 'name': 'Agreste'}",349
2020,"{'latlong': [-36.44705331304556, -8.597091004271139], 'name': 'Agreste'}","{'latlong': [-37.865288937823316, -8.306290795258281], 'name': 'Sertão'}",7
2020,"{'latlong': [-37.865288937823316, -8.306290795258281], 'name': 'Sertão'}","{'latlong': [-35.45993547543438, -8.237977282077168], 'name': 'Metropolitana'}",18
2020,"{'latlong': [-37.865288937823316, -8.306290795258281], 'name': 'Sertão'}","{'latlong': [-36.44705331304556, -8.597091004271139], 'name': 'Agreste'}",13
2020,"{'latlong': [-37.865288937823316, -8.306290795258281], 'name': 'Sertão'}","{'latlong': [-37.865288937823316, -8.306290795258281], 'name': 'Sertão'}",241
2020,"{'latlong': [-37.865288937823316, -8.306290795258281], 'name': 'Sertão'}","{'latlong': [-39.95936095628068, -8.364764974735124], 'name': 'Vale do S.Francisco e Araripe'}",1
2020,"{'latlong': [-39.95936095628068, -8.364764974735124], 'name': 'Vale do S.Francisco e Araripe'}","{'latlong': [-35.45993547543438, -8.237977282077168], 'name': 'Metropolitana'}",2
2020,"{'latlong': [-39.95936095628068, -8.364764974735124], 'name': 'Vale do S.Francisco e Araripe'}","{'latlong': [-37.865288937823316, -8.306290795258281], 'name': 'Sertão'}",3
2020,"{'latlong': [-39.95936095628068, -8.364764974735124], 'name': 'Vale do S.Francisco e Araripe'}","{'latlong': [-39.95936095628068, -8.364764974735124], 'name': 'Vale do S.Francisco e Araripe'}",164
