year,name,self_hospitalizations,to_hospitalizations,from_hospitalizations,lifo,lofi
1994,10ª CRS,3635,3651,3788,0.9956176390030129,0.9596092925026399
1994,11ª CRS,1593,1632,1790,0.9761029411764706,0.8899441340782123
1994,12ª CRS,1406,1418,1490,0.9915373765867419,0.9436241610738255
1994,13ª CRS,1984,2003,2133,0.9905142286570144,0.9301453352086263
1994,14ª CRS,1879,1908,1956,0.9848008385744235,0.9606339468302658
1994,15ª  CRS,1158,1204,1420,0.9617940199335548,0.8154929577464789
1994,16ª CRS,2743,2802,3044,0.9789436117059244,0.9011169513797634
1994,17ª CRS,1809,1922,1925,0.941207075962539,0.9397402597402598
1994,18ª CRS,1239,1247,1625,0.9935846030473136,0.7624615384615384
1994,19ª CRS,1740,1891,1960,0.9201480698043363,0.8877551020408163
1994,1º CRS,15686,18505,15775,0.8476627938395028,0.9943581616481775
1994,2ª CRS,3796,3855,5070,0.9846952010376135,0.7487179487179487
1994,3ª CRS,4832,4909,4925,0.9843145243430433,0.9811167512690355
1994,4ª CRS,2724,2885,2805,0.9441941074523397,0.9711229946524064
1994,5ª CRS,5315,5509,5692,0.9647848974405518,0.9337666900913563
1994,6ª CRS,3394,3788,3546,0.895987328405491,0.9571347997743936
1994,7ª CRS,1379,1390,1439,0.9920863309352518,0.9583043780403058
1994,8ª CRS,1693,1693,1814,1.0,0.9332965821389195
1994,9ª CRS,657,682,697,0.9633431085043989,0.9426111908177905
1995,10ª CRS,43602,43830,45380,0.994798083504449,0.9608197443807844
1995,11ª CRS,17480,17869,19463,0.9782304549778946,0.8981143708575245
1995,12ª CRS,16797,16947,17910,0.9911488759072402,0.93785594639866
1995,13ª CRS,23166,23476,24875,0.9867950247060828,0.9312964824120603
1995,14ª CRS,20274,20683,20959,0.9802253058067012,0.9673171429934634
1995,15ª  CRS,12541,12956,15294,0.9679685087990121,0.8199947691905323
1995,16ª CRS,27838,28499,30921,0.9768062037264466,0.9002942983732738
1995,17ª CRS,19960,21168,20956,0.9429327286470144,0.9524718457720939
1995,18ª CRS,12839,12935,17096,0.9925782759953614,0.7509943846513805
1995,19ª CRS,18464,20079,20726,0.9195677075551572,0.8908617195792724
1995,1º CRS,214521,244073,215362,0.8789214702158781,0.996094947112304
1995,2ª CRS,41099,41889,54286,0.9811406335792213,0.757082857458645
1995,3ª CRS,58708,59678,59701,0.9837461040919602,0.9833671127786804
1995,4ª CRS,36344,38095,37173,0.954035962724767,0.9776988674575633
1995,5ª CRS,57716,59762,61965,0.9657641979853419,0.9314290325183572
1995,6ª CRS,44113,48340,45866,0.9125568887050062,0.9617799677320892
1995,7ª CRS,15793,15906,16415,0.9928957626053062,0.9621078282059092
1995,8ª CRS,16937,17059,18501,0.9928483498446568,0.915464028971407
1995,9ª CRS,7660,7848,8243,0.9760448521916412,0.9292733228193619
1996,10ª CRS,45576,46284,47302,0.9847031371532279,0.9635110566149423
1996,11ª CRS,17981,18401,19897,0.977175153524265,0.9037040759913555
1996,12ª CRS,20905,21050,22220,0.9931116389548693,0.9408190819081909
1996,13ª CRS,22248,22492,24127,0.9891516983816468,0.9221204459733908
1996,14ª CRS,20479,20947,21293,0.9776578985057526,0.9617714741933969
1996,15ª  CRS,13555,14070,16656,0.9633972992181947,0.8138208453410183
1996,16ª CRS,28161,28669,31265,0.9822805120513447,0.9007196545658084
1996,17ª CRS,20411,21706,21333,0.9403390767529716,0.9567805746964796
1996,18ª CRS,14344,14467,18715,0.9914978917536462,0.7664440288538605
1996,19ª CRS,19251,20849,21925,0.9233536380641757,0.8780387685290764
1996,1º CRS,223760,255341,224692,0.8763183350891552,0.9958520997632314
1996,2ª CRS,40877,41819,54919,0.9774743537626438,0.7443143538666035
1996,3ª CRS,67799,68776,69005,0.9857944631848319,0.9825230055793058
1996,4ª CRS,40562,42463,41692,0.955231613404611,0.972896478940804
1996,5ª CRS,50715,52890,55006,0.9588769143505389,0.9219903283278188
1996,6ª CRS,49340,53587,51168,0.9207457032489224,0.9642745465916197
1996,7ª CRS,15940,16039,16632,0.9938275453581894,0.9583934583934584
1996,8ª CRS,16296,16515,17986,0.9867393278837421,0.906038029578561
1996,9ª CRS,9027,9202,9734,0.9809823951314931,0.9273679884939388
1997,10ª CRS,46309,46916,48006,0.9870619831187655,0.9646502520518269
1997,11ª CRS,17878,18072,19923,0.9892651615759186,0.8973548160417608
1997,12ª CRS,20893,21145,22164,0.9880822889572003,0.9426547554593033
1997,13ª CRS,20867,21060,22770,0.9908357075023742,0.9164251207729469
1997,14ª CRS,20050,20522,20907,0.9770002923691647,0.9590089443726981
1997,15ª  CRS,13935,14548,16794,0.9578636238658235,0.8297606287959985
1997,16ª CRS,26927,27500,29823,0.9791636363636363,0.90289373973108
1997,17ª CRS,19773,21168,20695,0.9340986394557823,0.9554481758878957
1997,18ª CRS,16390,16606,20715,0.9869926532578586,0.791214096065653
1997,19ª CRS,19664,21223,22256,0.9265419591952128,0.8835370237239396
1997,1º CRS,216854,246651,217697,0.8791936785174194,0.9961276453051718
1997,2ª CRS,42582,43588,55832,0.9769202532807195,0.7626808998423843
1997,3ª CRS,69202,70154,70626,0.9864298543204949,0.9798374536289751
1997,4ª CRS,43127,44882,44319,0.960897464462368,0.9731040862835353
1997,5ª CRS,48363,50586,52459,0.9560550349899182,0.9219199755999924
1997,6ª CRS,45294,49621,46948,0.9127990165454143,0.9647695322484451
1997,7ª CRS,15556,15621,16176,0.9958389347673005,0.9616716122650841
1997,8ª CRS,15551,15863,17011,0.9803315892328059,0.9141731820586679
1997,9ª CRS,8953,9106,9711,0.9831978915001098,0.9219441870044279
1998,10ª CRS,47501,48070,49136,0.98816309548575,0.9667250081406707
1998,11ª CRS,17968,18120,19747,0.9916114790286976,0.9099103661315643
1998,12ª CRS,20499,20718,22180,0.9894294816101941,0.9242110009017133
1998,13ª CRS,25135,25276,27224,0.9944215856939389,0.9232662356744049
1998,14ª CRS,19862,20729,20828,0.9581745380867384,0.9536201267524487
1998,15ª  CRS,12452,13091,15406,0.9511878389733405,0.8082565234324289
1998,16ª CRS,28308,29262,31267,0.9673979905679722,0.9053634822656474
1998,17ª CRS,19428,21207,20482,0.9161126043287594,0.9485401816228884
1998,18ª CRS,17794,18027,22143,0.9870749431408443,0.8035948155173193
1998,19ª CRS,17787,19026,20456,0.934878587196468,0.8695248337895972
1998,1º CRS,207493,236725,208663,0.8765149434998416,0.9943928727182108
1998,2ª CRS,46040,47138,59439,0.9767066909924053,0.7745756153367318
1998,3ª CRS,69808,71189,71254,0.9806009355377937,0.9797064024475819
1998,4ª CRS,45208,46946,46299,0.9629787415328249,0.9764357761506728
1998,5ª CRS,50891,53939,55141,0.9434917221305549,0.9229248653452059
1998,6ª CRS,46636,50659,48529,0.9205866677194575,0.9609923962991201
1998,7ª CRS,15314,15386,15898,0.9953204211620954,0.9632658195999497
1998,8ª CRS,16293,16671,17850,0.9773258952672306,0.9127731092436975
1998,9ª CRS,10604,10969,11206,0.9667244051417632,0.9462787792254149
1999,10ª CRS,47814,48262,49632,0.9907173345489205,0.9633704061895552
1999,11ª CRS,18088,18224,20219,0.9925373134328358,0.8946040852663336
1999,12ª CRS,20544,20916,22672,0.9822145725760184,0.9061397318278053
1999,13ª CRS,25900,26103,28512,0.9922231161169214,0.9083894500561167
1999,14ª CRS,20416,21029,21617,0.9708497788767892,0.9444418744506639
1999,15ª  CRS,12169,12981,14813,0.9374470379785841,0.8215081347465064
1999,16ª CRS,28271,29531,31497,0.957332972130981,0.8975775470679748
1999,17ª CRS,19720,21736,20794,0.9072506440927494,0.9483504857170337
1999,18ª CRS,18563,18828,22637,0.9859252177607818,0.8200291558068649
1999,19ª CRS,17425,18425,20339,0.9457259158751696,0.8567284527262894
1999,1º CRS,219989,249621,221093,0.8812920387307157,0.9950066261708873
1999,2ª CRS,45112,46096,59504,0.9786532454009025,0.7581339069642377
1999,3ª CRS,72587,74667,74006,0.9721429815045468,0.9808258789827852
1999,4ª CRS,40967,42921,42234,0.95447449966217,0.9700004735521144
1999,5ª CRS,55241,59593,59058,0.9269712885741614,0.9353686206779775
1999,6ª CRS,49243,53764,51456,0.9159102745331449,0.956992381840796
1999,7ª CRS,14994,15052,15676,0.9961466914695721,0.9564940035723399
1999,8ª CRS,16743,17008,18389,0.9844190968955786,0.910489966827995
1999,9ª CRS,11583,11817,12426,0.9801980198019802,0.9321583775953646
2000,10ª CRS,45416,45831,47458,0.9909449935633087,0.956972480930507
2000,11ª CRS,16059,16262,18111,0.9875169105891034,0.8866986914030147
2000,12ª CRS,18271,18580,20331,0.9833692142088267,0.8986768973488761
2000,13ª CRS,25807,26009,28238,0.9922334576492753,0.9139103335930306
2000,14ª CRS,19001,19696,20240,0.9647136474411048,0.9387845849802372
2000,15ª  CRS,11023,11907,13859,0.9257579575039893,0.7953676311422181
2000,16ª CRS,27609,28365,31731,0.9733474352194607,0.8700954902146166
2000,17ª CRS,17849,19911,19005,0.8964391542363518,0.9391739016048408
2000,18ª CRS,17579,17955,22487,0.9790587580061264,0.7817405612131454
2000,19ª CRS,15948,16774,19393,0.9507571241206629,0.8223585829938638
2000,1º CRS,246142,281184,247423,0.8753769773529078,0.9948226316874341
2000,2ª CRS,43901,44900,61145,0.977750556792873,0.7179818464306158
2000,3ª CRS,68784,70992,70236,0.9688979039891819,0.979326840936272
2000,4ª CRS,34228,36078,35581,0.9487222129829813,0.9619740872937804
2000,5ª CRS,54950,59604,58896,0.9219179920810684,0.9330005433306167
2000,6ª CRS,48663,53899,50857,0.9028553405443515,0.9568594293804196
2000,7ª CRS,14801,14904,15609,0.9930891035963499,0.9482349926324556
2000,8ª CRS,15183,15578,17016,0.9746437283348311,0.892277856135402
2000,9ª CRS,10735,11023,11836,0.9738728113943572,0.9069787090233187
2001,10ª CRS,44976,45497,46988,0.9885486955183859,0.9571805567378905
2001,11ª CRS,15291,15452,17340,0.9895806368107688,0.8818339100346021
2001,12ª CRS,17654,17983,19712,0.9817049435578046,0.8955965909090909
2001,13ª CRS,25727,25896,28011,0.9934738955823293,0.9184606047624148
2001,14ª CRS,18580,19098,19786,0.9728767410200021,0.9390478115839482
2001,15ª  CRS,11510,12498,14294,0.9209473515762522,0.8052329648803694
2001,16ª CRS,25315,26021,29393,0.9728680680988433,0.8612594835505052
2001,17ª CRS,16404,18496,17695,0.8868944636678201,0.9270415371573891
2001,18ª CRS,16668,16975,21416,0.9819145802650957,0.7782966006723945
2001,19ª CRS,16449,17293,20100,0.9511941247903776,0.8183582089552239
2001,1º CRS,241454,275005,242228,0.8779985818439665,0.9968046633750021
2001,2ª CRS,43634,44659,60005,0.9770482993349605,0.7271727356053662
2001,3ª CRS,69047,71097,70515,0.9711661532835422,0.9791817343827555
2001,4ª CRS,34763,36587,36281,0.9501462268018696,0.9581599184145971
2001,5ª CRS,56510,59800,60049,0.9449832775919732,0.9410647970823828
2001,6ª CRS,46672,52572,48543,0.8877729589895762,0.9614568526873082
2001,7ª CRS,15080,15192,15840,0.9926276987888363,0.952020202020202
2001,8ª CRS,15459,15823,17302,0.976995512861025,0.89348052248295
2001,9ª CRS,10338,10737,11183,0.9628387817826208,0.9244388804435304
2002,10ª CRS,44349,45140,46222,0.982476739034116,0.9594781705681278
2002,11ª CRS,15722,15833,18032,0.9929893260910756,0.8718944099378882
2002,12ª CRS,18005,18303,20251,0.9837185160902584,0.8890918966964594
2002,13ª CRS,23688,23915,25932,0.9905080493414176,0.9134659879685331
2002,14ª CRS,17656,18119,18780,0.974446713394779,0.9401490947816826
2002,15ª  CRS,10999,12217,13714,0.9003028566751248,0.8020271255651159
2002,16ª CRS,24142,24995,28406,0.965873174634927,0.8498908681264522
2002,17ª CRS,15047,17151,16462,0.877324937321439,0.9140444660430082
2002,18ª CRS,17704,17969,22843,0.9852523790973343,0.775029549533774
2002,19ª CRS,14462,15502,18143,0.9329118823377629,0.7971118337650884
2002,1º CRS,235842,269480,236603,0.8751744099747663,0.996783641796596
2002,2ª CRS,41253,42103,58033,0.979811414863549,0.7108541691796048
2002,3ª CRS,65948,67823,67410,0.9723545110065906,0.9783118231716362
2002,4ª CRS,36334,38310,38240,0.9484207778647873,0.9501569037656904
2002,5ª CRS,58393,61835,61576,0.944335732190507,0.9483077822528257
2002,6ª CRS,44681,50833,46452,0.8789762555820038,0.9618746232670283
2002,7ª CRS,14761,14941,15649,0.9879526136135466,0.9432551600741261
2002,8ª CRS,15334,15781,17224,0.971674798808694,0.8902693915466791
2002,9ª CRS,10082,10611,10889,0.9501460748280087,0.925888511341721
2003,10ª CRS,39313,39958,41062,0.9838580509535012,0.9574058740441284
2003,11ª CRS,14939,15012,17646,0.9951372235544897,0.8465941289810722
2003,12ª CRS,15804,16049,18017,0.9847342513552246,0.8771715601931509
2003,13ª CRS,21798,22215,23856,0.9812288993923025,0.9137323943661971
2003,14ª CRS,16891,17263,17982,0.978451022417888,0.9393282171059949
2003,15ª  CRS,9545,10555,12502,0.9043107531975367,0.7634778435450328
2003,16ª CRS,24078,25129,28307,0.9581758128059215,0.8506023245133713
2003,17ª CRS,14612,16559,16176,0.8824204360166676,0.9033135509396637
2003,18ª CRS,17875,18218,23173,0.9811724667910857,0.7713718551762827
2003,19ª CRS,13722,14981,17419,0.915960216273947,0.7877604914174178
2003,1º CRS,240184,273839,241010,0.8770993174821702,0.9965727563171652
2003,2ª CRS,38387,39267,55394,0.9775893243690631,0.69298118929848
2003,3ª CRS,56552,58820,58037,0.9614416865011901,0.9744128745455485
2003,4ª CRS,35904,37894,37293,0.9474850899878609,0.9627544043118011
2003,5ª CRS,59780,63129,64226,0.9469498962441983,0.930775698315324
2003,6ª CRS,42711,49754,44655,0.8584435422277605,0.9564662411823984
2003,7ª CRS,13891,14097,14665,0.9853869617649145,0.9472212751449028
2003,8ª CRS,13524,14153,15360,0.9555571256977319,0.88046875
2003,9ª CRS,9453,10278,10390,0.9197314652656159,0.9098171318575553
2004,10ª CRS,36939,37572,38614,0.9831523474928138,0.9566219505878697
2004,11ª CRS,14504,14588,17081,0.9942418426103646,0.8491306129617704
2004,12ª CRS,15139,15380,17460,0.9843302990897269,0.8670675830469645
2004,13ª CRS,22740,22945,24629,0.9910655916321639,0.9233017986925982
2004,14ª CRS,16518,16885,17737,0.9782647320106603,0.9312736088402774
2004,15ª  CRS,9650,10509,12944,0.9182605385859739,0.7455191594561187
2004,16ª CRS,24622,25954,28701,0.9486784310703552,0.8578795163931571
2004,17ª CRS,14173,16049,15645,0.88310798180572,0.9059124320869287
2004,18ª CRS,17778,18187,23540,0.9775114092483642,0.7552251486830927
2004,19ª CRS,14207,15768,17470,0.901002029426687,0.8132226674298798
2004,1º CRS,246357,282205,247189,0.8729717758367145,0.9966341544324383
2004,2ª CRS,36187,36864,54778,0.9816351996527778,0.6606119244952353
2004,3ª CRS,58974,60693,60497,0.9716771291582226,0.9748251979436997
2004,4ª CRS,35106,36838,36581,0.9529833324284706,0.9596785216369154
2004,5ª CRS,60382,63570,64312,0.9498505584395155,0.9388916531906953
2004,6ª CRS,40663,48182,42722,0.8439458719023701,0.9518046907916297
2004,7ª CRS,13077,13299,13911,0.98330701556508,0.9400474444684063
2004,8ª CRS,14237,14741,16266,0.9658096465640051,0.8752612812000492
2004,9ª CRS,9211,10033,10185,0.9180703677863052,0.9043691703485518
2005,10ª CRS,36163,36820,37976,0.9821564367191744,0.9522593216768486
2005,11ª CRS,14396,14563,16521,0.9885325825722722,0.8713758247079475
2005,12ª CRS,14593,14878,16804,0.9808441994891787,0.8684241847179243
2005,13ª CRS,21912,22179,23920,0.9879615852833762,0.9160535117056856
2005,14ª CRS,16092,16453,17526,0.9780587126967726,0.9181787059226293
2005,15ª  CRS,8849,9599,12722,0.9218668611313678,0.6955667347901273
2005,16ª CRS,22714,24314,26570,0.934194291354775,0.854873917952578
2005,17ª CRS,14817,16442,16353,0.9011677411507116,0.9060722803155384
2005,18ª CRS,16590,16919,22256,0.9805544062887878,0.7454169662113588
2005,19ª CRS,13710,15669,16806,0.8749760673942178,0.8157800785433774
2005,1º CRS,240398,275449,241186,0.8727495834074548,0.9967328120205982
2005,2ª CRS,34471,35058,52727,0.9832563181014319,0.6537637263641018
2005,3ª CRS,57433,58723,58895,0.9780324574698159,0.9751761609644283
2005,4ª CRS,33084,34762,34698,0.9517288993728784,0.9534843506830365
2005,5ª CRS,58167,60175,61128,0.9666306605733278,0.9515606595995288
2005,6ª CRS,41892,50098,43455,0.8362010459499382,0.9640317569899897
2005,7ª CRS,12404,12605,13238,0.9840539468464895,0.9369995467593292
2005,8ª CRS,13870,14250,15803,0.9733333333333334,0.877681452888692
2005,9ª CRS,8975,9645,10017,0.9305339554173147,0.8959768393730658
2006,10ª CRS,38676,39440,40607,0.9806288032454361,0.9524466225035092
2006,11ª CRS,15596,15762,17930,0.9894683415810176,0.8698271054099275
2006,12ª CRS,15744,16049,18365,0.9809957006667082,0.8572828750340321
2006,13ª CRS,20785,21046,23281,0.9875985935569704,0.8927881104763541
2006,14ª CRS,16702,17007,18072,0.9820662080319869,0.9241921204072598
2006,15ª  CRS,9426,10183,13882,0.9256604144161839,0.6790087883590261
2006,16ª CRS,24042,26053,27794,0.922811192568994,0.8650068360077715
2006,17ª CRS,15865,17581,17370,0.9023946305670895,0.91335636154289
2006,18ª CRS,16465,16760,22197,0.9823985680190931,0.7417669054376718
2006,19ª CRS,14839,17246,18090,0.8604314043836252,0.8202874516307352
2006,1º CRS,241679,277833,242579,0.8698714695518531,0.9962898684552249
2006,2ª CRS,34898,35326,53442,0.9878842778689917,0.6530069982410838
2006,3ª CRS,59403,60837,60961,0.9764288179890527,0.974442676465281
2006,4ª CRS,35172,36780,36834,0.9562805872756933,0.9548786447304122
2006,5ª CRS,61686,63611,64537,0.9697379384068793,0.9558237910036104
2006,6ª CRS,44125,52994,45873,0.8326414311054081,0.9618947965033898
2006,7ª CRS,12279,12520,13149,0.9807507987220447,0.9338352726443075
2006,8ª CRS,14374,14923,16551,0.963211150572941,0.8684671621050087
2006,9ª CRS,9407,10137,10574,0.9279865838019138,0.8896349536599205
2007,10ª CRS,38002,38659,40058,0.9830052510411547,0.9486744220879725
2007,11ª CRS,16462,16798,18573,0.9799976187641386,0.8863403865826738
2007,12ª CRS,15374,15573,18247,0.9872214730623515,0.8425494601852359
2007,13ª CRS,22075,22322,24591,0.9889346832721082,0.8976861453377252
2007,14ª CRS,17453,17853,19023,0.9775948019940626,0.9174683278136992
2007,15ª  CRS,9557,10263,13960,0.9312091980902271,0.6845988538681949
2007,16ª CRS,24186,26101,27736,0.9266311635569519,0.8720074992789155
2007,17ª CRS,15753,17751,17440,0.8874429609599459,0.9032683486238532
2007,18ª CRS,16207,16473,22267,0.9838523644752019,0.7278483855032111
2007,19ª CRS,15347,17926,18564,0.8561307597902488,0.8267076061193708
2007,1º CRS,233568,268236,234375,0.8707556032747282,0.9965568
2007,2ª CRS,32109,32568,49822,0.9859064112011791,0.6444743286098511
2007,3ª CRS,60404,61853,61968,0.9765734887555979,0.9747611670539633
2007,4ª CRS,33526,35166,34804,0.9533640448160154,0.9632800827491093
2007,5ª CRS,62886,64663,65439,0.9725190603590925,0.9609865676431486
2007,6ª CRS,45553,54081,46997,0.8423106081618313,0.9692746345511416
2007,7ª CRS,11986,12197,12899,0.9827006640977289,0.9292193193270796
2007,8ª CRS,15565,16239,17624,0.9584949812180553,0.8831706763504312
2007,9ª CRS,9916,10658,10993,0.9303809345092888,0.9020285636314018
2008,10ª CRS,37662,38365,40064,0.9816760067770103,0.9400459265175719
2008,11ª CRS,16093,16673,17871,0.9652132189767888,0.9005092048570309
2008,12ª CRS,14629,14861,17567,0.9843886683264922,0.8327545966869699
2008,13ª CRS,22497,22852,25713,0.9844652546823035,0.8749270796873178
2008,14ª CRS,17366,17703,19371,0.9809636784725753,0.8964947602085592
2008,15ª  CRS,8737,9502,13239,0.9194906335508314,0.6599441045396178
2008,16ª CRS,25889,27979,29919,0.9253011186961649,0.8653029847254253
2008,17ª CRS,15369,17680,16932,0.8692873303167421,0.9076895818568391
2008,18ª CRS,16056,16351,22884,0.9819582900128433,0.7016255899318301
2008,19ª CRS,13824,16281,17467,0.8490878938640133,0.7914352779527108
2008,1º CRS,242139,280824,242849,0.8622446799418854,0.997076372560727
2008,2ª CRS,34270,34888,54157,0.9822861728961247,0.6327898517273852
2008,3ª CRS,59326,61579,61151,0.9634128517838874,0.9701558437310919
2008,4ª CRS,36853,38656,38245,0.9533578228476821,0.9636030853706367
2008,5ª CRS,67933,69484,70597,0.9776783144320995,0.9622646854682211
2008,6ª CRS,46593,55695,47914,0.8365741987611096,0.9724297700045915
2008,7ª CRS,11428,11649,12562,0.9810284144561765,0.9097277503582232
2008,8ª CRS,14312,15109,16852,0.9472499834535707,0.8492760503204367
2008,9ª CRS,9542,10174,10951,0.9378808728130529,0.8713359510546982
2009,10ª CRS,37407,37976,39913,0.9850168527491047,0.937213439230326
2009,11ª CRS,16334,16996,18254,0.9610496587432337,0.8948175742303057
2009,12ª CRS,15082,15451,17636,0.9761180506116109,0.855182581084146
2009,13ª CRS,22510,22892,25566,0.9833129477546741,0.8804662442306188
2009,14ª CRS,17513,17881,19288,0.9794194955539399,0.9079738697635836
2009,15ª  CRS,9006,9620,13722,0.9361746361746361,0.6563183209444687
2009,16ª CRS,24390,26192,28827,0.9312003665241295,0.8460817983140806
2009,17ª CRS,15002,17482,16570,0.8581398009381078,0.9053711526855763
2009,18ª CRS,15361,15605,22591,0.9843639859019545,0.6799610464344208
2009,19ª CRS,14474,16713,17874,0.8660324298450308,0.8097795680877252
2009,1º CRS,253346,294480,254141,0.8603164900842163,0.9968718152521632
2009,2ª CRS,34340,34880,55589,0.9845183486238532,0.6177481156343881
2009,3ª CRS,60158,62799,62332,0.9579451902100352,0.9651222486042482
2009,4ª CRS,37396,39152,38951,0.9551491622394769,0.9600780467767195
2009,5ª CRS,68676,70292,71632,0.9770101860809196,0.9587335269153451
2009,6ª CRS,46379,55596,47783,0.8342146917044392,0.9706171651005587
2009,7ª CRS,11819,12147,13009,0.9729974479295299,0.9085248673994927
2009,8ª CRS,14158,14920,16866,0.9489276139410188,0.8394402940827701
2009,9ª CRS,8518,9218,9748,0.9240616185723585,0.8738202708247845
2010,10ª CRS,34580,35226,37122,0.9816612729234089,0.9315230860406228
2010,11ª CRS,16587,17623,18640,0.9412131873120354,0.8898605150214592
2010,12ª CRS,14658,15098,17304,0.9708570671612134,0.8470873786407767
2010,13ª CRS,22173,22524,25123,0.9844166222695792,0.8825777176292641
2010,14ª CRS,17070,17362,18879,0.9831816610989518,0.9041792467821389
2010,15ª  CRS,8643,9076,13806,0.9522917584839136,0.626032159930465
2010,16ª CRS,24501,26580,28737,0.921783295711061,0.8525942165152939
2010,17ª CRS,15044,18063,16490,0.8328627581243426,0.912310491206792
2010,18ª CRS,16840,17125,23737,0.9833576642335766,0.7094409571554956
2010,19ª CRS,14177,16134,17534,0.8787033593653155,0.8085434013915821
2010,1º CRS,251707,291350,252430,0.8639334134202848,0.9971358396387118
2010,2ª CRS,32708,33222,54069,0.9845283246041779,0.6049307366513159
2010,3ª CRS,58256,61086,60124,0.9536718724421308,0.9689308761892089
2010,4ª CRS,37143,38713,38747,0.9594451476248289,0.9586032467029706
2010,5ª CRS,68875,70512,71793,0.9767840934876333,0.9593553689078322
2010,6ª CRS,46572,55960,47932,0.8322373123659756,0.971626470833681
2010,7ª CRS,11203,11441,12442,0.9791976225854383,0.9004179392380646
2010,8ª CRS,13508,14095,15947,0.9583540262504434,0.8470558725779144
2010,9ª CRS,8894,9961,10295,0.8928822407388817,0.8639145216124332
2011,10ª CRS,35298,35807,38042,0.9857849023933868,0.9278691972030914
2011,11ª CRS,17051,18034,19363,0.9454918487301763,0.8805970149253731
2011,12ª CRS,13724,14188,16771,0.9672963067380885,0.8183173334923379
2011,13ª CRS,21463,21704,24643,0.9888960560265388,0.8709572698129286
2011,14ª CRS,17239,17621,19411,0.9783213211508995,0.888104682911751
2011,15ª  CRS,8617,9125,14433,0.9443287671232877,0.5970345735467332
2011,16ª CRS,25354,27482,29467,0.9225674987264392,0.8604201309939933
2011,17ª CRS,15038,18828,16634,0.7987040577862757,0.9040519418059396
2011,18ª CRS,17415,17808,24259,0.9779312668463612,0.7178779009852013
2011,19ª CRS,14265,16250,17954,0.8778461538461538,0.7945304667483569
2011,1º CRS,244526,282510,245425,0.8655481221903649,0.9963369664867068
2011,2ª CRS,31182,31694,51701,0.9838455228118886,0.603121796483627
2011,3ª CRS,58991,61721,60896,0.9557687010903906,0.9687171571203363
2011,4ª CRS,37818,39817,39268,0.9497953135595348,0.9630742589385759
2011,5ª CRS,67116,68549,70169,0.9790952457366263,0.956490758027049
2011,6ª CRS,48806,60089,50004,0.8122285276839355,0.9760419166466683
2011,7ª CRS,11890,12166,13068,0.9773138254150913,0.9098561371288644
2011,8ª CRS,13408,14188,15702,0.945023963913166,0.853903961278818
2011,9ª CRS,9071,10192,10563,0.8900117739403454,0.8587522484142762
2012,10ª CRS,36868,37387,39591,0.9861181694171771,0.9312217423151726
2012,11ª CRS,17589,18711,20033,0.9400352733686067,0.8780012978585334
2012,12ª CRS,13606,13970,16995,0.9739441660701503,0.8005884083553987
2012,13ª CRS,24138,24631,27123,0.9799845722869555,0.8899458024554806
2012,14ª CRS,17457,17953,19447,0.9723723054642678,0.8976705918650691
2012,15ª CRS,8021,8355,14475,0.9600239377618193,0.5541278065630397
2012,16ª CRS,27689,29556,31528,0.9368317769657599,0.8782352194874398
2012,17ª CRS,15793,20065,17329,0.7870919511587341,0.911362455998615
2012,18ª CRS,22091,22660,28408,0.9748896734333627,0.7776330611095466
2012,19ª CRS,15312,17383,19380,0.8808606109417246,0.7900928792569659
2012,1ª CRS,251382,287656,252571,0.8738979892649553,0.9952924128264924
2012,2ª CRS,34239,34992,54813,0.9784807956104252,0.6246510864211045
2012,3ª CRS,58240,60372,60135,0.9646856158484065,0.9684875696349879
2012,4ª CRS,37243,39112,38624,0.9522141542237677,0.9642450289975145
2012,5ª CRS,67579,69029,70418,0.9789943357139753,0.9596836036240733
2012,6ª CRS,58336,71125,59421,0.8201898066783831,0.9817404621261844
2012,7ª CRS,12510,12894,13566,0.9702187063750581,0.9221583370190182
2012,8ª CRS,14035,14840,16141,0.9457547169811321,0.8695248125890589
2012,9ª CRS,9524,10565,11258,0.9014671083767156,0.8459761947059868
2013,Região 01,27998,31248,29113,0.8959933435739887,0.9617009583347645
2013,Região 02,7469,7959,9648,0.9384344766930519,0.7741500829187397
2013,Região 03,31647,32006,34395,0.9887833531212897,0.9201046663759267
2013,Região 04,8117,9271,10925,0.8755258332434473,0.7429748283752861
2013,Região 05,14374,15396,18971,0.9336191218498311,0.7576827789784408
2013,Região 06,15901,16239,19684,0.979185910462467,0.8078134525502947
2013,Região 07,42509,43242,52104,0.9830488876555201,0.8158490710885921
2013,Região 08,49262,55593,59292,0.886118755958484,0.8308372124401269
2013,Região 09,10438,10739,24076,0.9719713194897104,0.43354377803621863
2013,Região 10,157657,206480,160573,0.763546106160403,0.9818400353733193
2013,Região 11,20523,21085,23652,0.9733459805548969,0.8677067478437341
2013,Região 12,11588,12378,13409,0.9361770883826143,0.8641956894623014
2013,Região 13,16460,21155,18044,0.7780666509099504,0.9122145865661716
2013,Região 14,17315,17798,19441,0.9728621193392516,0.8906434854174168
2013,Região 15,19699,20235,26637,0.9735112428959724,0.7395352329466531
2013,Região 16,20690,22167,23224,0.9333694230161953,0.8908887357905615
2013,Região 17,31408,54500,32002,0.5762935779816514,0.9814386600837448
2013,Região 18,6620,6889,12268,0.9609522427057628,0.5396152592109553
2013,Região 19,5803,6135,10938,0.9458842705786471,0.5305357469372829
2013,Região 20,9564,10538,15326,0.9075725944201936,0.6240375831919613
2013,Região 21,58050,59808,60149,0.9706059390048154,0.9651033267385991
2013,Região 22,12688,12980,14549,0.9775038520801232,0.872087428689257
2013,Região 23,28638,33721,29591,0.849263070490199,0.967794261768781
2013,Região 24,5976,6046,7385,0.988422097254383,0.8092078537576168
2013,Região 25,17238,17485,20286,0.9858736059479554,0.84974859509021
2013,Região 26,9674,9936,11946,0.9736312399355878,0.8098108153356772
2013,Região 27,13955,14707,16165,0.9488678860406609,0.8632848747293536
2013,Região 28,25479,26131,28027,0.9750487926217902,0.9090876654654441
2013,Região 29,15165,18252,18219,0.8308678500986193,0.832372797628849
2013,Região 30,8363,10511,10591,0.7956426600704024,0.7896327070153905
2014,Região 01 - Verdes Campos,24904,28212,26032,0.8827449312349355,0.9566687154271666
2014,Região 02 - Entre Rios,6973,7402,9416,0.9420426911645501,0.7405480033984707
2014,Região 03 - Fronteira Oeste,32312,32724,34772,0.9874098520963207,0.9292534222937996
2014,Região 04 - Belas Praias,8743,10338,11898,0.8457148384600502,0.7348293830895949
2014,Região 05 - Bons Ventos,12231,13042,17838,0.9378162858457292,0.6856710393541877
2014,Região 06 - Vale do Paranhana e Costa Serra,18728,19185,23534,0.9761793067500651,0.7957848219597179
2014,Região 07 - Vale dos Sinos,40776,41907,51458,0.9730116686949675,0.7924132302071593
2014,Região 08 - Vale do Caí e Metropolitana,55128,63575,65062,0.8671333071175776,0.8473148688942854
2014,Região 09 - Carbonífera/Costa Doce,9802,10113,24972,0.9692475032136854,0.39251962197661383
2014,Região 10 - Capital e Vale do Gravataí,162328,214582,165977,0.7564847004874593,0.9780150261783259
2014,Região 11 - Sete Povos das Missões,20032,20765,22957,0.9647002167108114,0.8725878816918587
2014,Região 12 - Portal das Missões,11901,12523,13497,0.9503313902419548,0.8817515003334074
2014,Região 13 - Diversidade,15627,19446,17230,0.8036099969145325,0.9069645966337783
2014,Região 14 - Fronteira Noroeste,17896,18413,19761,0.9719220116222235,0.9056221851120895
2014,Região 15 - Caminho das Águas,16428,18696,20527,0.8786906290115533,0.8003117844789789
2014,Região 16 - Alto Uruguai Gaúcho,22554,24189,24519,0.9324072925710033,0.9198580692524165
2014,Região 17 - Planalto,37401,56236,38239,0.6650721957464969,0.9780852009728288
2014,Região 18 - Araucárias,7133,7334,12183,0.9725934005999455,0.585487975047197
2014,Região 19 - Botucaraí,5579,5916,10559,0.9430358350236646,0.5283644284496638
2014,Região 20 - Rota da Produção,8456,9007,15334,0.9388253580548462,0.551454284596322
2014,Região 21 - Sul,58710,60225,60783,0.9748443337484434,0.9658950693450471
2014,Região 22 - Pampa,12445,12713,13556,0.9789192165499881,0.9180436706993214
2014,Região 23 - Caxias e Hortênsias,28600,33333,29604,0.8580085800858008,0.9660856640994461
2014,Região 24 - Campos de Cima da Serra,5894,5941,7332,0.9920888739269483,0.803873431533006
2014,Região 25 - Vinhedos e Basalto,17040,17343,19843,0.9825289742259125,0.8587411177745301
2014,Região 26 - Uva Vale,8909,9290,11186,0.9589881593110872,0.7964419810477382
2014,Região 27 - Jacuí Centro,14161,14698,16875,0.9634644169274731,0.8391703703703703
2014,Região 28 - Vinte e Oito,26343,27360,28771,0.9628289473684211,0.9156094678669494
2014,Região 29 - Vales e Montanhas,14512,17081,17726,0.8495989696153621,0.8186844183684983
2014,Região 30 - Vale da Luz,8432,10483,10631,0.8043498998378327,0.7931521023422068
2015,Região 01 - Verdes Campos,27639,31917,28643,0.8659648463201429,0.9649478057466048
2015,Região 02 - Entre Rios,7352,7712,10316,0.9533195020746889,0.7126793330748352
2015,Região 03 - Fronteira Oeste,30760,31137,32984,0.9878922182612326,0.9325733689061363
2015,Região 04 - Belas Praias,8387,9746,11566,0.860558177713934,0.7251426595192807
2015,Região 05 - Bons Ventos,10257,11116,15994,0.9227240014393667,0.6413029886207328
2015,Região 06 - Vale do Paranhana e Costa Serr,16353,16903,21165,0.9674613973850795,0.7726435152374203
2015,Região 07 - Vale dos Sinos,39308,40158,50345,0.9788336072513572,0.7807726685867514
2015,Região 08 - Vale do Caí e Metropolitana,55018,64009,64103,0.8595353778374916,0.8582749637302466
2015,Região 09 - Carbonífera/Costa Doce,10452,10692,26180,0.9775533108866442,0.39923605805958745
2015,Região 10 - Capital e Vale do Gravataí,162901,214912,166011,0.7579893165574747,0.9812663016306148
2015,Região 11 - Sete Povos das Missões,19009,19655,21818,0.9671330450267107,0.8712530937757814
2015,Região 12 - Portal das Missões,10317,10721,12097,0.9623169480458913,0.8528560800198396
2015,Região 13 - Diversidade,15568,18979,17373,0.8202750408346067,0.8961031485638634
2015,Região 14 - Fronteira Noroeste,18223,18793,20259,0.9696695578140797,0.8995014561429489
2015,Região 15 - Caminho das Águas,16445,19171,19976,0.8578060612383287,0.823237885462555
2015,Região 16 - Alto Uruguai Gaúcho,20219,21254,22471,0.9513032840877012,0.8997819411686173
2015,Região 17 - Planalto,38499,57763,39278,0.6664993161712515,0.9801670146137788
2015,Região 18 - Araucárias,8033,8243,13228,0.9745238384083464,0.6072724523737526
2015,Região 19 - Botucaraí,5963,6249,10733,0.9542326772283566,0.5555762601323022
2015,Região 20 - Rota da Produção,7819,8270,14617,0.9454655380894801,0.5349250872272012
2015,Região 21 - Sul,60664,62047,62788,0.9777104453075894,0.9661718799770657
2015,Região 22 - Pampa,12696,13005,13769,0.976239907727797,0.9220713196310553
2015,Região 23 - Caxias e Hortênsias,29414,33136,30552,0.8876750362143891,0.962752029327049
2015,Região 24 - Campos de Cima da Serra,5747,5860,7198,0.980716723549488,0.7984162267296471
2015,Região 25 - Vinhedos e Basalto,17334,17923,19645,0.9671371980137253,0.8823619241537287
2015,Região 26 - Uva Vale,8234,8555,10408,0.9624780829924021,0.7911222136817833
2015,Região 27 - Jacuí Centro,15074,15567,17770,0.9683304426029421,0.8482836240855374
2015,Região 28 - Vinte e Oito,25425,26672,27788,0.953246850629874,0.9149632935079891
2015,Região 29 - Vales e Montanhas,15531,18282,18196,0.849524122087299,0.8535392393932733
2015,Região 30 - Vale da Luz,7741,9233,10409,0.8384057186180006,0.7436833509462965
2016,Região 01 - Verdes Campos,24369,27967,25290,0.871348374870383,0.963582443653618
2016,Região 02 - Entre Rios,6944,7325,9412,0.9479863481228669,0.7377815554611135
2016,Região 03 - Fronteira Oeste,29655,29995,31768,0.9886647774629105,0.9334865273230925
2016,Região 04 - Belas Praias,8266,9512,11342,0.8690075693860387,0.7287956268735672
2016,Região 05 - Bons Ventos,10440,11073,16514,0.9428339203467895,0.6321908683541237
2016,Região 06 - Vale do Paranhana e Costa Serr,14376,14890,18931,0.9654801880456683,0.7593893613649569
2016,Região 07 - Vale dos Sinos,39414,40113,49609,0.9825742278064468,0.794492934749743
2016,Região 08 - Vale do Caí e Metropolitana,49694,56724,58295,0.8760665679430224,0.8524573291019814
2016,Região 09 - Carbonífera/Costa Doce,10256,10463,24770,0.9802159992354009,0.4140492531287848
2016,Região 10 - Capital e Vale do Gravataí,159191,208502,160719,0.7634986714755734,0.9904927233245603
2016,Região 11 - Sete Povos das Missões,19208,19803,21814,0.9699540473665607,0.8805354359585588
2016,Região 12 - Portal das Missões,9252,9598,10883,0.9639508230881434,0.850133235321143
2016,Região 13 - Diversidade,15205,18547,16905,0.8198091335525961,0.8994380360839989
2016,Região 14 - Fronteira Noroeste,18263,18747,20485,0.9741825358724062,0.8915303880888455
2016,Região 15 - Caminho das Águas,15883,18626,18925,0.8527327391817889,0.8392602377807133
2016,Região 16 - Alto Uruguai Gaúcho,18823,19694,21082,0.955773331979283,0.8928469784650412
2016,Região 17 - Planalto,36687,55401,37325,0.6622082633887475,0.982906898861353
2016,Região 18 - Araucárias,7563,7786,12566,0.9713588492165425,0.6018621677542575
2016,Região 19 - Botucaraí,4912,5107,10050,0.96181711376542,0.48875621890547266
2016,Região 20 - Rota da Produção,8166,8603,14465,0.9492037661280949,0.564535084687176
2016,Região 21 - Sul,57501,58612,59469,0.9810448372346959,0.9669071280835393
2016,Região 22 - Pampa,11695,11894,12650,0.983268875063057,0.9245059288537549
2016,Região 23 - Caxias e Hortênsias,28989,33207,29984,0.8729785888517482,0.9668156350053362
2016,Região 24 - Campos de Cima da Serra,5689,5763,7151,0.987159465556134,0.7955530695007691
2016,Região 25 - Vinhedos e Basalto,15497,15916,17767,0.9736742900226187,0.8722350424945123
2016,Região 26 - Uva Vale,7606,7877,9780,0.9655960391011806,0.7777096114519427
2016,Região 27 - Jacuí Centro,14999,15497,17364,0.967864748015745,0.8637986639023266
2016,Região 28 - Vinte e Oito,24991,26145,26843,0.95586154140371,0.9310062213612488
2016,Região 29 - Vales e Montanhas,14476,17169,16920,0.8431475333449823,0.8555555555555555
2016,Região 30 - Vale da Luz,7020,8204,9682,0.855680156021453,0.7250568064449494
2017,10ª CRS,33986,34364,36205,0.9890001164008847,0.9387101229112002
2017,11ª CRS,18724,19752,21777,0.9479546375050628,0.8598062175689948
2017,12ª CRS,14492,14937,17314,0.970208207806119,0.8370105117246159
2017,13ª CRS,24689,25754,26359,0.9586472004348839,0.9366440305019158
2017,14ª CRS,18088,18636,20628,0.9705945481863061,0.8768663951910025
2017,15ª  CRS,8452,8886,15572,0.9511591267161827,0.54276907269458
2017,16ª CRS,25638,26433,30273,0.9699239586880036,0.8468932712317907
2017,17ª CRS,15469,19366,17515,0.798771042032428,0.8831858407079646
2017,18ª CRS,20515,21045,29197,0.974815870753148,0.7026406822618763
2017,19ª CRS,18677,22692,22450,0.8230653974969152,0.8319376391982183
2017,1ª CRS,254781,295579,257303,0.8619726029251064,0.9901983264866714
2017,2ª CRS,33443,35703,55075,0.9366999971991149,0.6072265093054925
2017,3ª CRS,54494,55502,56320,0.9818384923065836,0.967578125
2017,4ª CRS,36006,37704,37429,0.9549649904519414,0.9619813513585722
2017,5ª CRS,64442,65597,67661,0.9823924874613168,0.9524245872807082
2017,6ª CRS,62749,76467,63880,0.8206023513411014,0.9822949279899812
2017,7ª CRS,11068,11256,12133,0.9832977967306326,0.9122228632654743
2017,8ª CRS,15096,15645,17101,0.9649089165867689,0.8827553944213788
2017,9ª CRS,8455,9220,10230,0.9170281995661606,0.8264907135874878
2018,10ª CRS,32937,33135,35457,0.99402444545043,0.9289279972924951
2018,11ª CRS,16941,18043,20045,0.938923682314471,0.8451484160638564
2018,12ª CRS,17018,17577,20073,0.9681970757239574,0.8478055098889055
2018,13ª CRS,24314,25457,26049,0.9551007581411792,0.9333947560367001
2018,14ª CRS,18250,18885,20645,0.9663754302356368,0.8839912811818842
2018,15ª  CRS,8776,9201,16283,0.9538093685468971,0.5389670208192594
2018,16ª CRS,26219,26960,31228,0.9725148367952522,0.8395990777507365
2018,17ª CRS,15960,20154,18094,0.7919023518904436,0.8820603514977341
2018,18ª CRS,20427,20903,28578,0.9772281490695115,0.7147806004618937
2018,19ª CRS,18796,22598,23117,0.8317550225683689,0.8130812821732923
2018,1ª CRS,244609,284383,247493,0.8601393191576149,0.9883471451717827
2018,2ª CRS,33584,36262,54533,0.926148585295902,0.6158472851301047
2018,3ª CRS,54317,55319,56165,0.9818868743108154,0.9670969464969287
2018,4ª CRS,40172,42210,41624,0.9517176024638712,0.9651162790697675
2018,5ª CRS,65144,66372,68349,0.9814982221418671,0.9531083117529152
2018,6ª CRS,66111,81686,67458,0.8093308522880298,0.980032019923508
2018,7ª CRS,11254,11452,12328,0.9827104435906392,0.9128812459441921
2018,8ª CRS,14738,15378,17093,0.958382104304851,0.8622243023459896
2018,9ª CRS,8379,9183,10419,0.9124469127736033,0.8042038583357328
2019,10ª CRS,33197,33433,36935,0.9929411060927826,0.8987951807228916
2019,11ª CRS,17613,18863,20539,0.9337327042358056,0.8575393154486587
2019,12ª CRS,16435,17018,19495,0.9657421553649077,0.8430366760707874
2019,13ª CRS,24610,25860,26429,0.9516627996906419,0.9311740890688259
2019,14ª CRS,18627,19246,20884,0.9678374727216045,0.8919268339398583
2019,15ª  CRS,9335,9866,16801,0.9461787958645854,0.5556216891851675
2019,16ª CRS,25441,26068,30459,0.9759475218658892,0.8352539479300043
2019,17ª CRS,16464,21227,18548,0.7756159608046356,0.8876428725469053
2019,18ª CRS,23429,24011,32033,0.9757611094914831,0.7314019916960635
2019,19ª CRS,19638,23615,24071,0.8315900910438281,0.8158364837356155
2019,1ª CRS,253781,296596,257188,0.8556453896883303,0.9867528811608629
2019,2ª CRS,34554,37847,56855,0.9129917827040452,0.6077565737402163
2019,3ª CRS,56907,58278,58935,0.9764748275507052,0.9655892084499873
2019,4ª CRS,40300,42267,41779,0.9534625121252986,0.9645994399100026
2019,5ª CRS,67032,68278,70078,0.9817510764814436,0.9565341476640316
2019,6ª CRS,63389,77020,64591,0.8230199948065438,0.9813905962130947
2019,7ª CRS,11748,11910,12959,0.9863979848866499,0.906551431437611
2019,8ª CRS,14545,15195,17007,0.9572227706482396,0.8552360792614806
2019,9ª CRS,7952,8900,9781,0.8934831460674157,0.8130048052346386
2020,10ª CRS,12617,12779,14104,0.9873229517176618,0.8945689166193987
2020,11ª CRS,6495,6999,7426,0.9279897128161166,0.8746296795044438
2020,12ª CRS,5630,5891,6806,0.9556951281616024,0.8272112841610344
2020,13ª CRS,8290,8786,9014,0.943546551331664,0.9196804970046594
2020,14ª CRS,7029,7281,7872,0.965389369592089,0.8929115853658537
2020,15ª  CRS,3352,3551,5973,0.9439594480428048,0.5611920308052905
2020,16ª CRS,9418,9684,11195,0.9725320115654689,0.8412684234033051
2020,17ª CRS,6467,8495,7147,0.761271336080047,0.9048551839932839
2020,18ª CRS,8984,9423,12082,0.9534118645866497,0.7435854990895547
2020,19ª CRS,7026,8544,8595,0.8223314606741573,0.8174520069808028
2020,1ª CRS,95706,111997,96816,0.8545407466271417,0.9885349529003471
2020,2ª CRS,12769,13628,22040,0.9369680070443205,0.5793557168784029
2020,3ª CRS,20479,20886,21113,0.9805132624724696,0.9699711078482451
2020,4ª CRS,13790,14490,14435,0.9516908212560387,0.9553169379979217
2020,5ª CRS,25502,26076,26586,0.9779874213836478,0.9592266606484616
2020,6ª CRS,21864,26171,22301,0.8354285277597341,0.9804044661674365
2020,7ª CRS,4043,4115,4448,0.9825030376670717,0.9089478417266187
2020,8ª CRS,5100,5337,5959,0.955593029792018,0.8558482966940761
2020,9ª CRS,2599,2975,3149,0.8736134453781512,0.8253413782153064
