year,all
1994,
1995,50.67667722149227
1996,52.74697850827251
1997,57.686731705023
1998,54.81481643628716
1999,54.393884370070026
2000,58.60885078469544
2001,65.47596027287153
2002,61.77189065348401
2003,58.03452598951539
2004,58.128374999685526
2005,62.12882851987774
2006,59.55750444126967
2007,65.24784960367353
2008,64.77562987584224
2009,60.794903512185904
2010,60.35691248656367
2011,63.673242963738
2012,62.316690074033886
2013,67.47366693034937
2014,59.726983756361854
2015,60.96994710462257
2016,63.42980312474258
2017,53.693909822233174
2018,58.56806783831203
2019,52.278839027451504
2020,
