year,from,to,hospitalizations
1998,"{'latlong': [-40.37386802241421, -18.482273989187647], 'name': 'Norte'}","{'latlong': [-40.37386802241421, -18.482273989187647], 'name': 'Norte'}",36
1998,"{'latlong': [-40.37386802241421, -18.482273989187647], 'name': 'Norte'}","{'latlong': [-40.78119299861817, -20.15896969790739], 'name': 'Metropolitana'}",65
1998,"{'latlong': [-40.37386802241421, -18.482273989187647], 'name': 'Norte'}","{'latlong': [-41.27886237691346, -20.75688096507395], 'name': 'Sul'}",270
1998,"{'latlong': [-40.413051713467134, -19.36386835275335], 'name': 'Central'}","{'latlong': [-40.37386802241421, -18.482273989187647], 'name': 'Norte'}",1
1998,"{'latlong': [-40.413051713467134, -19.36386835275335], 'name': 'Central'}","{'latlong': [-40.413051713467134, -19.36386835275335], 'name': 'Central'}",66
1998,"{'latlong': [-40.413051713467134, -19.36386835275335], 'name': 'Central'}","{'latlong': [-40.78119299861817, -20.15896969790739], 'name': 'Metropolitana'}",125
1998,"{'latlong': [-40.413051713467134, -19.36386835275335], 'name': 'Central'}","{'latlong': [-41.27886237691346, -20.75688096507395], 'name': 'Sul'}",445
1998,"{'latlong': [-40.78119299861817, -20.15896969790739], 'name': 'Metropolitana'}","{'latlong': [-40.78119299861817, -20.15896969790739], 'name': 'Metropolitana'}",2093
1998,"{'latlong': [-40.78119299861817, -20.15896969790739], 'name': 'Metropolitana'}","{'latlong': [-41.27886237691346, -20.75688096507395], 'name': 'Sul'}",1389
1998,"{'latlong': [-41.27886237691346, -20.75688096507395], 'name': 'Sul'}","{'latlong': [-40.78119299861817, -20.15896969790739], 'name': 'Metropolitana'}",41
1998,"{'latlong': [-41.27886237691346, -20.75688096507395], 'name': 'Sul'}","{'latlong': [-41.27886237691346, -20.75688096507395], 'name': 'Sul'}",2913
1999,"{'latlong': [-40.37386802241421, -18.482273989187647], 'name': 'Norte'}","{'latlong': [-40.37386802241421, -18.482273989187647], 'name': 'Norte'}",20
1999,"{'latlong': [-40.37386802241421, -18.482273989187647], 'name': 'Norte'}","{'latlong': [-40.78119299861817, -20.15896969790739], 'name': 'Metropolitana'}",94
1999,"{'latlong': [-40.37386802241421, -18.482273989187647], 'name': 'Norte'}","{'latlong': [-41.27886237691346, -20.75688096507395], 'name': 'Sul'}",547
1999,"{'latlong': [-40.413051713467134, -19.36386835275335], 'name': 'Central'}","{'latlong': [-40.413051713467134, -19.36386835275335], 'name': 'Central'}",59
1999,"{'latlong': [-40.413051713467134, -19.36386835275335], 'name': 'Central'}","{'latlong': [-40.78119299861817, -20.15896969790739], 'name': 'Metropolitana'}",147
1999,"{'latlong': [-40.413051713467134, -19.36386835275335], 'name': 'Central'}","{'latlong': [-41.27886237691346, -20.75688096507395], 'name': 'Sul'}",628
1999,"{'latlong': [-40.78119299861817, -20.15896969790739], 'name': 'Metropolitana'}","{'latlong': [-40.78119299861817, -20.15896969790739], 'name': 'Metropolitana'}",3396
1999,"{'latlong': [-40.78119299861817, -20.15896969790739], 'name': 'Metropolitana'}","{'latlong': [-41.27886237691346, -20.75688096507395], 'name': 'Sul'}",2077
1999,"{'latlong': [-41.27886237691346, -20.75688096507395], 'name': 'Sul'}","{'latlong': [-40.78119299861817, -20.15896969790739], 'name': 'Metropolitana'}",75
1999,"{'latlong': [-41.27886237691346, -20.75688096507395], 'name': 'Sul'}","{'latlong': [-41.27886237691346, -20.75688096507395], 'name': 'Sul'}",4201
2000,"{'latlong': [-40.37386802241421, -18.482273989187647], 'name': 'Norte'}","{'latlong': [-40.37386802241421, -18.482273989187647], 'name': 'Norte'}",16
2000,"{'latlong': [-40.37386802241421, -18.482273989187647], 'name': 'Norte'}","{'latlong': [-40.78119299861817, -20.15896969790739], 'name': 'Metropolitana'}",53
2000,"{'latlong': [-40.37386802241421, -18.482273989187647], 'name': 'Norte'}","{'latlong': [-41.27886237691346, -20.75688096507395], 'name': 'Sul'}",475
2000,"{'latlong': [-40.413051713467134, -19.36386835275335], 'name': 'Central'}","{'latlong': [-40.413051713467134, -19.36386835275335], 'name': 'Central'}",72
2000,"{'latlong': [-40.413051713467134, -19.36386835275335], 'name': 'Central'}","{'latlong': [-40.78119299861817, -20.15896969790739], 'name': 'Metropolitana'}",117
2000,"{'latlong': [-40.413051713467134, -19.36386835275335], 'name': 'Central'}","{'latlong': [-41.27886237691346, -20.75688096507395], 'name': 'Sul'}",840
2000,"{'latlong': [-40.78119299861817, -20.15896969790739], 'name': 'Metropolitana'}","{'latlong': [-40.78119299861817, -20.15896969790739], 'name': 'Metropolitana'}",3044
2000,"{'latlong': [-40.78119299861817, -20.15896969790739], 'name': 'Metropolitana'}","{'latlong': [-41.27886237691346, -20.75688096507395], 'name': 'Sul'}",2196
2000,"{'latlong': [-41.27886237691346, -20.75688096507395], 'name': 'Sul'}","{'latlong': [-40.78119299861817, -20.15896969790739], 'name': 'Metropolitana'}",86
2000,"{'latlong': [-41.27886237691346, -20.75688096507395], 'name': 'Sul'}","{'latlong': [-41.27886237691346, -20.75688096507395], 'name': 'Sul'}",4079
2001,"{'latlong': [-40.37386802241421, -18.482273989187647], 'name': 'Norte'}","{'latlong': [-40.37386802241421, -18.482273989187647], 'name': 'Norte'}",25
2001,"{'latlong': [-40.37386802241421, -18.482273989187647], 'name': 'Norte'}","{'latlong': [-40.78119299861817, -20.15896969790739], 'name': 'Metropolitana'}",74
2001,"{'latlong': [-40.37386802241421, -18.482273989187647], 'name': 'Norte'}","{'latlong': [-41.27886237691346, -20.75688096507395], 'name': 'Sul'}",463
2001,"{'latlong': [-40.413051713467134, -19.36386835275335], 'name': 'Central'}","{'latlong': [-40.413051713467134, -19.36386835275335], 'name': 'Central'}",63
2001,"{'latlong': [-40.413051713467134, -19.36386835275335], 'name': 'Central'}","{'latlong': [-40.78119299861817, -20.15896969790739], 'name': 'Metropolitana'}",130
2001,"{'latlong': [-40.413051713467134, -19.36386835275335], 'name': 'Central'}","{'latlong': [-41.27886237691346, -20.75688096507395], 'name': 'Sul'}",649
2001,"{'latlong': [-40.78119299861817, -20.15896969790739], 'name': 'Metropolitana'}","{'latlong': [-40.413051713467134, -19.36386835275335], 'name': 'Central'}",1
2001,"{'latlong': [-40.78119299861817, -20.15896969790739], 'name': 'Metropolitana'}","{'latlong': [-40.78119299861817, -20.15896969790739], 'name': 'Metropolitana'}",2699
2001,"{'latlong': [-40.78119299861817, -20.15896969790739], 'name': 'Metropolitana'}","{'latlong': [-41.27886237691346, -20.75688096507395], 'name': 'Sul'}",2000
2001,"{'latlong': [-41.27886237691346, -20.75688096507395], 'name': 'Sul'}","{'latlong': [-40.78119299861817, -20.15896969790739], 'name': 'Metropolitana'}",53
2001,"{'latlong': [-41.27886237691346, -20.75688096507395], 'name': 'Sul'}","{'latlong': [-41.27886237691346, -20.75688096507395], 'name': 'Sul'}",3907
2002,"{'latlong': [-40.37386802241421, -18.482273989187647], 'name': 'Norte'}","{'latlong': [-40.37386802241421, -18.482273989187647], 'name': 'Norte'}",6
2002,"{'latlong': [-40.37386802241421, -18.482273989187647], 'name': 'Norte'}","{'latlong': [-40.78119299861817, -20.15896969790739], 'name': 'Metropolitana'}",70
2002,"{'latlong': [-40.37386802241421, -18.482273989187647], 'name': 'Norte'}","{'latlong': [-41.27886237691346, -20.75688096507395], 'name': 'Sul'}",376
2002,"{'latlong': [-40.413051713467134, -19.36386835275335], 'name': 'Central'}","{'latlong': [-40.413051713467134, -19.36386835275335], 'name': 'Central'}",24
2002,"{'latlong': [-40.413051713467134, -19.36386835275335], 'name': 'Central'}","{'latlong': [-40.78119299861817, -20.15896969790739], 'name': 'Metropolitana'}",134
2002,"{'latlong': [-40.413051713467134, -19.36386835275335], 'name': 'Central'}","{'latlong': [-41.27886237691346, -20.75688096507395], 'name': 'Sul'}",570
2002,"{'latlong': [-40.78119299861817, -20.15896969790739], 'name': 'Metropolitana'}","{'latlong': [-40.78119299861817, -20.15896969790739], 'name': 'Metropolitana'}",2746
2002,"{'latlong': [-40.78119299861817, -20.15896969790739], 'name': 'Metropolitana'}","{'latlong': [-41.27886237691346, -20.75688096507395], 'name': 'Sul'}",2071
2002,"{'latlong': [-41.27886237691346, -20.75688096507395], 'name': 'Sul'}","{'latlong': [-40.78119299861817, -20.15896969790739], 'name': 'Metropolitana'}",49
2002,"{'latlong': [-41.27886237691346, -20.75688096507395], 'name': 'Sul'}","{'latlong': [-41.27886237691346, -20.75688096507395], 'name': 'Sul'}",4183
2003,"{'latlong': [-40.37386802241421, -18.482273989187647], 'name': 'Norte'}","{'latlong': [-40.37386802241421, -18.482273989187647], 'name': 'Norte'}",3
2003,"{'latlong': [-40.37386802241421, -18.482273989187647], 'name': 'Norte'}","{'latlong': [-40.413051713467134, -19.36386835275335], 'name': 'Central'}",1
2003,"{'latlong': [-40.37386802241421, -18.482273989187647], 'name': 'Norte'}","{'latlong': [-40.78119299861817, -20.15896969790739], 'name': 'Metropolitana'}",37
2003,"{'latlong': [-40.37386802241421, -18.482273989187647], 'name': 'Norte'}","{'latlong': [-41.27886237691346, -20.75688096507395], 'name': 'Sul'}",411
2003,"{'latlong': [-40.413051713467134, -19.36386835275335], 'name': 'Central'}","{'latlong': [-40.413051713467134, -19.36386835275335], 'name': 'Central'}",20
2003,"{'latlong': [-40.413051713467134, -19.36386835275335], 'name': 'Central'}","{'latlong': [-40.78119299861817, -20.15896969790739], 'name': 'Metropolitana'}",65
2003,"{'latlong': [-40.413051713467134, -19.36386835275335], 'name': 'Central'}","{'latlong': [-41.27886237691346, -20.75688096507395], 'name': 'Sul'}",560
2003,"{'latlong': [-40.78119299861817, -20.15896969790739], 'name': 'Metropolitana'}","{'latlong': [-40.78119299861817, -20.15896969790739], 'name': 'Metropolitana'}",3068
2003,"{'latlong': [-40.78119299861817, -20.15896969790739], 'name': 'Metropolitana'}","{'latlong': [-41.27886237691346, -20.75688096507395], 'name': 'Sul'}",2053
2003,"{'latlong': [-41.27886237691346, -20.75688096507395], 'name': 'Sul'}","{'latlong': [-40.78119299861817, -20.15896969790739], 'name': 'Metropolitana'}",31
2003,"{'latlong': [-41.27886237691346, -20.75688096507395], 'name': 'Sul'}","{'latlong': [-41.27886237691346, -20.75688096507395], 'name': 'Sul'}",4370
2004,"{'latlong': [-40.37386802241421, -18.482273989187647], 'name': 'Norte'}","{'latlong': [-40.37386802241421, -18.482273989187647], 'name': 'Norte'}",5
2004,"{'latlong': [-40.37386802241421, -18.482273989187647], 'name': 'Norte'}","{'latlong': [-40.413051713467134, -19.36386835275335], 'name': 'Central'}",19
2004,"{'latlong': [-40.37386802241421, -18.482273989187647], 'name': 'Norte'}","{'latlong': [-40.78119299861817, -20.15896969790739], 'name': 'Metropolitana'}",94
2004,"{'latlong': [-40.37386802241421, -18.482273989187647], 'name': 'Norte'}","{'latlong': [-41.27886237691346, -20.75688096507395], 'name': 'Sul'}",314
2004,"{'latlong': [-40.413051713467134, -19.36386835275335], 'name': 'Central'}","{'latlong': [-40.413051713467134, -19.36386835275335], 'name': 'Central'}",82
2004,"{'latlong': [-40.413051713467134, -19.36386835275335], 'name': 'Central'}","{'latlong': [-40.78119299861817, -20.15896969790739], 'name': 'Metropolitana'}",168
2004,"{'latlong': [-40.413051713467134, -19.36386835275335], 'name': 'Central'}","{'latlong': [-41.27886237691346, -20.75688096507395], 'name': 'Sul'}",475
2004,"{'latlong': [-40.78119299861817, -20.15896969790739], 'name': 'Metropolitana'}","{'latlong': [-40.78119299861817, -20.15896969790739], 'name': 'Metropolitana'}",2600
2004,"{'latlong': [-40.78119299861817, -20.15896969790739], 'name': 'Metropolitana'}","{'latlong': [-41.27886237691346, -20.75688096507395], 'name': 'Sul'}",1852
2004,"{'latlong': [-41.27886237691346, -20.75688096507395], 'name': 'Sul'}","{'latlong': [-40.78119299861817, -20.15896969790739], 'name': 'Metropolitana'}",66
2004,"{'latlong': [-41.27886237691346, -20.75688096507395], 'name': 'Sul'}","{'latlong': [-41.27886237691346, -20.75688096507395], 'name': 'Sul'}",3858
2005,"{'latlong': [-40.37386802241421, -18.482273989187647], 'name': 'Norte'}","{'latlong': [-40.37386802241421, -18.482273989187647], 'name': 'Norte'}",1
2005,"{'latlong': [-40.37386802241421, -18.482273989187647], 'name': 'Norte'}","{'latlong': [-40.413051713467134, -19.36386835275335], 'name': 'Central'}",33
2005,"{'latlong': [-40.37386802241421, -18.482273989187647], 'name': 'Norte'}","{'latlong': [-40.78119299861817, -20.15896969790739], 'name': 'Metropolitana'}",96
2005,"{'latlong': [-40.37386802241421, -18.482273989187647], 'name': 'Norte'}","{'latlong': [-41.27886237691346, -20.75688096507395], 'name': 'Sul'}",417
2005,"{'latlong': [-40.413051713467134, -19.36386835275335], 'name': 'Central'}","{'latlong': [-40.413051713467134, -19.36386835275335], 'name': 'Central'}",126
2005,"{'latlong': [-40.413051713467134, -19.36386835275335], 'name': 'Central'}","{'latlong': [-40.78119299861817, -20.15896969790739], 'name': 'Metropolitana'}",131
2005,"{'latlong': [-40.413051713467134, -19.36386835275335], 'name': 'Central'}","{'latlong': [-41.27886237691346, -20.75688096507395], 'name': 'Sul'}",610
2005,"{'latlong': [-40.78119299861817, -20.15896969790739], 'name': 'Metropolitana'}","{'latlong': [-40.78119299861817, -20.15896969790739], 'name': 'Metropolitana'}",2740
2005,"{'latlong': [-40.78119299861817, -20.15896969790739], 'name': 'Metropolitana'}","{'latlong': [-41.27886237691346, -20.75688096507395], 'name': 'Sul'}",1896
2005,"{'latlong': [-41.27886237691346, -20.75688096507395], 'name': 'Sul'}","{'latlong': [-40.78119299861817, -20.15896969790739], 'name': 'Metropolitana'}",76
2005,"{'latlong': [-41.27886237691346, -20.75688096507395], 'name': 'Sul'}","{'latlong': [-41.27886237691346, -20.75688096507395], 'name': 'Sul'}",4320
2006,"{'latlong': [-40.37386802241421, -18.482273989187647], 'name': 'Norte'}","{'latlong': [-40.37386802241421, -18.482273989187647], 'name': 'Norte'}",4
2006,"{'latlong': [-40.37386802241421, -18.482273989187647], 'name': 'Norte'}","{'latlong': [-40.413051713467134, -19.36386835275335], 'name': 'Central'}",31
2006,"{'latlong': [-40.37386802241421, -18.482273989187647], 'name': 'Norte'}","{'latlong': [-40.78119299861817, -20.15896969790739], 'name': 'Metropolitana'}",16
2006,"{'latlong': [-40.37386802241421, -18.482273989187647], 'name': 'Norte'}","{'latlong': [-41.27886237691346, -20.75688096507395], 'name': 'Sul'}",392
2006,"{'latlong': [-40.413051713467134, -19.36386835275335], 'name': 'Central'}","{'latlong': [-40.413051713467134, -19.36386835275335], 'name': 'Central'}",164
2006,"{'latlong': [-40.413051713467134, -19.36386835275335], 'name': 'Central'}","{'latlong': [-40.78119299861817, -20.15896969790739], 'name': 'Metropolitana'}",40
2006,"{'latlong': [-40.413051713467134, -19.36386835275335], 'name': 'Central'}","{'latlong': [-41.27886237691346, -20.75688096507395], 'name': 'Sul'}",584
2006,"{'latlong': [-40.78119299861817, -20.15896969790739], 'name': 'Metropolitana'}","{'latlong': [-40.413051713467134, -19.36386835275335], 'name': 'Central'}",1
2006,"{'latlong': [-40.78119299861817, -20.15896969790739], 'name': 'Metropolitana'}","{'latlong': [-40.78119299861817, -20.15896969790739], 'name': 'Metropolitana'}",2529
2006,"{'latlong': [-40.78119299861817, -20.15896969790739], 'name': 'Metropolitana'}","{'latlong': [-41.27886237691346, -20.75688096507395], 'name': 'Sul'}",1733
2006,"{'latlong': [-41.27886237691346, -20.75688096507395], 'name': 'Sul'}","{'latlong': [-40.78119299861817, -20.15896969790739], 'name': 'Metropolitana'}",14
2006,"{'latlong': [-41.27886237691346, -20.75688096507395], 'name': 'Sul'}","{'latlong': [-41.27886237691346, -20.75688096507395], 'name': 'Sul'}",3937
2007,"{'latlong': [-40.37386802241421, -18.482273989187647], 'name': 'Norte'}","{'latlong': [-40.37386802241421, -18.482273989187647], 'name': 'Norte'}",5
2007,"{'latlong': [-40.37386802241421, -18.482273989187647], 'name': 'Norte'}","{'latlong': [-40.413051713467134, -19.36386835275335], 'name': 'Central'}",58
2007,"{'latlong': [-40.37386802241421, -18.482273989187647], 'name': 'Norte'}","{'latlong': [-40.78119299861817, -20.15896969790739], 'name': 'Metropolitana'}",20
2007,"{'latlong': [-40.37386802241421, -18.482273989187647], 'name': 'Norte'}","{'latlong': [-41.27886237691346, -20.75688096507395], 'name': 'Sul'}",446
2007,"{'latlong': [-40.413051713467134, -19.36386835275335], 'name': 'Central'}","{'latlong': [-40.413051713467134, -19.36386835275335], 'name': 'Central'}",194
2007,"{'latlong': [-40.413051713467134, -19.36386835275335], 'name': 'Central'}","{'latlong': [-40.78119299861817, -20.15896969790739], 'name': 'Metropolitana'}",39
2007,"{'latlong': [-40.413051713467134, -19.36386835275335], 'name': 'Central'}","{'latlong': [-41.27886237691346, -20.75688096507395], 'name': 'Sul'}",549
2007,"{'latlong': [-40.78119299861817, -20.15896969790739], 'name': 'Metropolitana'}","{'latlong': [-40.78119299861817, -20.15896969790739], 'name': 'Metropolitana'}",2870
2007,"{'latlong': [-40.78119299861817, -20.15896969790739], 'name': 'Metropolitana'}","{'latlong': [-41.27886237691346, -20.75688096507395], 'name': 'Sul'}",2111
2007,"{'latlong': [-41.27886237691346, -20.75688096507395], 'name': 'Sul'}","{'latlong': [-40.78119299861817, -20.15896969790739], 'name': 'Metropolitana'}",16
2007,"{'latlong': [-41.27886237691346, -20.75688096507395], 'name': 'Sul'}","{'latlong': [-41.27886237691346, -20.75688096507395], 'name': 'Sul'}",4499
2008,"{'latlong': [-40.37386802241421, -18.482273989187647], 'name': 'Norte'}","{'latlong': [-40.37386802241421, -18.482273989187647], 'name': 'Norte'}",13
2008,"{'latlong': [-40.37386802241421, -18.482273989187647], 'name': 'Norte'}","{'latlong': [-40.413051713467134, -19.36386835275335], 'name': 'Central'}",118
2008,"{'latlong': [-40.37386802241421, -18.482273989187647], 'name': 'Norte'}","{'latlong': [-40.78119299861817, -20.15896969790739], 'name': 'Metropolitana'}",27
2008,"{'latlong': [-40.37386802241421, -18.482273989187647], 'name': 'Norte'}","{'latlong': [-41.27886237691346, -20.75688096507395], 'name': 'Sul'}",418
2008,"{'latlong': [-40.413051713467134, -19.36386835275335], 'name': 'Central'}","{'latlong': [-40.413051713467134, -19.36386835275335], 'name': 'Central'}",309
2008,"{'latlong': [-40.413051713467134, -19.36386835275335], 'name': 'Central'}","{'latlong': [-40.78119299861817, -20.15896969790739], 'name': 'Metropolitana'}",75
2008,"{'latlong': [-40.413051713467134, -19.36386835275335], 'name': 'Central'}","{'latlong': [-41.27886237691346, -20.75688096507395], 'name': 'Sul'}",554
2008,"{'latlong': [-40.78119299861817, -20.15896969790739], 'name': 'Metropolitana'}","{'latlong': [-40.413051713467134, -19.36386835275335], 'name': 'Central'}",11
2008,"{'latlong': [-40.78119299861817, -20.15896969790739], 'name': 'Metropolitana'}","{'latlong': [-40.78119299861817, -20.15896969790739], 'name': 'Metropolitana'}",2246
2008,"{'latlong': [-40.78119299861817, -20.15896969790739], 'name': 'Metropolitana'}","{'latlong': [-41.27886237691346, -20.75688096507395], 'name': 'Sul'}",1930
2008,"{'latlong': [-41.27886237691346, -20.75688096507395], 'name': 'Sul'}","{'latlong': [-40.78119299861817, -20.15896969790739], 'name': 'Metropolitana'}",32
2008,"{'latlong': [-41.27886237691346, -20.75688096507395], 'name': 'Sul'}","{'latlong': [-41.27886237691346, -20.75688096507395], 'name': 'Sul'}",4302
2009,"{'latlong': [-40.37386802241421, -18.482273989187647], 'name': 'Norte'}","{'latlong': [-40.37386802241421, -18.482273989187647], 'name': 'Norte'}",9
2009,"{'latlong': [-40.37386802241421, -18.482273989187647], 'name': 'Norte'}","{'latlong': [-40.413051713467134, -19.36386835275335], 'name': 'Central'}",66
2009,"{'latlong': [-40.37386802241421, -18.482273989187647], 'name': 'Norte'}","{'latlong': [-40.78119299861817, -20.15896969790739], 'name': 'Metropolitana'}",32
2009,"{'latlong': [-40.37386802241421, -18.482273989187647], 'name': 'Norte'}","{'latlong': [-41.27886237691346, -20.75688096507395], 'name': 'Sul'}",569
2009,"{'latlong': [-40.413051713467134, -19.36386835275335], 'name': 'Central'}","{'latlong': [-40.413051713467134, -19.36386835275335], 'name': 'Central'}",261
2009,"{'latlong': [-40.413051713467134, -19.36386835275335], 'name': 'Central'}","{'latlong': [-40.78119299861817, -20.15896969790739], 'name': 'Metropolitana'}",52
2009,"{'latlong': [-40.413051713467134, -19.36386835275335], 'name': 'Central'}","{'latlong': [-41.27886237691346, -20.75688096507395], 'name': 'Sul'}",744
2009,"{'latlong': [-40.78119299861817, -20.15896969790739], 'name': 'Metropolitana'}","{'latlong': [-40.413051713467134, -19.36386835275335], 'name': 'Central'}",3
2009,"{'latlong': [-40.78119299861817, -20.15896969790739], 'name': 'Metropolitana'}","{'latlong': [-40.78119299861817, -20.15896969790739], 'name': 'Metropolitana'}",2122
2009,"{'latlong': [-40.78119299861817, -20.15896969790739], 'name': 'Metropolitana'}","{'latlong': [-41.27886237691346, -20.75688096507395], 'name': 'Sul'}",1646
2009,"{'latlong': [-41.27886237691346, -20.75688096507395], 'name': 'Sul'}","{'latlong': [-40.413051713467134, -19.36386835275335], 'name': 'Central'}",1
2009,"{'latlong': [-41.27886237691346, -20.75688096507395], 'name': 'Sul'}","{'latlong': [-40.78119299861817, -20.15896969790739], 'name': 'Metropolitana'}",40
2009,"{'latlong': [-41.27886237691346, -20.75688096507395], 'name': 'Sul'}","{'latlong': [-41.27886237691346, -20.75688096507395], 'name': 'Sul'}",4098
2010,"{'latlong': [-40.37386802241421, -18.482273989187647], 'name': 'Norte'}","{'latlong': [-40.37386802241421, -18.482273989187647], 'name': 'Norte'}",4
2010,"{'latlong': [-40.37386802241421, -18.482273989187647], 'name': 'Norte'}","{'latlong': [-40.413051713467134, -19.36386835275335], 'name': 'Central'}",10
2010,"{'latlong': [-40.37386802241421, -18.482273989187647], 'name': 'Norte'}","{'latlong': [-40.78119299861817, -20.15896969790739], 'name': 'Metropolitana'}",27
2010,"{'latlong': [-40.37386802241421, -18.482273989187647], 'name': 'Norte'}","{'latlong': [-41.27886237691346, -20.75688096507395], 'name': 'Sul'}",547
2010,"{'latlong': [-40.413051713467134, -19.36386835275335], 'name': 'Central'}","{'latlong': [-40.413051713467134, -19.36386835275335], 'name': 'Central'}",114
2010,"{'latlong': [-40.413051713467134, -19.36386835275335], 'name': 'Central'}","{'latlong': [-40.78119299861817, -20.15896969790739], 'name': 'Metropolitana'}",53
2010,"{'latlong': [-40.413051713467134, -19.36386835275335], 'name': 'Central'}","{'latlong': [-41.27886237691346, -20.75688096507395], 'name': 'Sul'}",808
2010,"{'latlong': [-40.78119299861817, -20.15896969790739], 'name': 'Metropolitana'}","{'latlong': [-40.413051713467134, -19.36386835275335], 'name': 'Central'}",1
2010,"{'latlong': [-40.78119299861817, -20.15896969790739], 'name': 'Metropolitana'}","{'latlong': [-40.78119299861817, -20.15896969790739], 'name': 'Metropolitana'}",1999
2010,"{'latlong': [-40.78119299861817, -20.15896969790739], 'name': 'Metropolitana'}","{'latlong': [-41.27886237691346, -20.75688096507395], 'name': 'Sul'}",1572
2010,"{'latlong': [-41.27886237691346, -20.75688096507395], 'name': 'Sul'}","{'latlong': [-40.78119299861817, -20.15896969790739], 'name': 'Metropolitana'}",46
2010,"{'latlong': [-41.27886237691346, -20.75688096507395], 'name': 'Sul'}","{'latlong': [-41.27886237691346, -20.75688096507395], 'name': 'Sul'}",4254
2011,"{'latlong': [-40.37386802241421, -18.482273989187647], 'name': 'Norte'}","{'latlong': [-40.37386802241421, -18.482273989187647], 'name': 'Norte'}",4
2011,"{'latlong': [-40.37386802241421, -18.482273989187647], 'name': 'Norte'}","{'latlong': [-40.413051713467134, -19.36386835275335], 'name': 'Central'}",2
2011,"{'latlong': [-40.37386802241421, -18.482273989187647], 'name': 'Norte'}","{'latlong': [-40.78119299861817, -20.15896969790739], 'name': 'Metropolitana'}",23
2011,"{'latlong': [-40.37386802241421, -18.482273989187647], 'name': 'Norte'}","{'latlong': [-41.27886237691346, -20.75688096507395], 'name': 'Sul'}",495
2011,"{'latlong': [-40.413051713467134, -19.36386835275335], 'name': 'Central'}","{'latlong': [-40.413051713467134, -19.36386835275335], 'name': 'Central'}",110
2011,"{'latlong': [-40.413051713467134, -19.36386835275335], 'name': 'Central'}","{'latlong': [-40.78119299861817, -20.15896969790739], 'name': 'Metropolitana'}",73
2011,"{'latlong': [-40.413051713467134, -19.36386835275335], 'name': 'Central'}","{'latlong': [-41.27886237691346, -20.75688096507395], 'name': 'Sul'}",1036
2011,"{'latlong': [-40.78119299861817, -20.15896969790739], 'name': 'Metropolitana'}","{'latlong': [-40.78119299861817, -20.15896969790739], 'name': 'Metropolitana'}",1708
2011,"{'latlong': [-40.78119299861817, -20.15896969790739], 'name': 'Metropolitana'}","{'latlong': [-41.27886237691346, -20.75688096507395], 'name': 'Sul'}",1792
2011,"{'latlong': [-41.27886237691346, -20.75688096507395], 'name': 'Sul'}","{'latlong': [-40.78119299861817, -20.15896969790739], 'name': 'Metropolitana'}",21
2011,"{'latlong': [-41.27886237691346, -20.75688096507395], 'name': 'Sul'}","{'latlong': [-41.27886237691346, -20.75688096507395], 'name': 'Sul'}",4426
2012,"{'latlong': [-40.37386802241421, -18.482273989187647], 'name': 'Norte'}","{'latlong': [-40.37386802241421, -18.482273989187647], 'name': 'Norte'}",15
2012,"{'latlong': [-40.37386802241421, -18.482273989187647], 'name': 'Norte'}","{'latlong': [-40.78119299861817, -20.15896969790739], 'name': 'Metropolitana'}",36
2012,"{'latlong': [-40.37386802241421, -18.482273989187647], 'name': 'Norte'}","{'latlong': [-41.27886237691346, -20.75688096507395], 'name': 'Sul'}",516
2012,"{'latlong': [-40.413051713467134, -19.36386835275335], 'name': 'Central'}","{'latlong': [-40.413051713467134, -19.36386835275335], 'name': 'Central'}",125
2012,"{'latlong': [-40.413051713467134, -19.36386835275335], 'name': 'Central'}","{'latlong': [-40.78119299861817, -20.15896969790739], 'name': 'Metropolitana'}",75
2012,"{'latlong': [-40.413051713467134, -19.36386835275335], 'name': 'Central'}","{'latlong': [-41.27886237691346, -20.75688096507395], 'name': 'Sul'}",1122
2012,"{'latlong': [-40.78119299861817, -20.15896969790739], 'name': 'Metropolitana'}","{'latlong': [-40.413051713467134, -19.36386835275335], 'name': 'Central'}",4
2012,"{'latlong': [-40.78119299861817, -20.15896969790739], 'name': 'Metropolitana'}","{'latlong': [-40.78119299861817, -20.15896969790739], 'name': 'Metropolitana'}",1368
2012,"{'latlong': [-40.78119299861817, -20.15896969790739], 'name': 'Metropolitana'}","{'latlong': [-41.27886237691346, -20.75688096507395], 'name': 'Sul'}",1735
2012,"{'latlong': [-41.27886237691346, -20.75688096507395], 'name': 'Sul'}","{'latlong': [-40.78119299861817, -20.15896969790739], 'name': 'Metropolitana'}",25
2012,"{'latlong': [-41.27886237691346, -20.75688096507395], 'name': 'Sul'}","{'latlong': [-41.27886237691346, -20.75688096507395], 'name': 'Sul'}",4290
2013,"{'latlong': [-40.37386802241421, -18.482273989187647], 'name': 'Norte'}","{'latlong': [-40.37386802241421, -18.482273989187647], 'name': 'Norte'}",11
2013,"{'latlong': [-40.37386802241421, -18.482273989187647], 'name': 'Norte'}","{'latlong': [-40.413051713467134, -19.36386835275335], 'name': 'Central'}",3
2013,"{'latlong': [-40.37386802241421, -18.482273989187647], 'name': 'Norte'}","{'latlong': [-40.78119299861817, -20.15896969790739], 'name': 'Metropolitana'}",69
2013,"{'latlong': [-40.37386802241421, -18.482273989187647], 'name': 'Norte'}","{'latlong': [-41.27886237691346, -20.75688096507395], 'name': 'Sul'}",366
2013,"{'latlong': [-40.413051713467134, -19.36386835275335], 'name': 'Central'}","{'latlong': [-40.37386802241421, -18.482273989187647], 'name': 'Norte'}",1
2013,"{'latlong': [-40.413051713467134, -19.36386835275335], 'name': 'Central'}","{'latlong': [-40.413051713467134, -19.36386835275335], 'name': 'Central'}",159
2013,"{'latlong': [-40.413051713467134, -19.36386835275335], 'name': 'Central'}","{'latlong': [-40.78119299861817, -20.15896969790739], 'name': 'Metropolitana'}",133
2013,"{'latlong': [-40.413051713467134, -19.36386835275335], 'name': 'Central'}","{'latlong': [-41.27886237691346, -20.75688096507395], 'name': 'Sul'}",705
2013,"{'latlong': [-40.78119299861817, -20.15896969790739], 'name': 'Metropolitana'}","{'latlong': [-40.78119299861817, -20.15896969790739], 'name': 'Metropolitana'}",1236
2013,"{'latlong': [-40.78119299861817, -20.15896969790739], 'name': 'Metropolitana'}","{'latlong': [-41.27886237691346, -20.75688096507395], 'name': 'Sul'}",1507
2013,"{'latlong': [-41.27886237691346, -20.75688096507395], 'name': 'Sul'}","{'latlong': [-40.78119299861817, -20.15896969790739], 'name': 'Metropolitana'}",16
2013,"{'latlong': [-41.27886237691346, -20.75688096507395], 'name': 'Sul'}","{'latlong': [-41.27886237691346, -20.75688096507395], 'name': 'Sul'}",4113
2014,"{'latlong': [-40.37386802241421, -18.482273989187647], 'name': 'Norte'}","{'latlong': [-40.37386802241421, -18.482273989187647], 'name': 'Norte'}",14
2014,"{'latlong': [-40.37386802241421, -18.482273989187647], 'name': 'Norte'}","{'latlong': [-40.413051713467134, -19.36386835275335], 'name': 'Central'}",1
2014,"{'latlong': [-40.37386802241421, -18.482273989187647], 'name': 'Norte'}","{'latlong': [-40.78119299861817, -20.15896969790739], 'name': 'Metropolitana'}",97
2014,"{'latlong': [-40.37386802241421, -18.482273989187647], 'name': 'Norte'}","{'latlong': [-41.27886237691346, -20.75688096507395], 'name': 'Sul'}",289
2014,"{'latlong': [-40.413051713467134, -19.36386835275335], 'name': 'Central'}","{'latlong': [-40.413051713467134, -19.36386835275335], 'name': 'Central'}",201
2014,"{'latlong': [-40.413051713467134, -19.36386835275335], 'name': 'Central'}","{'latlong': [-40.78119299861817, -20.15896969790739], 'name': 'Metropolitana'}",179
2014,"{'latlong': [-40.413051713467134, -19.36386835275335], 'name': 'Central'}","{'latlong': [-41.27886237691346, -20.75688096507395], 'name': 'Sul'}",461
2014,"{'latlong': [-40.78119299861817, -20.15896969790739], 'name': 'Metropolitana'}","{'latlong': [-40.413051713467134, -19.36386835275335], 'name': 'Central'}",1
2014,"{'latlong': [-40.78119299861817, -20.15896969790739], 'name': 'Metropolitana'}","{'latlong': [-40.78119299861817, -20.15896969790739], 'name': 'Metropolitana'}",1604
2014,"{'latlong': [-40.78119299861817, -20.15896969790739], 'name': 'Metropolitana'}","{'latlong': [-41.27886237691346, -20.75688096507395], 'name': 'Sul'}",1235
2014,"{'latlong': [-41.27886237691346, -20.75688096507395], 'name': 'Sul'}","{'latlong': [-40.78119299861817, -20.15896969790739], 'name': 'Metropolitana'}",20
2014,"{'latlong': [-41.27886237691346, -20.75688096507395], 'name': 'Sul'}","{'latlong': [-41.27886237691346, -20.75688096507395], 'name': 'Sul'}",3986
2015,"{'latlong': [-40.37386802241421, -18.482273989187647], 'name': 'Norte'}","{'latlong': [-40.37386802241421, -18.482273989187647], 'name': 'Norte'}",9
2015,"{'latlong': [-40.37386802241421, -18.482273989187647], 'name': 'Norte'}","{'latlong': [-40.413051713467134, -19.36386835275335], 'name': 'Central'}",5
2015,"{'latlong': [-40.37386802241421, -18.482273989187647], 'name': 'Norte'}","{'latlong': [-40.78119299861817, -20.15896969790739], 'name': 'Metropolitana'}",75
2015,"{'latlong': [-40.37386802241421, -18.482273989187647], 'name': 'Norte'}","{'latlong': [-41.27886237691346, -20.75688096507395], 'name': 'Sul'}",84
2015,"{'latlong': [-40.413051713467134, -19.36386835275335], 'name': 'Central'}","{'latlong': [-40.413051713467134, -19.36386835275335], 'name': 'Central'}",156
2015,"{'latlong': [-40.413051713467134, -19.36386835275335], 'name': 'Central'}","{'latlong': [-40.78119299861817, -20.15896969790739], 'name': 'Metropolitana'}",130
2015,"{'latlong': [-40.413051713467134, -19.36386835275335], 'name': 'Central'}","{'latlong': [-41.27886237691346, -20.75688096507395], 'name': 'Sul'}",214
2015,"{'latlong': [-40.78119299861817, -20.15896969790739], 'name': 'Metropolitana'}","{'latlong': [-40.78119299861817, -20.15896969790739], 'name': 'Metropolitana'}",1068
2015,"{'latlong': [-40.78119299861817, -20.15896969790739], 'name': 'Metropolitana'}","{'latlong': [-41.27886237691346, -20.75688096507395], 'name': 'Sul'}",518
2015,"{'latlong': [-41.27886237691346, -20.75688096507395], 'name': 'Sul'}","{'latlong': [-40.78119299861817, -20.15896969790739], 'name': 'Metropolitana'}",38
2015,"{'latlong': [-41.27886237691346, -20.75688096507395], 'name': 'Sul'}","{'latlong': [-41.27886237691346, -20.75688096507395], 'name': 'Sul'}",1978
2016,"{'latlong': [-40.37386802241421, -18.482273989187647], 'name': 'Norte'}","{'latlong': [-40.37386802241421, -18.482273989187647], 'name': 'Norte'}",6
2016,"{'latlong': [-40.37386802241421, -18.482273989187647], 'name': 'Norte'}","{'latlong': [-40.413051713467134, -19.36386835275335], 'name': 'Central'}",2
2016,"{'latlong': [-40.37386802241421, -18.482273989187647], 'name': 'Norte'}","{'latlong': [-40.78119299861817, -20.15896969790739], 'name': 'Metropolitana'}",87
2016,"{'latlong': [-40.37386802241421, -18.482273989187647], 'name': 'Norte'}","{'latlong': [-41.27886237691346, -20.75688096507395], 'name': 'Sul'}",4
2016,"{'latlong': [-40.413051713467134, -19.36386835275335], 'name': 'Central'}","{'latlong': [-40.413051713467134, -19.36386835275335], 'name': 'Central'}",88
2016,"{'latlong': [-40.413051713467134, -19.36386835275335], 'name': 'Central'}","{'latlong': [-40.78119299861817, -20.15896969790739], 'name': 'Metropolitana'}",113
2016,"{'latlong': [-40.413051713467134, -19.36386835275335], 'name': 'Central'}","{'latlong': [-41.27886237691346, -20.75688096507395], 'name': 'Sul'}",24
2016,"{'latlong': [-40.78119299861817, -20.15896969790739], 'name': 'Metropolitana'}","{'latlong': [-40.78119299861817, -20.15896969790739], 'name': 'Metropolitana'}",1219
2016,"{'latlong': [-40.78119299861817, -20.15896969790739], 'name': 'Metropolitana'}","{'latlong': [-41.27886237691346, -20.75688096507395], 'name': 'Sul'}",28
2016,"{'latlong': [-41.27886237691346, -20.75688096507395], 'name': 'Sul'}","{'latlong': [-40.78119299861817, -20.15896969790739], 'name': 'Metropolitana'}",34
2016,"{'latlong': [-41.27886237691346, -20.75688096507395], 'name': 'Sul'}","{'latlong': [-41.27886237691346, -20.75688096507395], 'name': 'Sul'}",790
2017,"{'latlong': [-40.37386802241421, -18.482273989187647], 'name': 'Norte'}","{'latlong': [-40.37386802241421, -18.482273989187647], 'name': 'Norte'}",12
2017,"{'latlong': [-40.37386802241421, -18.482273989187647], 'name': 'Norte'}","{'latlong': [-40.78119299861817, -20.15896969790739], 'name': 'Metropolitana'}",48
2017,"{'latlong': [-40.37386802241421, -18.482273989187647], 'name': 'Norte'}","{'latlong': [-41.27886237691346, -20.75688096507395], 'name': 'Sul'}",2
2017,"{'latlong': [-40.413051713467134, -19.36386835275335], 'name': 'Central'}","{'latlong': [-40.413051713467134, -19.36386835275335], 'name': 'Central'}",88
2017,"{'latlong': [-40.413051713467134, -19.36386835275335], 'name': 'Central'}","{'latlong': [-40.78119299861817, -20.15896969790739], 'name': 'Metropolitana'}",118
2017,"{'latlong': [-40.413051713467134, -19.36386835275335], 'name': 'Central'}","{'latlong': [-41.27886237691346, -20.75688096507395], 'name': 'Sul'}",2
2017,"{'latlong': [-40.78119299861817, -20.15896969790739], 'name': 'Metropolitana'}","{'latlong': [-40.78119299861817, -20.15896969790739], 'name': 'Metropolitana'}",1303
2017,"{'latlong': [-40.78119299861817, -20.15896969790739], 'name': 'Metropolitana'}","{'latlong': [-41.27886237691346, -20.75688096507395], 'name': 'Sul'}",25
2017,"{'latlong': [-41.27886237691346, -20.75688096507395], 'name': 'Sul'}","{'latlong': [-40.413051713467134, -19.36386835275335], 'name': 'Central'}",1
2017,"{'latlong': [-41.27886237691346, -20.75688096507395], 'name': 'Sul'}","{'latlong': [-40.78119299861817, -20.15896969790739], 'name': 'Metropolitana'}",65
2017,"{'latlong': [-41.27886237691346, -20.75688096507395], 'name': 'Sul'}","{'latlong': [-41.27886237691346, -20.75688096507395], 'name': 'Sul'}",742
2018,"{'latlong': [-40.37386802241421, -18.482273989187647], 'name': 'Norte'}","{'latlong': [-40.37386802241421, -18.482273989187647], 'name': 'Norte'}",28
2018,"{'latlong': [-40.37386802241421, -18.482273989187647], 'name': 'Norte'}","{'latlong': [-40.413051713467134, -19.36386835275335], 'name': 'Central'}",13
2018,"{'latlong': [-40.37386802241421, -18.482273989187647], 'name': 'Norte'}","{'latlong': [-40.78119299861817, -20.15896969790739], 'name': 'Metropolitana'}",73
2018,"{'latlong': [-40.37386802241421, -18.482273989187647], 'name': 'Norte'}","{'latlong': [-41.27886237691346, -20.75688096507395], 'name': 'Sul'}",4
2018,"{'latlong': [-40.413051713467134, -19.36386835275335], 'name': 'Central'}","{'latlong': [-40.37386802241421, -18.482273989187647], 'name': 'Norte'}",2
2018,"{'latlong': [-40.413051713467134, -19.36386835275335], 'name': 'Central'}","{'latlong': [-40.413051713467134, -19.36386835275335], 'name': 'Central'}",130
2018,"{'latlong': [-40.413051713467134, -19.36386835275335], 'name': 'Central'}","{'latlong': [-40.78119299861817, -20.15896969790739], 'name': 'Metropolitana'}",219
2018,"{'latlong': [-40.413051713467134, -19.36386835275335], 'name': 'Central'}","{'latlong': [-41.27886237691346, -20.75688096507395], 'name': 'Sul'}",3
2018,"{'latlong': [-40.78119299861817, -20.15896969790739], 'name': 'Metropolitana'}","{'latlong': [-40.413051713467134, -19.36386835275335], 'name': 'Central'}",4
2018,"{'latlong': [-40.78119299861817, -20.15896969790739], 'name': 'Metropolitana'}","{'latlong': [-40.78119299861817, -20.15896969790739], 'name': 'Metropolitana'}",2181
2018,"{'latlong': [-40.78119299861817, -20.15896969790739], 'name': 'Metropolitana'}","{'latlong': [-41.27886237691346, -20.75688096507395], 'name': 'Sul'}",47
2018,"{'latlong': [-41.27886237691346, -20.75688096507395], 'name': 'Sul'}","{'latlong': [-40.413051713467134, -19.36386835275335], 'name': 'Central'}",2
2018,"{'latlong': [-41.27886237691346, -20.75688096507395], 'name': 'Sul'}","{'latlong': [-40.78119299861817, -20.15896969790739], 'name': 'Metropolitana'}",54
2018,"{'latlong': [-41.27886237691346, -20.75688096507395], 'name': 'Sul'}","{'latlong': [-41.27886237691346, -20.75688096507395], 'name': 'Sul'}",831
2019,"{'latlong': [-40.37386802241421, -18.482273989187647], 'name': 'Norte'}","{'latlong': [-40.37386802241421, -18.482273989187647], 'name': 'Norte'}",58
2019,"{'latlong': [-40.37386802241421, -18.482273989187647], 'name': 'Norte'}","{'latlong': [-40.413051713467134, -19.36386835275335], 'name': 'Central'}",7
2019,"{'latlong': [-40.37386802241421, -18.482273989187647], 'name': 'Norte'}","{'latlong': [-40.78119299861817, -20.15896969790739], 'name': 'Metropolitana'}",67
2019,"{'latlong': [-40.37386802241421, -18.482273989187647], 'name': 'Norte'}","{'latlong': [-41.27886237691346, -20.75688096507395], 'name': 'Sul'}",4
2019,"{'latlong': [-40.413051713467134, -19.36386835275335], 'name': 'Central'}","{'latlong': [-40.37386802241421, -18.482273989187647], 'name': 'Norte'}",4
2019,"{'latlong': [-40.413051713467134, -19.36386835275335], 'name': 'Central'}","{'latlong': [-40.413051713467134, -19.36386835275335], 'name': 'Central'}",179
2019,"{'latlong': [-40.413051713467134, -19.36386835275335], 'name': 'Central'}","{'latlong': [-40.78119299861817, -20.15896969790739], 'name': 'Metropolitana'}",174
2019,"{'latlong': [-40.413051713467134, -19.36386835275335], 'name': 'Central'}","{'latlong': [-41.27886237691346, -20.75688096507395], 'name': 'Sul'}",15
2019,"{'latlong': [-40.78119299861817, -20.15896969790739], 'name': 'Metropolitana'}","{'latlong': [-40.37386802241421, -18.482273989187647], 'name': 'Norte'}",2
2019,"{'latlong': [-40.78119299861817, -20.15896969790739], 'name': 'Metropolitana'}","{'latlong': [-40.413051713467134, -19.36386835275335], 'name': 'Central'}",19
2019,"{'latlong': [-40.78119299861817, -20.15896969790739], 'name': 'Metropolitana'}","{'latlong': [-40.78119299861817, -20.15896969790739], 'name': 'Metropolitana'}",2620
2019,"{'latlong': [-40.78119299861817, -20.15896969790739], 'name': 'Metropolitana'}","{'latlong': [-41.27886237691346, -20.75688096507395], 'name': 'Sul'}",66
2019,"{'latlong': [-41.27886237691346, -20.75688096507395], 'name': 'Sul'}","{'latlong': [-40.37386802241421, -18.482273989187647], 'name': 'Norte'}",1
2019,"{'latlong': [-41.27886237691346, -20.75688096507395], 'name': 'Sul'}","{'latlong': [-40.413051713467134, -19.36386835275335], 'name': 'Central'}",5
2019,"{'latlong': [-41.27886237691346, -20.75688096507395], 'name': 'Sul'}","{'latlong': [-40.78119299861817, -20.15896969790739], 'name': 'Metropolitana'}",39
2019,"{'latlong': [-41.27886237691346, -20.75688096507395], 'name': 'Sul'}","{'latlong': [-41.27886237691346, -20.75688096507395], 'name': 'Sul'}",874
2020,"{'latlong': [-40.37386802241421, -18.482273989187647], 'name': 'Norte'}","{'latlong': [-40.37386802241421, -18.482273989187647], 'name': 'Norte'}",78
2020,"{'latlong': [-40.37386802241421, -18.482273989187647], 'name': 'Norte'}","{'latlong': [-40.413051713467134, -19.36386835275335], 'name': 'Central'}",9
2020,"{'latlong': [-40.37386802241421, -18.482273989187647], 'name': 'Norte'}","{'latlong': [-40.78119299861817, -20.15896969790739], 'name': 'Metropolitana'}",22
2020,"{'latlong': [-40.413051713467134, -19.36386835275335], 'name': 'Central'}","{'latlong': [-40.37386802241421, -18.482273989187647], 'name': 'Norte'}",10
2020,"{'latlong': [-40.413051713467134, -19.36386835275335], 'name': 'Central'}","{'latlong': [-40.413051713467134, -19.36386835275335], 'name': 'Central'}",104
2020,"{'latlong': [-40.413051713467134, -19.36386835275335], 'name': 'Central'}","{'latlong': [-40.78119299861817, -20.15896969790739], 'name': 'Metropolitana'}",66
2020,"{'latlong': [-40.413051713467134, -19.36386835275335], 'name': 'Central'}","{'latlong': [-41.27886237691346, -20.75688096507395], 'name': 'Sul'}",6
2020,"{'latlong': [-40.78119299861817, -20.15896969790739], 'name': 'Metropolitana'}","{'latlong': [-40.37386802241421, -18.482273989187647], 'name': 'Norte'}",5
2020,"{'latlong': [-40.78119299861817, -20.15896969790739], 'name': 'Metropolitana'}","{'latlong': [-40.413051713467134, -19.36386835275335], 'name': 'Central'}",9
2020,"{'latlong': [-40.78119299861817, -20.15896969790739], 'name': 'Metropolitana'}","{'latlong': [-40.78119299861817, -20.15896969790739], 'name': 'Metropolitana'}",791
2020,"{'latlong': [-40.78119299861817, -20.15896969790739], 'name': 'Metropolitana'}","{'latlong': [-41.27886237691346, -20.75688096507395], 'name': 'Sul'}",24
2020,"{'latlong': [-41.27886237691346, -20.75688096507395], 'name': 'Sul'}","{'latlong': [-40.78119299861817, -20.15896969790739], 'name': 'Metropolitana'}",18
2020,"{'latlong': [-41.27886237691346, -20.75688096507395], 'name': 'Sul'}","{'latlong': [-41.27886237691346, -20.75688096507395], 'name': 'Sul'}",318
