year,from,to,hospitalizations
1994,"{'latlong': [-59.713461151252574, -5.31150506386977], 'name': 'Leste'}","{'latlong': [-59.713461151252574, -5.31150506386977], 'name': 'Leste'}",51
1994,"{'latlong': [-64.5801949329809, -3.4202327918909665], 'name': 'Central'}","{'latlong': [-64.5801949329809, -3.4202327918909665], 'name': 'Central'}",372
1994,"{'latlong': [-64.5801949329809, -3.4202327918909665], 'name': 'Central'}","{'latlong': [-68.70673643686315, -4.527961254801425], 'name': 'Oeste'}",3
1994,"{'latlong': [-68.70673643686315, -4.527961254801425], 'name': 'Oeste'}","{'latlong': [-68.70673643686315, -4.527961254801425], 'name': 'Oeste'}",104
1995,"{'latlong': [-59.713461151252574, -5.31150506386977], 'name': 'Leste'}","{'latlong': [-59.713461151252574, -5.31150506386977], 'name': 'Leste'}",837
1995,"{'latlong': [-59.713461151252574, -5.31150506386977], 'name': 'Leste'}","{'latlong': [-64.5801949329809, -3.4202327918909665], 'name': 'Central'}",7
1995,"{'latlong': [-59.713461151252574, -5.31150506386977], 'name': 'Leste'}","{'latlong': [-68.70673643686315, -4.527961254801425], 'name': 'Oeste'}",1
1995,"{'latlong': [-64.5801949329809, -3.4202327918909665], 'name': 'Central'}","{'latlong': [-59.713461151252574, -5.31150506386977], 'name': 'Leste'}",122
1995,"{'latlong': [-64.5801949329809, -3.4202327918909665], 'name': 'Central'}","{'latlong': [-64.5801949329809, -3.4202327918909665], 'name': 'Central'}",5009
1995,"{'latlong': [-64.5801949329809, -3.4202327918909665], 'name': 'Central'}","{'latlong': [-68.70673643686315, -4.527961254801425], 'name': 'Oeste'}",8
1995,"{'latlong': [-68.70673643686315, -4.527961254801425], 'name': 'Oeste'}","{'latlong': [-64.5801949329809, -3.4202327918909665], 'name': 'Central'}",9
1995,"{'latlong': [-68.70673643686315, -4.527961254801425], 'name': 'Oeste'}","{'latlong': [-68.70673643686315, -4.527961254801425], 'name': 'Oeste'}",958
1996,"{'latlong': [-59.713461151252574, -5.31150506386977], 'name': 'Leste'}","{'latlong': [-59.713461151252574, -5.31150506386977], 'name': 'Leste'}",694
1996,"{'latlong': [-59.713461151252574, -5.31150506386977], 'name': 'Leste'}","{'latlong': [-64.5801949329809, -3.4202327918909665], 'name': 'Central'}",4
1996,"{'latlong': [-64.5801949329809, -3.4202327918909665], 'name': 'Central'}","{'latlong': [-59.713461151252574, -5.31150506386977], 'name': 'Leste'}",123
1996,"{'latlong': [-64.5801949329809, -3.4202327918909665], 'name': 'Central'}","{'latlong': [-64.5801949329809, -3.4202327918909665], 'name': 'Central'}",4327
1996,"{'latlong': [-64.5801949329809, -3.4202327918909665], 'name': 'Central'}","{'latlong': [-68.70673643686315, -4.527961254801425], 'name': 'Oeste'}",1
1996,"{'latlong': [-68.70673643686315, -4.527961254801425], 'name': 'Oeste'}","{'latlong': [-64.5801949329809, -3.4202327918909665], 'name': 'Central'}",9
1996,"{'latlong': [-68.70673643686315, -4.527961254801425], 'name': 'Oeste'}","{'latlong': [-68.70673643686315, -4.527961254801425], 'name': 'Oeste'}",919
1997,"{'latlong': [-59.713461151252574, -5.31150506386977], 'name': 'Leste'}","{'latlong': [-59.713461151252574, -5.31150506386977], 'name': 'Leste'}",616
1997,"{'latlong': [-59.713461151252574, -5.31150506386977], 'name': 'Leste'}","{'latlong': [-64.5801949329809, -3.4202327918909665], 'name': 'Central'}",2
1997,"{'latlong': [-64.5801949329809, -3.4202327918909665], 'name': 'Central'}","{'latlong': [-59.713461151252574, -5.31150506386977], 'name': 'Leste'}",1
1997,"{'latlong': [-64.5801949329809, -3.4202327918909665], 'name': 'Central'}","{'latlong': [-64.5801949329809, -3.4202327918909665], 'name': 'Central'}",4528
1997,"{'latlong': [-64.5801949329809, -3.4202327918909665], 'name': 'Central'}","{'latlong': [-68.70673643686315, -4.527961254801425], 'name': 'Oeste'}",4
1997,"{'latlong': [-68.70673643686315, -4.527961254801425], 'name': 'Oeste'}","{'latlong': [-68.70673643686315, -4.527961254801425], 'name': 'Oeste'}",574
1998,"{'latlong': [-59.713461151252574, -5.31150506386977], 'name': 'Leste'}","{'latlong': [-59.713461151252574, -5.31150506386977], 'name': 'Leste'}",627
1998,"{'latlong': [-59.713461151252574, -5.31150506386977], 'name': 'Leste'}","{'latlong': [-64.5801949329809, -3.4202327918909665], 'name': 'Central'}",8
1998,"{'latlong': [-59.713461151252574, -5.31150506386977], 'name': 'Leste'}","{'latlong': [-68.70673643686315, -4.527961254801425], 'name': 'Oeste'}",3
1998,"{'latlong': [-64.5801949329809, -3.4202327918909665], 'name': 'Central'}","{'latlong': [-59.713461151252574, -5.31150506386977], 'name': 'Leste'}",2
1998,"{'latlong': [-64.5801949329809, -3.4202327918909665], 'name': 'Central'}","{'latlong': [-64.5801949329809, -3.4202327918909665], 'name': 'Central'}",1781
1998,"{'latlong': [-64.5801949329809, -3.4202327918909665], 'name': 'Central'}","{'latlong': [-68.70673643686315, -4.527961254801425], 'name': 'Oeste'}",29
1998,"{'latlong': [-68.70673643686315, -4.527961254801425], 'name': 'Oeste'}","{'latlong': [-59.713461151252574, -5.31150506386977], 'name': 'Leste'}",3
1998,"{'latlong': [-68.70673643686315, -4.527961254801425], 'name': 'Oeste'}","{'latlong': [-64.5801949329809, -3.4202327918909665], 'name': 'Central'}",1
1998,"{'latlong': [-68.70673643686315, -4.527961254801425], 'name': 'Oeste'}","{'latlong': [-68.70673643686315, -4.527961254801425], 'name': 'Oeste'}",1064
1999,"{'latlong': [-59.713461151252574, -5.31150506386977], 'name': 'Leste'}","{'latlong': [-59.713461151252574, -5.31150506386977], 'name': 'Leste'}",540
1999,"{'latlong': [-59.713461151252574, -5.31150506386977], 'name': 'Leste'}","{'latlong': [-64.5801949329809, -3.4202327918909665], 'name': 'Central'}",8
1999,"{'latlong': [-59.713461151252574, -5.31150506386977], 'name': 'Leste'}","{'latlong': [-68.70673643686315, -4.527961254801425], 'name': 'Oeste'}",1
1999,"{'latlong': [-64.5801949329809, -3.4202327918909665], 'name': 'Central'}","{'latlong': [-59.713461151252574, -5.31150506386977], 'name': 'Leste'}",1
1999,"{'latlong': [-64.5801949329809, -3.4202327918909665], 'name': 'Central'}","{'latlong': [-64.5801949329809, -3.4202327918909665], 'name': 'Central'}",1934
1999,"{'latlong': [-64.5801949329809, -3.4202327918909665], 'name': 'Central'}","{'latlong': [-68.70673643686315, -4.527961254801425], 'name': 'Oeste'}",25
1999,"{'latlong': [-68.70673643686315, -4.527961254801425], 'name': 'Oeste'}","{'latlong': [-64.5801949329809, -3.4202327918909665], 'name': 'Central'}",8
1999,"{'latlong': [-68.70673643686315, -4.527961254801425], 'name': 'Oeste'}","{'latlong': [-68.70673643686315, -4.527961254801425], 'name': 'Oeste'}",1062
2000,"{'latlong': [-59.713461151252574, -5.31150506386977], 'name': 'Leste'}","{'latlong': [-59.713461151252574, -5.31150506386977], 'name': 'Leste'}",250
2000,"{'latlong': [-59.713461151252574, -5.31150506386977], 'name': 'Leste'}","{'latlong': [-64.5801949329809, -3.4202327918909665], 'name': 'Central'}",14
2000,"{'latlong': [-64.5801949329809, -3.4202327918909665], 'name': 'Central'}","{'latlong': [-64.5801949329809, -3.4202327918909665], 'name': 'Central'}",1609
2000,"{'latlong': [-64.5801949329809, -3.4202327918909665], 'name': 'Central'}","{'latlong': [-68.70673643686315, -4.527961254801425], 'name': 'Oeste'}",27
2000,"{'latlong': [-68.70673643686315, -4.527961254801425], 'name': 'Oeste'}","{'latlong': [-64.5801949329809, -3.4202327918909665], 'name': 'Central'}",19
2000,"{'latlong': [-68.70673643686315, -4.527961254801425], 'name': 'Oeste'}","{'latlong': [-68.70673643686315, -4.527961254801425], 'name': 'Oeste'}",566
2001,"{'latlong': [-59.713461151252574, -5.31150506386977], 'name': 'Leste'}","{'latlong': [-59.713461151252574, -5.31150506386977], 'name': 'Leste'}",134
2001,"{'latlong': [-59.713461151252574, -5.31150506386977], 'name': 'Leste'}","{'latlong': [-64.5801949329809, -3.4202327918909665], 'name': 'Central'}",10
2001,"{'latlong': [-64.5801949329809, -3.4202327918909665], 'name': 'Central'}","{'latlong': [-64.5801949329809, -3.4202327918909665], 'name': 'Central'}",1332
2001,"{'latlong': [-68.70673643686315, -4.527961254801425], 'name': 'Oeste'}","{'latlong': [-64.5801949329809, -3.4202327918909665], 'name': 'Central'}",13
2001,"{'latlong': [-68.70673643686315, -4.527961254801425], 'name': 'Oeste'}","{'latlong': [-68.70673643686315, -4.527961254801425], 'name': 'Oeste'}",260
2002,"{'latlong': [-59.713461151252574, -5.31150506386977], 'name': 'Leste'}","{'latlong': [-59.713461151252574, -5.31150506386977], 'name': 'Leste'}",282
2002,"{'latlong': [-59.713461151252574, -5.31150506386977], 'name': 'Leste'}","{'latlong': [-64.5801949329809, -3.4202327918909665], 'name': 'Central'}",19
2002,"{'latlong': [-64.5801949329809, -3.4202327918909665], 'name': 'Central'}","{'latlong': [-64.5801949329809, -3.4202327918909665], 'name': 'Central'}",2050
2002,"{'latlong': [-64.5801949329809, -3.4202327918909665], 'name': 'Central'}","{'latlong': [-68.70673643686315, -4.527961254801425], 'name': 'Oeste'}",2
2002,"{'latlong': [-68.70673643686315, -4.527961254801425], 'name': 'Oeste'}","{'latlong': [-59.713461151252574, -5.31150506386977], 'name': 'Leste'}",1
2002,"{'latlong': [-68.70673643686315, -4.527961254801425], 'name': 'Oeste'}","{'latlong': [-64.5801949329809, -3.4202327918909665], 'name': 'Central'}",9
2002,"{'latlong': [-68.70673643686315, -4.527961254801425], 'name': 'Oeste'}","{'latlong': [-68.70673643686315, -4.527961254801425], 'name': 'Oeste'}",331
2003,"{'latlong': [-59.713461151252574, -5.31150506386977], 'name': 'Leste'}","{'latlong': [-59.713461151252574, -5.31150506386977], 'name': 'Leste'}",221
2003,"{'latlong': [-59.713461151252574, -5.31150506386977], 'name': 'Leste'}","{'latlong': [-64.5801949329809, -3.4202327918909665], 'name': 'Central'}",22
2003,"{'latlong': [-64.5801949329809, -3.4202327918909665], 'name': 'Central'}","{'latlong': [-64.5801949329809, -3.4202327918909665], 'name': 'Central'}",2927
2003,"{'latlong': [-68.70673643686315, -4.527961254801425], 'name': 'Oeste'}","{'latlong': [-64.5801949329809, -3.4202327918909665], 'name': 'Central'}",1
2003,"{'latlong': [-68.70673643686315, -4.527961254801425], 'name': 'Oeste'}","{'latlong': [-68.70673643686315, -4.527961254801425], 'name': 'Oeste'}",315
2004,"{'latlong': [-59.713461151252574, -5.31150506386977], 'name': 'Leste'}","{'latlong': [-59.713461151252574, -5.31150506386977], 'name': 'Leste'}",421
2004,"{'latlong': [-59.713461151252574, -5.31150506386977], 'name': 'Leste'}","{'latlong': [-64.5801949329809, -3.4202327918909665], 'name': 'Central'}",40
2004,"{'latlong': [-64.5801949329809, -3.4202327918909665], 'name': 'Central'}","{'latlong': [-64.5801949329809, -3.4202327918909665], 'name': 'Central'}",2975
2004,"{'latlong': [-68.70673643686315, -4.527961254801425], 'name': 'Oeste'}","{'latlong': [-64.5801949329809, -3.4202327918909665], 'name': 'Central'}",12
2004,"{'latlong': [-68.70673643686315, -4.527961254801425], 'name': 'Oeste'}","{'latlong': [-68.70673643686315, -4.527961254801425], 'name': 'Oeste'}",317
2005,"{'latlong': [-59.713461151252574, -5.31150506386977], 'name': 'Leste'}","{'latlong': [-59.713461151252574, -5.31150506386977], 'name': 'Leste'}",583
2005,"{'latlong': [-59.713461151252574, -5.31150506386977], 'name': 'Leste'}","{'latlong': [-64.5801949329809, -3.4202327918909665], 'name': 'Central'}",27
2005,"{'latlong': [-64.5801949329809, -3.4202327918909665], 'name': 'Central'}","{'latlong': [-64.5801949329809, -3.4202327918909665], 'name': 'Central'}",3303
2005,"{'latlong': [-68.70673643686315, -4.527961254801425], 'name': 'Oeste'}","{'latlong': [-64.5801949329809, -3.4202327918909665], 'name': 'Central'}",11
2005,"{'latlong': [-68.70673643686315, -4.527961254801425], 'name': 'Oeste'}","{'latlong': [-68.70673643686315, -4.527961254801425], 'name': 'Oeste'}",509
2006,"{'latlong': [-59.713461151252574, -5.31150506386977], 'name': 'Leste'}","{'latlong': [-59.713461151252574, -5.31150506386977], 'name': 'Leste'}",475
2006,"{'latlong': [-59.713461151252574, -5.31150506386977], 'name': 'Leste'}","{'latlong': [-64.5801949329809, -3.4202327918909665], 'name': 'Central'}",27
2006,"{'latlong': [-64.5801949329809, -3.4202327918909665], 'name': 'Central'}","{'latlong': [-64.5801949329809, -3.4202327918909665], 'name': 'Central'}",2432
2006,"{'latlong': [-64.5801949329809, -3.4202327918909665], 'name': 'Central'}","{'latlong': [-68.70673643686315, -4.527961254801425], 'name': 'Oeste'}",2
2006,"{'latlong': [-68.70673643686315, -4.527961254801425], 'name': 'Oeste'}","{'latlong': [-64.5801949329809, -3.4202327918909665], 'name': 'Central'}",7
2006,"{'latlong': [-68.70673643686315, -4.527961254801425], 'name': 'Oeste'}","{'latlong': [-68.70673643686315, -4.527961254801425], 'name': 'Oeste'}",651
2007,"{'latlong': [-59.713461151252574, -5.31150506386977], 'name': 'Leste'}","{'latlong': [-59.713461151252574, -5.31150506386977], 'name': 'Leste'}",465
2007,"{'latlong': [-59.713461151252574, -5.31150506386977], 'name': 'Leste'}","{'latlong': [-64.5801949329809, -3.4202327918909665], 'name': 'Central'}",36
2007,"{'latlong': [-64.5801949329809, -3.4202327918909665], 'name': 'Central'}","{'latlong': [-64.5801949329809, -3.4202327918909665], 'name': 'Central'}",2232
2007,"{'latlong': [-68.70673643686315, -4.527961254801425], 'name': 'Oeste'}","{'latlong': [-64.5801949329809, -3.4202327918909665], 'name': 'Central'}",3
2007,"{'latlong': [-68.70673643686315, -4.527961254801425], 'name': 'Oeste'}","{'latlong': [-68.70673643686315, -4.527961254801425], 'name': 'Oeste'}",580
2008,"{'latlong': [-59.713461151252574, -5.31150506386977], 'name': 'Leste'}","{'latlong': [-59.713461151252574, -5.31150506386977], 'name': 'Leste'}",367
2008,"{'latlong': [-59.713461151252574, -5.31150506386977], 'name': 'Leste'}","{'latlong': [-64.5801949329809, -3.4202327918909665], 'name': 'Central'}",43
2008,"{'latlong': [-64.5801949329809, -3.4202327918909665], 'name': 'Central'}","{'latlong': [-64.5801949329809, -3.4202327918909665], 'name': 'Central'}",2637
2008,"{'latlong': [-68.70673643686315, -4.527961254801425], 'name': 'Oeste'}","{'latlong': [-64.5801949329809, -3.4202327918909665], 'name': 'Central'}",8
2008,"{'latlong': [-68.70673643686315, -4.527961254801425], 'name': 'Oeste'}","{'latlong': [-68.70673643686315, -4.527961254801425], 'name': 'Oeste'}",414
2009,"{'latlong': [-59.713461151252574, -5.31150506386977], 'name': 'Leste'}","{'latlong': [-59.713461151252574, -5.31150506386977], 'name': 'Leste'}",387
2009,"{'latlong': [-59.713461151252574, -5.31150506386977], 'name': 'Leste'}","{'latlong': [-64.5801949329809, -3.4202327918909665], 'name': 'Central'}",48
2009,"{'latlong': [-64.5801949329809, -3.4202327918909665], 'name': 'Central'}","{'latlong': [-64.5801949329809, -3.4202327918909665], 'name': 'Central'}",3900
2009,"{'latlong': [-68.70673643686315, -4.527961254801425], 'name': 'Oeste'}","{'latlong': [-64.5801949329809, -3.4202327918909665], 'name': 'Central'}",24
2009,"{'latlong': [-68.70673643686315, -4.527961254801425], 'name': 'Oeste'}","{'latlong': [-68.70673643686315, -4.527961254801425], 'name': 'Oeste'}",325
2010,"{'latlong': [-59.713461151252574, -5.31150506386977], 'name': 'Leste'}","{'latlong': [-59.713461151252574, -5.31150506386977], 'name': 'Leste'}",363
2010,"{'latlong': [-59.713461151252574, -5.31150506386977], 'name': 'Leste'}","{'latlong': [-64.5801949329809, -3.4202327918909665], 'name': 'Central'}",42
2010,"{'latlong': [-64.5801949329809, -3.4202327918909665], 'name': 'Central'}","{'latlong': [-64.5801949329809, -3.4202327918909665], 'name': 'Central'}",3150
2010,"{'latlong': [-64.5801949329809, -3.4202327918909665], 'name': 'Central'}","{'latlong': [-68.70673643686315, -4.527961254801425], 'name': 'Oeste'}",1
2010,"{'latlong': [-68.70673643686315, -4.527961254801425], 'name': 'Oeste'}","{'latlong': [-64.5801949329809, -3.4202327918909665], 'name': 'Central'}",12
2010,"{'latlong': [-68.70673643686315, -4.527961254801425], 'name': 'Oeste'}","{'latlong': [-68.70673643686315, -4.527961254801425], 'name': 'Oeste'}",328
2011,"{'latlong': [-59.713461151252574, -5.31150506386977], 'name': 'Leste'}","{'latlong': [-59.713461151252574, -5.31150506386977], 'name': 'Leste'}",324
2011,"{'latlong': [-59.713461151252574, -5.31150506386977], 'name': 'Leste'}","{'latlong': [-64.5801949329809, -3.4202327918909665], 'name': 'Central'}",36
2011,"{'latlong': [-59.713461151252574, -5.31150506386977], 'name': 'Leste'}","{'latlong': [-68.70673643686315, -4.527961254801425], 'name': 'Oeste'}",1
2011,"{'latlong': [-64.5801949329809, -3.4202327918909665], 'name': 'Central'}","{'latlong': [-64.5801949329809, -3.4202327918909665], 'name': 'Central'}",3373
2011,"{'latlong': [-68.70673643686315, -4.527961254801425], 'name': 'Oeste'}","{'latlong': [-64.5801949329809, -3.4202327918909665], 'name': 'Central'}",25
2011,"{'latlong': [-68.70673643686315, -4.527961254801425], 'name': 'Oeste'}","{'latlong': [-68.70673643686315, -4.527961254801425], 'name': 'Oeste'}",327
2012,"{'latlong': [-59.713461151252574, -5.31150506386977], 'name': 'Leste'}","{'latlong': [-59.713461151252574, -5.31150506386977], 'name': 'Leste'}",180
2012,"{'latlong': [-59.713461151252574, -5.31150506386977], 'name': 'Leste'}","{'latlong': [-64.5801949329809, -3.4202327918909665], 'name': 'Central'}",45
2012,"{'latlong': [-64.5801949329809, -3.4202327918909665], 'name': 'Central'}","{'latlong': [-64.5801949329809, -3.4202327918909665], 'name': 'Central'}",2617
2012,"{'latlong': [-68.70673643686315, -4.527961254801425], 'name': 'Oeste'}","{'latlong': [-64.5801949329809, -3.4202327918909665], 'name': 'Central'}",17
2012,"{'latlong': [-68.70673643686315, -4.527961254801425], 'name': 'Oeste'}","{'latlong': [-68.70673643686315, -4.527961254801425], 'name': 'Oeste'}",336
2013,"{'latlong': [-59.713461151252574, -5.31150506386977], 'name': 'Leste'}","{'latlong': [-59.713461151252574, -5.31150506386977], 'name': 'Leste'}",133
2013,"{'latlong': [-59.713461151252574, -5.31150506386977], 'name': 'Leste'}","{'latlong': [-64.5801949329809, -3.4202327918909665], 'name': 'Central'}",45
2013,"{'latlong': [-64.5801949329809, -3.4202327918909665], 'name': 'Central'}","{'latlong': [-59.713461151252574, -5.31150506386977], 'name': 'Leste'}",1
2013,"{'latlong': [-64.5801949329809, -3.4202327918909665], 'name': 'Central'}","{'latlong': [-64.5801949329809, -3.4202327918909665], 'name': 'Central'}",2659
2013,"{'latlong': [-68.70673643686315, -4.527961254801425], 'name': 'Oeste'}","{'latlong': [-64.5801949329809, -3.4202327918909665], 'name': 'Central'}",24
2013,"{'latlong': [-68.70673643686315, -4.527961254801425], 'name': 'Oeste'}","{'latlong': [-68.70673643686315, -4.527961254801425], 'name': 'Oeste'}",310
2014,"{'latlong': [-59.713461151252574, -5.31150506386977], 'name': 'Leste'}","{'latlong': [-59.713461151252574, -5.31150506386977], 'name': 'Leste'}",87
2014,"{'latlong': [-59.713461151252574, -5.31150506386977], 'name': 'Leste'}","{'latlong': [-64.5801949329809, -3.4202327918909665], 'name': 'Central'}",66
2014,"{'latlong': [-64.5801949329809, -3.4202327918909665], 'name': 'Central'}","{'latlong': [-64.5801949329809, -3.4202327918909665], 'name': 'Central'}",2365
2014,"{'latlong': [-68.70673643686315, -4.527961254801425], 'name': 'Oeste'}","{'latlong': [-64.5801949329809, -3.4202327918909665], 'name': 'Central'}",44
2014,"{'latlong': [-68.70673643686315, -4.527961254801425], 'name': 'Oeste'}","{'latlong': [-68.70673643686315, -4.527961254801425], 'name': 'Oeste'}",222
2015,"{'latlong': [-59.713461151252574, -5.31150506386977], 'name': 'Leste'}","{'latlong': [-59.713461151252574, -5.31150506386977], 'name': 'Leste'}",94
2015,"{'latlong': [-59.713461151252574, -5.31150506386977], 'name': 'Leste'}","{'latlong': [-64.5801949329809, -3.4202327918909665], 'name': 'Central'}",72
2015,"{'latlong': [-64.5801949329809, -3.4202327918909665], 'name': 'Central'}","{'latlong': [-64.5801949329809, -3.4202327918909665], 'name': 'Central'}",2358
2015,"{'latlong': [-68.70673643686315, -4.527961254801425], 'name': 'Oeste'}","{'latlong': [-64.5801949329809, -3.4202327918909665], 'name': 'Central'}",34
2015,"{'latlong': [-68.70673643686315, -4.527961254801425], 'name': 'Oeste'}","{'latlong': [-68.70673643686315, -4.527961254801425], 'name': 'Oeste'}",257
2016,"{'latlong': [-59.713461151252574, -5.31150506386977], 'name': 'Leste'}","{'latlong': [-59.713461151252574, -5.31150506386977], 'name': 'Leste'}",112
2016,"{'latlong': [-59.713461151252574, -5.31150506386977], 'name': 'Leste'}","{'latlong': [-64.5801949329809, -3.4202327918909665], 'name': 'Central'}",44
2016,"{'latlong': [-64.5801949329809, -3.4202327918909665], 'name': 'Central'}","{'latlong': [-64.5801949329809, -3.4202327918909665], 'name': 'Central'}",2142
2016,"{'latlong': [-68.70673643686315, -4.527961254801425], 'name': 'Oeste'}","{'latlong': [-64.5801949329809, -3.4202327918909665], 'name': 'Central'}",25
2016,"{'latlong': [-68.70673643686315, -4.527961254801425], 'name': 'Oeste'}","{'latlong': [-68.70673643686315, -4.527961254801425], 'name': 'Oeste'}",148
2017,"{'latlong': [-59.713461151252574, -5.31150506386977], 'name': 'Leste'}","{'latlong': [-59.713461151252574, -5.31150506386977], 'name': 'Leste'}",97
2017,"{'latlong': [-59.713461151252574, -5.31150506386977], 'name': 'Leste'}","{'latlong': [-64.5801949329809, -3.4202327918909665], 'name': 'Central'}",86
2017,"{'latlong': [-64.5801949329809, -3.4202327918909665], 'name': 'Central'}","{'latlong': [-64.5801949329809, -3.4202327918909665], 'name': 'Central'}",2152
2017,"{'latlong': [-68.70673643686315, -4.527961254801425], 'name': 'Oeste'}","{'latlong': [-64.5801949329809, -3.4202327918909665], 'name': 'Central'}",42
2017,"{'latlong': [-68.70673643686315, -4.527961254801425], 'name': 'Oeste'}","{'latlong': [-68.70673643686315, -4.527961254801425], 'name': 'Oeste'}",144
2018,"{'latlong': [-59.713461151252574, -5.31150506386977], 'name': 'Leste'}","{'latlong': [-59.713461151252574, -5.31150506386977], 'name': 'Leste'}",165
2018,"{'latlong': [-59.713461151252574, -5.31150506386977], 'name': 'Leste'}","{'latlong': [-64.5801949329809, -3.4202327918909665], 'name': 'Central'}",70
2018,"{'latlong': [-64.5801949329809, -3.4202327918909665], 'name': 'Central'}","{'latlong': [-64.5801949329809, -3.4202327918909665], 'name': 'Central'}",3133
2018,"{'latlong': [-68.70673643686315, -4.527961254801425], 'name': 'Oeste'}","{'latlong': [-64.5801949329809, -3.4202327918909665], 'name': 'Central'}",44
2018,"{'latlong': [-68.70673643686315, -4.527961254801425], 'name': 'Oeste'}","{'latlong': [-68.70673643686315, -4.527961254801425], 'name': 'Oeste'}",162
2019,"{'latlong': [-59.713461151252574, -5.31150506386977], 'name': 'Leste'}","{'latlong': [-59.713461151252574, -5.31150506386977], 'name': 'Leste'}",118
2019,"{'latlong': [-59.713461151252574, -5.31150506386977], 'name': 'Leste'}","{'latlong': [-64.5801949329809, -3.4202327918909665], 'name': 'Central'}",57
2019,"{'latlong': [-64.5801949329809, -3.4202327918909665], 'name': 'Central'}","{'latlong': [-64.5801949329809, -3.4202327918909665], 'name': 'Central'}",2209
2019,"{'latlong': [-68.70673643686315, -4.527961254801425], 'name': 'Oeste'}","{'latlong': [-64.5801949329809, -3.4202327918909665], 'name': 'Central'}",54
2019,"{'latlong': [-68.70673643686315, -4.527961254801425], 'name': 'Oeste'}","{'latlong': [-68.70673643686315, -4.527961254801425], 'name': 'Oeste'}",140
2020,"{'latlong': [-59.713461151252574, -5.31150506386977], 'name': 'Leste'}","{'latlong': [-59.713461151252574, -5.31150506386977], 'name': 'Leste'}",206
2020,"{'latlong': [-59.713461151252574, -5.31150506386977], 'name': 'Leste'}","{'latlong': [-64.5801949329809, -3.4202327918909665], 'name': 'Central'}",52
2020,"{'latlong': [-64.5801949329809, -3.4202327918909665], 'name': 'Central'}","{'latlong': [-59.713461151252574, -5.31150506386977], 'name': 'Leste'}",1
2020,"{'latlong': [-64.5801949329809, -3.4202327918909665], 'name': 'Central'}","{'latlong': [-64.5801949329809, -3.4202327918909665], 'name': 'Central'}",2676
2020,"{'latlong': [-64.5801949329809, -3.4202327918909665], 'name': 'Central'}","{'latlong': [-68.70673643686315, -4.527961254801425], 'name': 'Oeste'}",2
2020,"{'latlong': [-68.70673643686315, -4.527961254801425], 'name': 'Oeste'}","{'latlong': [-64.5801949329809, -3.4202327918909665], 'name': 'Central'}",25
2020,"{'latlong': [-68.70673643686315, -4.527961254801425], 'name': 'Oeste'}","{'latlong': [-68.70673643686315, -4.527961254801425], 'name': 'Oeste'}",163
