year,Adjusted Rand Index,V-Measure,Adjusted Mutual Info Score,Fowlkes Mallows Score
2002,52.551809196533384,85.65196293603451,77.06007936401981,56.24754599537162
2003,57.68534883566553,87.16307972042429,79.07103416398313,60.25455343847851
2004,57.23505415525777,87.23562246370383,79.1289241726361,59.75060288156373
2005,58.583864101182236,88.13401799112489,80.84702534419013,61.680374821112395
2006,60.30056302040017,88.36709085528479,81.291100346758,63.3567297585988
2007,61.64297358326512,89.3327819016083,82.44604814153492,64.05962513068779
2008,62.05157631183222,89.15531622232741,82.17664812382176,64.45012616160352
2009,58.06623629379166,88.26985249263683,80.8790728665068,61.16513116869766
2010,59.46977723914396,88.34887379287895,81.02945401142428,62.38686249201145
2011,60.70483666402971,88.4077284800707,81.1378447437731,63.4778994157291
2012,61.18864990132121,89.12609330466728,82.13632490962904,63.71152038586252
2013,56.34305070184509,88.36743669362392,81.21761961478666,60.205481988652885
2014,58.02737635374711,88.14525845308192,81.0134503586773,61.56339430134261
2015,55.62820623825342,87.77109267794435,80.70610825527909,60.10719430146354
2016,61.264873358790574,89.59436534515099,83.15898015906598,64.43789819021994
2017,59.70866516135433,88.7757610362431,81.88739200067818,63.00683537136261
2018,61.792746444386225,89.60262152671054,83.1428705050379,64.91832759900458
2019,52.75194954779108,88.37409224197259,81.3452103020551,57.50930533158532
