CD_MUN,region,region,region,region
430003,7ª CRS,Região 22 - Pampa,Região 22 - Pampa,Região 22 - Pampa
430005,6ª CRS,Região 18 - Araucárias,Região 18 - Araucárias,Região 18 - Araucárias
430010,4ª CRS,Região 01 - Verdes Campos,Região 01 - Verdes Campos,Região 01 - Verdes Campos
430020,17ª CRS,Região 13 - Diversidade,Região 13 - Diversidade,Região 13 - Diversidade
430030,14ª CRS,Região 14 - Fronteira Noroeste,Região 14 - Fronteira Noroeste,Região 14 - Fronteira Noroeste
430040,10ª CRS,Região 03 - Fronteira Oeste,Região 03 - Fronteira Oeste,Região 03 - Fronteira Oeste
430045,14ª CRS,Região 14 - Fronteira Noroeste,Região 14 - Fronteira Noroeste,Região 14 - Fronteira Noroeste
430047,6ª CRS,Região 17 - Planalto,Região 17 - Planalto,Região 17 - Planalto
430050,19ª CRS,Região 15 - Caminho das Águas,Região 15 - Caminho das Águas,Região 15 - Caminho das Águas
430055,6ª CRS,Região 19 - Botucaraí,Região 19 - Botucaraí,Região 19 - Botucaraí
430057,5ª CRS,Região 26 - Uva Vale,Região 26 - Uva Vale,Região 26 - Uva Vale
430060,1ª CRS,Região 10 - Capital e Vale do Gravataí,Região 10 - Capital e Vale do Gravataí,Região 10 - Capital e Vale do Gravataí
430063,3ª CRS,Região 21 - Sul,Região 21 - Sul,Região 21 - Sul
430064,19ª CRS,Região 15 - Caminho das Águas,Região 15 - Caminho das Águas,Região 15 - Caminho das Águas
430066,6ª CRS,Região 18 - Araucárias,Região 18 - Araucárias,Região 18 - Araucárias
430070,16ª CRS,Região 29 - Vales e Montanhas,Região 29 - Vales e Montanhas,Região 29 - Vales e Montanhas
430080,5ª CRS,Região 26 - Uva Vale,Região 26 - Uva Vale,Região 26 - Uva Vale
430085,2ª CRS,Região 09 - Carbonífera/Costa Doce,Região 09 - Carbonífera/Costa Doce,Região 09 - Carbonífera/Costa Doce
430087,1ª CRS,Região 07 - Vale dos Sinos,Região 07 - Vale dos Sinos,Região 07 - Vale dos Sinos
430090,11ª CRS,Região 16 - Alto Uruguai Gaúcho,Região 16 - Alto Uruguai Gaúcho,Região 16 - Alto Uruguai Gaúcho
430100,16ª CRS,Região 29 - Vales e Montanhas,Região 29 - Vales e Montanhas,Região 29 - Vales e Montanhas
430105,18ª CRS,Região 04 - Belas Praias,Região 04 - Belas Praias,Região 04 - Belas Praias
430107,3ª CRS,Região 21 - Sul,Região 21 - Sul,Região 21 - Sul
430110,2ª CRS,Região 09 - Carbonífera/Costa Doce,Região 09 - Carbonífera/Costa Doce,Região 09 - Carbonífera/Costa Doce
430120,8ª CRS,Região 27 - Jacuí Centro,Região 27 - Jacuí Centro,Região 27 - Jacuí Centro
430130,3ª CRS,Região 21 - Sul,Região 21 - Sul,Região 21 - Sul
430140,16ª CRS,Região 19 - Botucaraí,Região 19 - Botucaraí,Região 19 - Botucaraí
430150,17ª CRS,Região 13 - Diversidade,Região 13 - Diversidade,Região 13 - Diversidade
430155,11ª CRS,Região 16 - Alto Uruguai Gaúcho,Região 16 - Alto Uruguai Gaúcho,Região 16 - Alto Uruguai Gaúcho
430160,7ª CRS,Região 22 - Pampa,Região 22 - Pampa,Região 22 - Pampa
430163,18ª CRS,Região 05 - Bons Ventos,Região 05 - Bons Ventos,Região 05 - Bons Ventos
430165,2ª CRS,Região 08 - Vale do Caí e Metropolitana,Região 08 - Vale do Caí e Metropolitana,Região 08 - Vale do Caí e Metropolitana
430170,11ª CRS,Região 16 - Alto Uruguai Gaúcho,Região 16 - Alto Uruguai Gaúcho,Região 16 - Alto Uruguai Gaúcho
430175,2ª CRS,Região 09 - Carbonífera/Costa Doce,Região 09 - Carbonífera/Costa Doce,Região 09 - Carbonífera/Costa Doce
430180,6ª CRS,Região 18 - Araucárias,Região 18 - Araucárias,Região 18 - Araucárias
430185,19ª CRS,Região 15 - Caminho das Águas,Região 15 - Caminho das Águas,Região 15 - Caminho das Águas
430187,10ª CRS,Região 03 - Fronteira Oeste,Região 03 - Fronteira Oeste,Região 03 - Fronteira Oeste
430190,2ª CRS,Região 09 - Carbonífera/Costa Doce,Região 09 - Carbonífera/Costa Doce,Região 09 - Carbonífera/Costa Doce
430192,11ª CRS,Região 16 - Alto Uruguai Gaúcho,Região 16 - Alto Uruguai Gaúcho,Região 16 - Alto Uruguai Gaúcho
430195,15ª  CRS,Região 20 - Rota da Produção,Região 20 - Rota da Produção,Região 20 - Rota da Produção
430200,16ª CRS,Região 19 - Botucaraí,Região 19 - Botucaraí,Região 19 - Botucaraí
430205,11ª CRS,Região 16 - Alto Uruguai Gaúcho,Região 16 - Alto Uruguai Gaúcho,Região 16 - Alto Uruguai Gaúcho
430210,5ª CRS,Região 25 - Vinhedos e Basalto,Região 25 - Vinhedos e Basalto,Região 25 - Vinhedos e Basalto
430215,15ª  CRS,Região 20 - Rota da Produção,Região 20 - Rota da Produção,Região 20 - Rota da Produção
430220,14ª CRS,Região 14 - Fronteira Noroeste,Região 14 - Fronteira Noroeste,Região 14 - Fronteira Noroeste
430222,9ª CRS,Região 12 - Portal das Missões,Região 12 - Portal das Missões,Região 12 - Portal das Missões
430223,9ª CRS,Região 12 - Portal das Missões,Região 12 - Portal das Missões,Região 12 - Portal das Missões
430225,5ª CRS,Região 25 - Vinhedos e Basalto,Região 25 - Vinhedos e Basalto,Região 25 - Vinhedos e Basalto
430230,5ª CRS,Região 24 - Campos de Cima da Serra,Região 24 - Campos de Cima da Serra,Região 24 - Campos de Cima da Serra
430235,5ª CRS,Região 26 - Uva Vale,Região 26 - Uva Vale,Região 26 - Uva Vale
430237,19ª CRS,Região 15 - Caminho das Águas,Região 15 - Caminho das Águas,Região 15 - Caminho das Águas
430240,16ª CRS,Região 30 - Vale da Luz,Região 30 - Vale da Luz,Região 30 - Vale da Luz
430245,16ª CRS,Região 29 - Vales e Montanhas,Região 29 - Vales e Montanhas,Região 29 - Vales e Montanhas
430250,12ª CRS,Região 11 - Sete Povos das Missões,Região 11 - Sete Povos das Missões,Região 11 - Sete Povos das Missões
430258,17ª CRS,Região 13 - Diversidade,Região 13 - Diversidade,Região 13 - Diversidade
430260,15ª  CRS,Região 20 - Rota da Produção,Região 20 - Rota da Produção,Região 20 - Rota da Produção
430265,2ª CRS,Região 08 - Vale do Caí e Metropolitana,Região 08 - Vale do Caí e Metropolitana,Região 08 - Vale do Caí e Metropolitana
430270,2ª CRS,Região 09 - Carbonífera/Costa Doce,Região 09 - Carbonífera/Costa Doce,Região 09 - Carbonífera/Costa Doce
430280,8ª CRS,Região 27 - Jacuí Centro,Região 27 - Jacuí Centro,Região 27 - Jacuí Centro
430290,4ª CRS,Região 02 - Entre Rios,Região 02 - Entre Rios,Região 02 - Entre Rios
430300,8ª CRS,Região 27 - Jacuí Centro,Região 27 - Jacuí Centro,Região 27 - Jacuí Centro
430310,1ª CRS,Região 10 - Capital e Vale do Gravataí,Região 10 - Capital e Vale do Gravataí,Região 10 - Capital e Vale do Gravataí
430320,6ª CRS,Região 18 - Araucárias,Região 18 - Araucárias,Região 18 - Araucárias
430330,12ª CRS,Região 11 - Sete Povos das Missões,Região 11 - Sete Povos das Missões,Região 11 - Sete Povos das Missões
430340,19ª CRS,Região 15 - Caminho das Águas,Região 15 - Caminho das Águas,Região 15 - Caminho das Águas
430350,2ª CRS,Região 09 - Carbonífera/Costa Doce,Região 09 - Carbonífera/Costa Doce,Região 09 - Carbonífera/Costa Doce
430355,6ª CRS,Região 17 - Planalto,Região 17 - Planalto,Região 17 - Planalto
430360,2ª CRS,Região 06 - Vale do Paranhana e Costa Serr,Região 06 - Vale do Paranhana e Costa Serr,Região 06 - Vale do Paranhana e Costa Serra
430367,5ª CRS,Região 24 - Campos de Cima da Serra,Região 24 - Campos de Cima da Serra,Região 24 - Campos de Cima da Serra
430370,14ª CRS,Região 14 - Fronteira Noroeste,Região 14 - Fronteira Noroeste,Região 14 - Fronteira Noroeste
430380,11ª CRS,Região 16 - Alto Uruguai Gaúcho,Região 16 - Alto Uruguai Gaúcho,Região 16 - Alto Uruguai Gaúcho
430390,1ª CRS,Região 07 - Vale dos Sinos,Região 07 - Vale dos Sinos,Região 07 - Vale dos Sinos
430400,17ª CRS,Região 13 - Diversidade,Região 13 - Diversidade,Região 13 - Diversidade
430410,6ª CRS,Região 19 - Botucaraí,Região 19 - Botucaraí,Região 19 - Botucaraí
430420,13ª CRS,Região 28 - Vinte e Oito,Região 28 - Vinte e Oito,Região 28 - Vinte e Oito
430430,14ª CRS,Região 14 - Fronteira Noroeste,Região 14 - Fronteira Noroeste,Região 14 - Fronteira Noroeste
430435,7ª CRS,Região 22 - Pampa,Região 22 - Pampa,Região 22 - Pampa
430440,5ª CRS,Região 23 - Caxias e Hortênsias,Região 23 - Caxias e Hortênsias,Região 23 - Caxias e Hortênsias
430450,3ª CRS,Região 21 - Sul,Região 21 - Sul,Região 21 - Sul
430460,1ª CRS,Região 08 - Vale do Caí e Metropolitana,Região 08 - Vale do Caí e Metropolitana,Região 08 - Vale do Caí e Metropolitana
430461,16ª CRS,Região 29 - Vales e Montanhas,Região 29 - Vales e Montanhas,Região 29 - Vales e Montanhas
430462,6ª CRS,Região 18 - Araucárias,Região 18 - Araucárias,Região 18 - Araucárias
430463,18ª CRS,Região 04 - Belas Praias,Região 04 - Belas Praias,Região 04 - Belas Praias
430465,4ª CRS,Região 02 - Entre Rios,Região 02 - Entre Rios,Região 02 - Entre Rios
430466,3ª CRS,Região 21 - Sul,Região 21 - Sul,Região 21 - Sul
430467,18ª CRS,Região 05 - Bons Ventos,Região 05 - Bons Ventos,Região 05 - Bons Ventos
430468,2ª CRS,Região 08 - Vale do Caí e Metropolitana,Região 08 - Vale do Caí e Metropolitana,Região 08 - Vale do Caí e Metropolitana
430469,16ª CRS,Região 29 - Vales e Montanhas,Região 29 - Vales e Montanhas,Região 29 - Vales e Montanhas
430470,6ª CRS,Região 17 - Planalto,Região 17 - Planalto,Região 17 - Planalto
430471,18ª CRS,Região 05 - Bons Ventos,Região 05 - Bons Ventos,Região 05 - Bons Ventos
430480,5ª CRS,Região 25 - Vinhedos e Basalto,Região 25 - Vinhedos e Basalto,Região 25 - Vinhedos e Basalto
430485,11ª CRS,Região 16 - Alto Uruguai Gaúcho,Região 16 - Alto Uruguai Gaúcho,Região 16 - Alto Uruguai Gaúcho
430490,6ª CRS,Região 17 - Planalto,Região 17 - Planalto,Região 17 - Planalto
430495,6ª CRS,Região 18 - Araucárias,Região 18 - Araucárias,Região 18 - Araucárias
430500,17ª CRS,Região 13 - Diversidade,Região 13 - Diversidade,Região 13 - Diversidade
430510,5ª CRS,Região 23 - Caxias e Hortênsias,Região 23 - Caxias e Hortênsias,Região 23 - Caxias e Hortênsias
430511,11ª CRS,Região 16 - Alto Uruguai Gaúcho,Região 16 - Alto Uruguai Gaúcho,Região 16 - Alto Uruguai Gaúcho
430512,3ª CRS,Região 21 - Sul,Região 21 - Sul,Região 21 - Sul
430513,8ª CRS,Região 27 - Jacuí Centro,Região 27 - Jacuí Centro,Região 27 - Jacuí Centro
430515,15ª  CRS,Região 20 - Rota da Produção,Região 20 - Rota da Produção,Região 20 - Rota da Produção
430517,2ª CRS,Região 09 - Carbonífera/Costa Doce,Região 09 - Carbonífera/Costa Doce,Região 09 - Carbonífera/Costa Doce
430520,12ª CRS,Região 11 - Sete Povos das Missões,Região 11 - Sete Povos das Missões,Região 11 - Sete Povos das Missões
430530,15ª  CRS,Região 20 - Rota da Produção,Região 20 - Rota da Produção,Região 20 - Rota da Produção
430535,2ª CRS,Região 09 - Carbonífera/Costa Doce,Região 09 - Carbonífera/Costa Doce,Região 09 - Carbonífera/Costa Doce
430537,11ª CRS,Região 16 - Alto Uruguai Gaúcho,Região 16 - Alto Uruguai Gaúcho,Região 16 - Alto Uruguai Gaúcho
430540,17ª CRS,Região 13 - Diversidade,Região 13 - Diversidade,Região 13 - Diversidade
430543,3ª CRS,Região 21 - Sul,Região 21 - Sul,Região 21 - Sul
430544,2ª CRS,Região 09 - Carbonífera/Costa Doce,Região 09 - Carbonífera/Costa Doce,Região 09 - Carbonífera/Costa Doce
430545,18ª CRS,Região 05 - Bons Ventos,Região 05 - Bons Ventos,Região 05 - Bons Ventos
430550,6ª CRS,Região 17 - Planalto,Região 17 - Planalto,Região 17 - Planalto
430558,16ª CRS,Região 30 - Vale da Luz,Região 30 - Vale da Luz,Região 30 - Vale da Luz
430560,9ª CRS,Região 12 - Portal das Missões,Região 12 - Portal das Missões,Região 12 - Portal das Missões
430570,17ª CRS,Região 13 - Diversidade,Região 13 - Diversidade,Região 13 - Diversidade
430580,15ª  CRS,Região 20 - Rota da Produção,Região 20 - Rota da Produção,Região 20 - Rota da Produção
430583,16ª CRS,Região 29 - Vales e Montanhas,Região 29 - Vales e Montanhas,Região 29 - Vales e Montanhas
430585,6ª CRS,Região 17 - Planalto,Região 17 - Planalto,Região 17 - Planalto
430587,17ª CRS,Região 13 - Diversidade,Região 13 - Diversidade,Região 13 - Diversidade
430590,15ª  CRS,Região 20 - Rota da Produção,Região 20 - Rota da Produção,Região 20 - Rota da Produção
430593,5ª CRS,Região 25 - Vinhedos e Basalto,Região 25 - Vinhedos e Basalto,Região 25 - Vinhedos e Basalto
430595,5ª CRS,Região 25 - Vinhedos e Basalto,Região 25 - Vinhedos e Basalto,Região 25 - Vinhedos e Basalto
430597,6ª CRS,Região 17 - Planalto,Região 17 - Planalto,Região 17 - Planalto
430600,17ª CRS,Região 13 - Diversidade,Região 13 - Diversidade,Região 13 - Diversidade
430605,3ª CRS,Região 21 - Sul,Região 21 - Sul,Região 21 - Sul
430607,19ª CRS,Região 15 - Caminho das Águas,Região 15 - Caminho das Águas,Região 15 - Caminho das Águas
430610,9ª CRS,Região 12 - Portal das Missões,Região 12 - Portal das Missões,Região 12 - Portal das Missões
430613,11ª CRS,Região 16 - Alto Uruguai Gaúcho,Região 16 - Alto Uruguai Gaúcho,Região 16 - Alto Uruguai Gaúcho
430620,16ª CRS,Região 29 - Vales e Montanhas,Região 29 - Vales e Montanhas,Região 29 - Vales e Montanhas
430630,6ª CRS,Região 17 - Planalto,Região 17 - Planalto,Região 17 - Planalto
430632,19ª CRS,Região 15 - Caminho das Águas,Região 15 - Caminho das Águas,Região 15 - Caminho das Águas
430635,12ª CRS,Região 11 - Sete Povos das Missões,Região 11 - Sete Povos das Missões,Região 11 - Sete Povos das Missões
430637,4ª CRS,Região 01 - Verdes Campos,Região 01 - Verdes Campos,Região 01 - Verdes Campos
430640,1ª CRS,Região 07 - Vale dos Sinos,Região 07 - Vale dos Sinos,Região 07 - Vale dos Sinos
430642,15ª  CRS,Região 20 - Rota da Produção,Região 20 - Rota da Produção,Região 20 - Rota da Produção
430645,16ª CRS,Região 29 - Vales e Montanhas,Região 29 - Vales e Montanhas,Região 29 - Vales e Montanhas
430650,2ª CRS,Região 09 - Carbonífera/Costa Doce,Região 09 - Carbonífera/Costa Doce,Região 09 - Carbonífera/Costa Doce
430655,18ª CRS,Região 04 - Belas Praias,Região 04 - Belas Praias,Região 04 - Belas Praias
430660,7ª CRS,Região 22 - Pampa,Região 22 - Pampa,Região 22 - Pampa
430670,4ª CRS,Região 01 - Verdes Campos,Região 01 - Verdes Campos,Região 01 - Verdes Campos
430673,14ª CRS,Região 14 - Fronteira Noroeste,Região 14 - Fronteira Noroeste,Região 14 - Fronteira Noroeste
430675,16ª CRS,Região 29 - Vales e Montanhas,Região 29 - Vales e Montanhas,Região 29 - Vales e Montanhas
430676,2ª CRS,Região 09 - Carbonífera/Costa Doce,Região 09 - Carbonífera/Costa Doce,Região 09 - Carbonífera/Costa Doce
430680,16ª CRS,Região 29 - Vales e Montanhas,Região 29 - Vales e Montanhas,Região 29 - Vales e Montanhas
430690,8ª CRS,Região 27 - Jacuí Centro,Região 27 - Jacuí Centro,Região 27 - Jacuí Centro
430692,15ª  CRS,Região 20 - Rota da Produção,Região 20 - Rota da Produção,Região 20 - Rota da Produção
430693,12ª CRS,Região 11 - Sete Povos das Missões,Região 11 - Sete Povos das Missões,Região 11 - Sete Povos das Missões
430695,11ª CRS,Região 16 - Alto Uruguai Gaúcho,Região 16 - Alto Uruguai Gaúcho,Região 16 - Alto Uruguai Gaúcho
430697,11ª CRS,Região 16 - Alto Uruguai Gaúcho,Região 16 - Alto Uruguai Gaúcho,Região 16 - Alto Uruguai Gaúcho
430700,11ª CRS,Região 16 - Alto Uruguai Gaúcho,Região 16 - Alto Uruguai Gaúcho,Região 16 - Alto Uruguai Gaúcho
430705,6ª CRS,Região 17 - Planalto,Região 17 - Planalto,Região 17 - Planalto
430710,3ª CRS,Região 21 - Sul,Região 21 - Sul,Região 21 - Sul
430720,11ª CRS,Região 16 - Alto Uruguai Gaúcho,Região 16 - Alto Uruguai Gaúcho,Região 16 - Alto Uruguai Gaúcho
430730,19ª CRS,Região 15 - Caminho das Águas,Região 15 - Caminho das Águas,Região 15 - Caminho das Águas
430740,5ª CRS,Região 24 - Campos de Cima da Serra,Região 24 - Campos de Cima da Serra,Região 24 - Campos de Cima da Serra
430745,19ª CRS,Região 15 - Caminho das Águas,Região 15 - Caminho das Águas,Região 15 - Caminho das Águas
430750,6ª CRS,Região 19 - Botucaraí,Região 19 - Botucaraí,Região 19 - Botucaraí
430755,11ª CRS,Região 16 - Alto Uruguai Gaúcho,Região 16 - Alto Uruguai Gaúcho,Região 16 - Alto Uruguai Gaúcho
430760,1ª CRS,Região 07 - Vale dos Sinos,Região 07 - Vale dos Sinos,Região 07 - Vale dos Sinos
430770,1ª CRS,Região 08 - Vale do Caí e Metropolitana,Região 08 - Vale do Caí e Metropolitana,Região 08 - Vale do Caí e Metropolitana
430780,16ª CRS,Região 30 - Vale da Luz,Região 30 - Vale da Luz,Região 30 - Vale da Luz
430781,8ª CRS,Região 27 - Jacuí Centro,Região 27 - Jacuí Centro,Região 27 - Jacuí Centro
430783,12ª CRS,Região 11 - Sete Povos das Missões,Região 11 - Sete Povos das Missões,Região 11 - Sete Povos das Missões
430786,5ª CRS,Região 25 - Vinhedos e Basalto,Região 25 - Vinhedos e Basalto,Região 25 - Vinhedos e Basalto
430790,5ª CRS,Região 26 - Uva Vale,Região 26 - Uva Vale,Região 26 - Uva Vale
430800,4ª CRS,Região 01 - Verdes Campos,Região 01 - Verdes Campos,Região 01 - Verdes Campos
430805,11ª CRS,Região 16 - Alto Uruguai Gaúcho,Região 16 - Alto Uruguai Gaúcho,Região 16 - Alto Uruguai Gaúcho
430807,16ª CRS,Região 30 - Vale da Luz,Região 30 - Vale da Luz,Região 30 - Vale da Luz
430810,5ª CRS,Região 26 - Uva Vale,Região 26 - Uva Vale,Região 26 - Uva Vale
430820,5ª CRS,Região 26 - Uva Vale,Região 26 - Uva Vale,Região 26 - Uva Vale
430825,11ª CRS,Região 16 - Alto Uruguai Gaúcho,Região 16 - Alto Uruguai Gaúcho,Região 16 - Alto Uruguai Gaúcho
430830,16ª CRS,Região 19 - Botucaraí,Região 19 - Botucaraí,Região 19 - Botucaraí
430840,4ª CRS,Região 01 - Verdes Campos,Região 01 - Verdes Campos,Região 01 - Verdes Campos
430843,16ª CRS,Região 29 - Vales e Montanhas,Região 29 - Vales e Montanhas,Região 29 - Vales e Montanhas
430845,9ª CRS,Região 12 - Portal das Missões,Região 12 - Portal das Missões,Região 12 - Portal das Missões
430850,19ª CRS,Região 15 - Caminho das Águas,Região 15 - Caminho das Águas,Região 15 - Caminho das Águas
430860,5ª CRS,Região 25 - Vinhedos e Basalto,Região 25 - Vinhedos e Basalto,Região 25 - Vinhedos e Basalto
430865,12ª CRS,Região 11 - Sete Povos das Missões,Região 11 - Sete Povos das Missões,Região 11 - Sete Povos das Missões
430870,11ª CRS,Região 16 - Alto Uruguai Gaúcho,Região 16 - Alto Uruguai Gaúcho,Região 16 - Alto Uruguai Gaúcho
430880,2ª CRS,Região 09 - Carbonífera/Costa Doce,Região 09 - Carbonífera/Costa Doce,Região 09 - Carbonífera/Costa Doce
430885,6ª CRS,Região 17 - Planalto,Região 17 - Planalto,Região 17 - Planalto
430890,11ª CRS,Região 16 - Alto Uruguai Gaúcho,Região 16 - Alto Uruguai Gaúcho,Região 16 - Alto Uruguai Gaúcho
430900,14ª CRS,Região 14 - Fronteira Noroeste,Região 14 - Fronteira Noroeste,Região 14 - Fronteira Noroeste
430905,1ª CRS,Região 10 - Capital e Vale do Gravataí,Região 10 - Capital e Vale do Gravataí,Região 10 - Capital e Vale do Gravataí
430910,5ª CRS,Região 23 - Caxias e Hortênsias,Região 23 - Caxias e Hortênsias,Região 23 - Caxias e Hortênsias
430912,15ª  CRS,Região 20 - Rota da Produção,Região 20 - Rota da Produção,Região 20 - Rota da Produção
430915,13ª CRS,Região 28 - Vinte e Oito,Região 28 - Vinte e Oito,Região 28 - Vinte e Oito
430920,1ª CRS,Região 10 - Capital e Vale do Gravataí,Região 10 - Capital e Vale do Gravataí,Região 10 - Capital e Vale do Gravataí
430925,5ª CRS,Região 25 - Vinhedos e Basalto,Região 25 - Vinhedos e Basalto,Região 25 - Vinhedos e Basalto
430930,2ª CRS,Região 09 - Carbonífera/Costa Doce,Região 09 - Carbonífera/Costa Doce,Região 09 - Carbonífera/Costa Doce
430940,5ª CRS,Região 25 - Vinhedos e Basalto,Região 25 - Vinhedos e Basalto,Região 25 - Vinhedos e Basalto
430950,12ª CRS,Região 11 - Sete Povos das Missões,Região 11 - Sete Povos das Missões,Região 11 - Sete Povos das Missões
430955,2ª CRS,Região 08 - Vale do Caí e Metropolitana,Região 08 - Vale do Caí e Metropolitana,Região 08 - Vale do Caí e Metropolitana
430957,13ª CRS,Região 28 - Vinte e Oito,Região 28 - Vinte e Oito,Região 28 - Vinte e Oito
430960,14ª CRS,Região 14 - Fronteira Noroeste,Região 14 - Fronteira Noroeste,Região 14 - Fronteira Noroeste
430965,7ª CRS,Região 22 - Pampa,Região 22 - Pampa,Região 22 - Pampa
430970,17ª CRS,Região 13 - Diversidade,Região 13 - Diversidade,Região 13 - Diversidade
430975,8ª CRS,Região 27 - Jacuí Centro,Região 27 - Jacuí Centro,Região 27 - Jacuí Centro
430980,6ª CRS,Região 18 - Araucárias,Região 18 - Araucárias,Região 18 - Araucárias
430990,6ª CRS,Região 18 - Araucárias,Região 18 - Araucárias,Região 18 - Araucárias
430995,6ª CRS,Região 19 - Botucaraí,Região 19 - Botucaraí,Região 19 - Botucaraí
431000,9ª CRS,Região 12 - Portal das Missões,Região 12 - Portal das Missões,Região 12 - Portal das Missões
431010,2ª CRS,Região 06 - Vale do Paranhana e Costa Serr,Região 06 - Vale do Paranhana e Costa Serr,Região 06 - Vale do Paranhana e Costa Serra
431020,17ª CRS,Região 13 - Diversidade,Região 13 - Diversidade,Região 13 - Diversidade
431030,16ª CRS,Região 29 - Vales e Montanhas,Região 29 - Vales e Montanhas,Região 29 - Vales e Montanhas
431033,18ª CRS,Região 05 - Bons Ventos,Região 05 - Bons Ventos,Região 05 - Bons Ventos
431036,16ª CRS,Região 30 - Vale da Luz,Região 30 - Vale da Luz,Região 30 - Vale da Luz
431040,14ª CRS,Região 14 - Fronteira Noroeste,Região 14 - Fronteira Noroeste,Região 14 - Fronteira Noroeste
431041,17ª CRS,Região 13 - Diversidade,Região 13 - Diversidade,Região 13 - Diversidade
431043,5ª CRS,Região 26 - Uva Vale,Região 26 - Uva Vale,Região 26 - Uva Vale
431046,11ª CRS,Região 16 - Alto Uruguai Gaúcho,Região 16 - Alto Uruguai Gaúcho,Região 16 - Alto Uruguai Gaúcho
431050,19ª CRS,Região 15 - Caminho das Águas,Região 15 - Caminho das Águas,Região 15 - Caminho das Águas
431053,4ª CRS,Região 01 - Verdes Campos,Região 01 - Verdes Campos,Região 01 - Verdes Campos
431055,12ª CRS,Região 02 - Entre Rios,Região 02 - Entre Rios,Região 02 - Entre Rios
431057,16ª CRS,Região 19 - Botucaraí,Região 19 - Botucaraí,Região 19 - Botucaraí
431060,10ª CRS,Região 03 - Fronteira Oeste,Região 03 - Fronteira Oeste,Região 03 - Fronteira Oeste
431065,18ª CRS,Região 04 - Belas Praias,Região 04 - Belas Praias,Região 04 - Belas Praias
431070,11ª CRS,Região 16 - Alto Uruguai Gaúcho,Região 16 - Alto Uruguai Gaúcho,Região 16 - Alto Uruguai Gaúcho
431075,4ª CRS,Região 01 - Verdes Campos,Região 01 - Verdes Campos,Região 01 - Verdes Campos
431080,1ª CRS,Região 07 - Vale dos Sinos,Região 07 - Vale dos Sinos,Região 07 - Vale dos Sinos
431085,15ª  CRS,Região 20 - Rota da Produção,Região 20 - Rota da Produção,Região 20 - Rota da Produção
431087,9ª CRS,Região 12 - Portal das Missões,Região 12 - Portal das Missões,Região 12 - Portal das Missões
431090,11ª CRS,Região 16 - Alto Uruguai Gaúcho,Região 16 - Alto Uruguai Gaúcho,Região 16 - Alto Uruguai Gaúcho
431100,3ª CRS,Região 21 - Sul,Região 21 - Sul,Região 21 - Sul
431110,4ª CRS,Região 02 - Entre Rios,Região 02 - Entre Rios,Região 02 - Entre Rios
431112,5ª CRS,Região 24 - Campos de Cima da Serra,Região 24 - Campos de Cima da Serra,Região 24 - Campos de Cima da Serra
431113,4ª CRS,Região 02 - Entre Rios,Região 02 - Entre Rios,Região 02 - Entre Rios
431115,17ª CRS,Região 13 - Diversidade,Região 13 - Diversidade,Região 13 - Diversidade
431120,4ª CRS,Região 01 - Verdes Campos,Região 01 - Verdes Campos,Região 01 - Verdes Campos
431123,8ª CRS,Região 27 - Jacuí Centro,Região 27 - Jacuí Centro,Região 27 - Jacuí Centro
431125,6ª CRS,Região 19 - Botucaraí,Região 19 - Botucaraí,Região 19 - Botucaraí
431127,6ª CRS,Região 17 - Planalto,Região 17 - Planalto,Região 17 - Planalto
431130,6ª CRS,Região 18 - Araucárias,Região 18 - Araucárias,Região 18 - Araucárias
431140,16ª CRS,Região 29 - Vales e Montanhas,Região 29 - Vales e Montanhas,Região 29 - Vales e Montanhas
431142,15ª  CRS,Região 20 - Rota da Produção,Região 20 - Rota da Produção,Região 20 - Rota da Produção
431150,7ª CRS,Região 22 - Pampa,Região 22 - Pampa,Região 22 - Pampa
431160,19ª CRS,Região 15 - Caminho das Águas,Região 15 - Caminho das Águas,Região 15 - Caminho das Águas
431162,1ª CRS,Região 07 - Vale dos Sinos,Região 07 - Vale dos Sinos,Região 07 - Vale dos Sinos
431164,5ª CRS,Região 23 - Caxias e Hortênsias,Região 23 - Caxias e Hortênsias,Região 23 - Caxias e Hortênsias
431170,6ª CRS,Região 18 - Araucárias,Região 18 - Araucárias,Região 18 - Araucárias
431171,10ª CRS,Região 03 - Fronteira Oeste,Região 03 - Fronteira Oeste,Região 03 - Fronteira Oeste
431173,18ª CRS,Região 04 - Belas Praias,Região 04 - Belas Praias,Região 04 - Belas Praias
431175,10ª CRS,Região 03 - Fronteira Oeste,Região 03 - Fronteira Oeste,Região 03 - Fronteira Oeste
431177,18ª CRS,Região 04 - Belas Praias,Região 04 - Belas Praias,Região 04 - Belas Praias
431179,2ª CRS,Região 08 - Vale do Caí e Metropolitana,Região 08 - Vale do Caí e Metropolitana,Região 08 - Vale do Caí e Metropolitana
431180,6ª CRS,Região 17 - Planalto,Região 17 - Planalto,Região 17 - Planalto
431190,11ª CRS,Região 16 - Alto Uruguai Gaúcho,Região 16 - Alto Uruguai Gaúcho,Região 16 - Alto Uruguai Gaúcho
431198,2ª CRS,Região 09 - Carbonífera/Costa Doce,Região 09 - Carbonífera/Costa Doce,Região 09 - Carbonífera/Costa Doce
431200,11ª CRS,Região 16 - Alto Uruguai Gaúcho,Região 16 - Alto Uruguai Gaúcho,Região 16 - Alto Uruguai Gaúcho
431205,16ª CRS,Região 29 - Vales e Montanhas,Região 29 - Vales e Montanhas,Região 29 - Vales e Montanhas
431210,4ª CRS,Região 02 - Entre Rios,Região 02 - Entre Rios,Região 02 - Entre Rios
431213,6ª CRS,Região 17 - Planalto,Região 17 - Planalto,Região 17 - Planalto
431215,13ª CRS,Região 28 - Vinte e Oito,Região 28 - Vinte e Oito,Região 28 - Vinte e Oito
431217,12ª CRS,Região 11 - Sete Povos das Missões,Região 11 - Sete Povos das Missões,Região 11 - Sete Povos das Missões
431220,6ª CRS,Região 18 - Araucárias,Região 18 - Araucárias,Região 18 - Araucárias
431225,2ª CRS,Região 09 - Carbonífera/Costa Doce,Região 09 - Carbonífera/Costa Doce,Região 09 - Carbonífera/Costa Doce
431230,15ª  CRS,Região 20 - Rota da Produção,Região 20 - Rota da Produção,Região 20 - Rota da Produção
431235,6ª CRS,Região 17 - Planalto,Região 17 - Planalto,Região 17 - Planalto
431237,5ª CRS,Região 24 - Campos de Cima da Serra,Região 24 - Campos de Cima da Serra,Região 24 - Campos de Cima da Serra
431238,5ª CRS,Região 25 - Vinhedos e Basalto,Região 25 - Vinhedos e Basalto,Região 25 - Vinhedos e Basalto
431240,2ª CRS,Região 08 - Vale do Caí e Metropolitana,Região 08 - Vale do Caí e Metropolitana,Região 08 - Vale do Caí e Metropolitana
431242,6ª CRS,Região 19 - Botucaraí,Região 19 - Botucaraí,Região 19 - Botucaraí
431244,18ª CRS,Região 04 - Belas Praias,Região 04 - Belas Praias,Região 04 - Belas Praias
431245,3ª CRS,Região 21 - Sul,Região 21 - Sul,Região 21 - Sul
431247,1ª CRS,Região 07 - Vale dos Sinos,Região 07 - Vale dos Sinos,Região 07 - Vale dos Sinos
431250,18ª CRS,Região 05 - Bons Ventos,Região 05 - Bons Ventos,Região 05 - Bons Ventos
431260,16ª CRS,Região 29 - Vales e Montanhas,Região 29 - Vales e Montanhas,Região 29 - Vales e Montanhas
431261,5ª CRS,Região 24 - Campos de Cima da Serra,Região 24 - Campos de Cima da Serra,Região 24 - Campos de Cima da Serra
431262,6ª CRS,Região 17 - Planalto,Região 17 - Planalto,Região 17 - Planalto
431265,6ª CRS,Região 17 - Planalto,Região 17 - Planalto,Região 17 - Planalto
431267,6ª CRS,Região 17 - Planalto,Região 17 - Planalto,Região 17 - Planalto
431270,19ª CRS,Região 16 - Alto Uruguai Gaúcho,Região 16 - Alto Uruguai Gaúcho,Região 16 - Alto Uruguai Gaúcho
431275,6ª CRS,Região 17 - Planalto,Região 17 - Planalto,Região 17 - Planalto
431280,5ª CRS,Região 25 - Vinhedos e Basalto,Região 25 - Vinhedos e Basalto,Região 25 - Vinhedos e Basalto
431290,5ª CRS,Região 25 - Vinhedos e Basalto,Região 25 - Vinhedos e Basalto,Região 25 - Vinhedos e Basalto
431295,15ª  CRS,Região 20 - Rota da Produção,Região 20 - Rota da Produção,Região 20 - Rota da Produção
431300,16ª CRS,Região 29 - Vales e Montanhas,Região 29 - Vales e Montanhas,Região 29 - Vales e Montanhas
431301,14ª CRS,Região 14 - Fronteira Noroeste,Região 14 - Fronteira Noroeste,Região 14 - Fronteira Noroeste
431303,4ª CRS,Região 02 - Entre Rios,Região 02 - Entre Rios,Região 02 - Entre Rios
431306,1ª CRS,Região 07 - Vale dos Sinos,Região 07 - Vale dos Sinos,Região 07 - Vale dos Sinos
431308,5ª CRS,Região 26 - Uva Vale,Região 26 - Uva Vale,Região 26 - Uva Vale
431310,4ª CRS,Região 01 - Verdes Campos,Região 01 - Verdes Campos,Região 01 - Verdes Campos
431320,5ª CRS,Região 23 - Caxias e Hortênsias,Região 23 - Caxias e Hortênsias,Região 23 - Caxias e Hortênsias
431330,5ª CRS,Região 25 - Vinhedos e Basalto,Região 25 - Vinhedos e Basalto,Região 25 - Vinhedos e Basalto
431333,17ª CRS,Região 13 - Diversidade,Região 13 - Diversidade,Região 13 - Diversidade
431335,5ª CRS,Região 26 - Uva Vale,Região 26 - Uva Vale,Região 26 - Uva Vale
431337,1ª CRS,Região 08 - Vale do Caí e Metropolitana,Região 08 - Vale do Caí e Metropolitana,Região 08 - Vale do Caí e Metropolitana
431339,8ª CRS,Região 27 - Jacuí Centro,Região 27 - Jacuí Centro,Região 27 - Jacuí Centro
431340,1ª CRS,Região 07 - Vale dos Sinos,Região 07 - Vale dos Sinos,Região 07 - Vale dos Sinos
431342,14ª CRS,Região 14 - Fronteira Noroeste,Região 14 - Fronteira Noroeste,Região 14 - Fronteira Noroeste
431344,19ª CRS,Região 15 - Caminho das Águas,Região 15 - Caminho das Águas,Região 15 - Caminho das Águas
431346,15ª  CRS,Região 20 - Rota da Produção,Região 20 - Rota da Produção,Região 20 - Rota da Produção
431349,15ª  CRS,Região 20 - Rota da Produção,Região 20 - Rota da Produção,Região 20 - Rota da Produção
431350,18ª CRS,Região 05 - Bons Ventos,Região 05 - Bons Ventos,Região 05 - Bons Ventos
431360,6ª CRS,Região 18 - Araucárias,Região 18 - Araucárias,Região 18 - Araucárias
431365,18ª CRS,Região 05 - Bons Ventos,Região 05 - Bons Ventos,Região 05 - Bons Ventos
431370,15ª  CRS,Região 20 - Rota da Produção,Região 20 - Rota da Produção,Região 20 - Rota da Produção
431380,19ª CRS,Região 15 - Caminho das Águas,Região 15 - Caminho das Águas,Região 15 - Caminho das Águas
431390,17ª CRS,Região 13 - Diversidade,Região 13 - Diversidade,Região 13 - Diversidade
431395,13ª CRS,Região 28 - Vinte e Oito,Região 28 - Vinte e Oito,Região 28 - Vinte e Oito
431400,5ª CRS,Região 25 - Vinhedos e Basalto,Região 25 - Vinhedos e Basalto,Região 25 - Vinhedos e Basalto
431402,4ª CRS,Região 01 - Verdes Campos,Região 01 - Verdes Campos,Região 01 - Verdes Campos
431403,2ª CRS,Região 08 - Vale do Caí e Metropolitana,Região 08 - Vale do Caí e Metropolitana,Região 08 - Vale do Caí e Metropolitana
431405,2ª CRS,Região 06 - Vale do Paranhana e Costa Serr,Região 06 - Vale do Paranhana e Costa Serr,Região 06 - Vale do Paranhana e Costa Serra
431406,8ª CRS,Região 27 - Jacuí Centro,Região 27 - Jacuí Centro,Região 27 - Jacuí Centro
431407,13ª CRS,Região 28 - Vinte e Oito,Região 28 - Vinte e Oito,Região 28 - Vinte e Oito
431410,6ª CRS,Região 17 - Planalto,Região 17 - Planalto,Região 17 - Planalto
431413,11ª CRS,Região 16 - Alto Uruguai Gaúcho,Região 16 - Alto Uruguai Gaúcho,Região 16 - Alto Uruguai Gaúcho
431415,16ª CRS,Região 30 - Vale da Luz,Região 30 - Vale da Luz,Região 30 - Vale da Luz
431417,3ª CRS,Região 21 - Sul,Região 21 - Sul,Região 21 - Sul
431420,3ª CRS,Região 21 - Sul,Região 21 - Sul,Região 21 - Sul
431430,17ª CRS,Região 13 - Diversidade,Região 13 - Diversidade,Região 13 - Diversidade
431440,3ª CRS,Região 21 - Sul,Região 21 - Sul,Região 21 - Sul
431442,5ª CRS,Região 23 - Caxias e Hortênsias,Região 23 - Caxias e Hortênsias,Região 23 - Caxias e Hortênsias
431445,19ª CRS,Região 15 - Caminho das Águas,Região 15 - Caminho das Águas,Região 15 - Caminho das Águas
431446,5ª CRS,Região 24 - Campos de Cima da Serra,Região 24 - Campos de Cima da Serra,Região 24 - Campos de Cima da Serra
431447,4ª CRS,Região 01 - Verdes Campos,Região 01 - Verdes Campos,Região 01 - Verdes Campos
431449,19ª CRS,Região 15 - Caminho das Águas,Região 15 - Caminho das Águas,Região 15 - Caminho das Águas
431450,3ª CRS,Região 21 - Sul,Região 21 - Sul,Região 21 - Sul
431454,,Região 25 - Vinhedos e Basalto,Região 25 - Vinhedos e Basalto,Região 25 - Vinhedos e Basalto
431455,12ª CRS,Região 11 - Sete Povos das Missões,Região 11 - Sete Povos das Missões,Região 11 - Sete Povos das Missões
431460,3ª CRS,Região 21 - Sul,Região 21 - Sul,Região 21 - Sul
431470,19ª CRS,Região 15 - Caminho das Águas,Região 15 - Caminho das Águas,Região 15 - Caminho das Águas
431475,16ª CRS,Região 30 - Vale da Luz,Região 30 - Vale da Luz,Região 30 - Vale da Luz
431477,6ª CRS,Região 17 - Planalto,Região 17 - Planalto,Região 17 - Planalto
431478,11ª CRS,Região 16 - Alto Uruguai Gaúcho,Região 16 - Alto Uruguai Gaúcho,Região 16 - Alto Uruguai Gaúcho
431480,1ª CRS,Região 07 - Vale dos Sinos,Região 07 - Vale dos Sinos,Região 07 - Vale dos Sinos
431490,1ª CRS,Região 10 - Capital e Vale do Gravataí,Região 10 - Capital e Vale do Gravataí,Região 10 - Capital e Vale do Gravataí
431500,14ª CRS,Região 14 - Fronteira Noroeste,Região 14 - Fronteira Noroeste,Região 14 - Fronteira Noroeste
431505,14ª CRS,Região 14 - Fronteira Noroeste,Região 14 - Fronteira Noroeste,Região 14 - Fronteira Noroeste
431507,14ª CRS,Região 14 - Fronteira Noroeste,Região 14 - Fronteira Noroeste,Região 14 - Fronteira Noroeste
431510,12ª CRS,Região 11 - Sete Povos das Missões,Região 11 - Sete Povos das Missões,Região 11 - Sete Povos das Missões
431513,16ª CRS,Região 29 - Vales e Montanhas,Região 29 - Vales e Montanhas,Região 29 - Vales e Montanhas
431514,1ª CRS,Região 07 - Vale dos Sinos,Região 07 - Vale dos Sinos,Região 07 - Vale dos Sinos
431515,16ª CRS,Região 29 - Vales e Montanhas,Região 29 - Vales e Montanhas,Região 29 - Vales e Montanhas
431517,5ª CRS,Região 25 - Vinhedos e Basalto,Região 25 - Vinhedos e Basalto,Região 25 - Vinhedos e Basalto
431520,16ª CRS,Região 29 - Vales e Montanhas,Região 29 - Vales e Montanhas,Região 29 - Vales e Montanhas
431530,10ª CRS,Região 03 - Fronteira Oeste,Região 03 - Fronteira Oeste,Região 03 - Fronteira Oeste
431531,11ª CRS,Região 16 - Alto Uruguai Gaúcho,Região 16 - Alto Uruguai Gaúcho,Região 16 - Alto Uruguai Gaúcho
431532,4ª CRS,Região 01 - Verdes Campos,Região 01 - Verdes Campos,Região 01 - Verdes Campos
431535,9ª CRS,Região 12 - Portal das Missões,Região 12 - Portal das Missões,Região 12 - Portal das Missões
431540,15ª  CRS,Região 20 - Rota da Produção,Região 20 - Rota da Produção,Região 20 - Rota da Produção
431545,16ª CRS,Região 29 - Vales e Montanhas,Região 29 - Vales e Montanhas,Região 29 - Vales e Montanhas
431550,4ª CRS,Região 01 - Verdes Campos,Região 01 - Verdes Campos,Região 01 - Verdes Campos
431555,19ª CRS,Região 16 - Alto Uruguai Gaúcho,Região 16 - Alto Uruguai Gaúcho,Região 16 - Alto Uruguai Gaúcho
431560,3ª CRS,Região 21 - Sul,Região 21 - Sul,Região 21 - Sul
431570,13ª CRS,Região 28 - Vinte e Oito,Região 28 - Vinte e Oito,Região 28 - Vinte e Oito
431575,2ª CRS,Região 06 - Vale do Paranhana e Costa Serr,Região 06 - Vale do Paranhana e Costa Serr,Região 06 - Vale do Paranhana e Costa Serra
431580,16ª CRS,Região 29 - Vales e Montanhas,Região 29 - Vales e Montanhas,Região 29 - Vales e Montanhas
431590,19ª CRS,Região 15 - Caminho das Águas,Região 15 - Caminho das Águas,Região 15 - Caminho das Águas
431595,12ª CRS,Região 11 - Sete Povos das Missões,Região 11 - Sete Povos das Missões,Região 11 - Sete Povos das Missões
431600,2ª CRS,Região 06 - Vale do Paranhana e Costa Serr,Região 06 - Vale do Paranhana e Costa Serr,Região 06 - Vale do Paranhana e Costa Serra
431610,15ª  CRS,Região 20 - Rota da Produção,Região 20 - Rota da Produção,Região 20 - Rota da Produção
431620,15ª  CRS,Região 20 - Rota da Produção,Região 20 - Rota da Produção,Região 20 - Rota da Produção
431630,12ª CRS,Região 11 - Sete Povos das Missões,Região 11 - Sete Povos das Missões,Região 11 - Sete Povos das Missões
431640,10ª CRS,Região 03 - Fronteira Oeste,Região 03 - Fronteira Oeste,Região 03 - Fronteira Oeste
431642,15ª  CRS,Região 20 - Rota da Produção,Região 20 - Rota da Produção,Região 20 - Rota da Produção
431643,9ª CRS,Região 12 - Portal das Missões,Região 12 - Portal das Missões,Região 12 - Portal das Missões
431645,9ª CRS,Região 12 - Portal das Missões,Região 12 - Portal das Missões,Região 12 - Portal das Missões
431647,12ª CRS,Região 11 - Sete Povos das Missões,Região 11 - Sete Povos das Missões,Região 11 - Sete Povos das Missões
431650,2ª CRS,Região 08 - Vale do Caí e Metropolitana,Região 08 - Vale do Caí e Metropolitana,Região 08 - Vale do Caí e Metropolitana
431660,6ª CRS,Região 18 - Araucárias,Região 18 - Araucárias,Região 18 - Araucárias
431670,9ª CRS,Região 12 - Portal das Missões,Região 12 - Portal das Missões,Região 12 - Portal das Missões
431673,6ª CRS,Região 18 - Araucárias,Região 18 - Araucárias,Região 18 - Araucárias
431675,16ª CRS,Região 29 - Vales e Montanhas,Região 29 - Vales e Montanhas,Região 29 - Vales e Montanhas
431680,13ª CRS,Região 28 - Vinte e Oito,Região 28 - Vinte e Oito,Região 28 - Vinte e Oito
431690,4ª CRS,Região 01 - Verdes Campos,Região 01 - Verdes Campos,Região 01 - Verdes Campos
431695,1ª CRS,Região 07 - Vale dos Sinos,Região 07 - Vale dos Sinos,Região 07 - Vale dos Sinos
431697,10ª CRS,Região 03 - Fronteira Oeste,Região 03 - Fronteira Oeste,Região 03 - Fronteira Oeste
431700,3ª CRS,Região 21 - Sul,Região 21 - Sul,Região 21 - Sul
431710,10ª CRS,Região 03 - Fronteira Oeste,Região 03 - Fronteira Oeste,Região 03 - Fronteira Oeste
431720,14ª CRS,Região 14 - Fronteira Noroeste,Região 14 - Fronteira Noroeste,Região 14 - Fronteira Noroeste
431725,5ª CRS,Região 25 - Vinhedos e Basalto,Região 25 - Vinhedos e Basalto,Região 25 - Vinhedos e Basalto
431730,3ª CRS,Região 21 - Sul,Região 21 - Sul,Região 21 - Sul
431740,4ª CRS,Região 02 - Entre Rios,Região 02 - Entre Rios,Região 02 - Entre Rios
431750,12ª CRS,Região 11 - Sete Povos das Missões,Região 11 - Sete Povos das Missões,Região 11 - Sete Povos das Missões
431755,6ª CRS,Região 17 - Planalto,Região 17 - Planalto,Região 17 - Planalto
431760,18ª CRS,Região 05 - Bons Ventos,Região 05 - Bons Ventos,Região 05 - Bons Ventos
431770,12ª CRS,Região 11 - Sete Povos das Missões,Região 11 - Sete Povos das Missões,Região 11 - Sete Povos das Missões
431775,6ª CRS,Região 17 - Planalto,Região 17 - Planalto,Região 17 - Planalto
431780,17ª CRS,Região 13 - Diversidade,Região 13 - Diversidade,Região 13 - Diversidade
431790,14ª CRS,Região 14 - Fronteira Noroeste,Região 14 - Fronteira Noroeste,Região 14 - Fronteira Noroeste
431795,6ª CRS,Região 18 - Araucárias,Região 18 - Araucárias,Região 18 - Araucárias
431800,10ª CRS,Região 11 - Sete Povos das Missões,Região 11 - Sete Povos das Missões,Região 11 - Sete Povos das Missões
431805,6ª CRS,Região 17 - Planalto,Região 17 - Planalto,Região 17 - Planalto
431810,4ª CRS,Região 02 - Entre Rios,Região 02 - Entre Rios,Região 02 - Entre Rios
431820,2ª CRS,Região 06 - Vale do Paranhana e Costa Serr,Região 06 - Vale do Paranhana e Costa Serr,Região 06 - Vale do Paranhana e Costa Serra
431830,10ª CRS,Região 03 - Fronteira Oeste,Região 03 - Fronteira Oeste,Região 03 - Fronteira Oeste
431840,2ª CRS,Região 09 - Carbonífera/Costa Doce,Região 09 - Carbonífera/Costa Doce,Região 09 - Carbonífera/Costa Doce
431842,6ª CRS,Região 18 - Araucárias,Região 18 - Araucárias,Região 18 - Araucárias
431843,4ª CRS,Região 01 - Verdes Campos,Região 01 - Verdes Campos,Região 01 - Verdes Campos
431844,5ª CRS,Região 25 - Vinhedos e Basalto,Região 25 - Vinhedos e Basalto,Região 25 - Vinhedos e Basalto
431845,15ª  CRS,Região 20 - Rota da Produção,Região 20 - Rota da Produção,Região 20 - Rota da Produção
431846,16ª CRS,Região 29 - Vales e Montanhas,Região 29 - Vales e Montanhas,Região 29 - Vales e Montanhas
431848,2ª CRS,Região 07 - Vale dos Sinos,Região 07 - Vale dos Sinos,Região 07 - Vale dos Sinos
431849,14ª CRS,Região 14 - Fronteira Noroeste,Região 14 - Fronteira Noroeste,Região 14 - Fronteira Noroeste
431850,3ª CRS,Região 21 - Sul,Região 21 - Sul,Região 21 - Sul
431860,6ª CRS,Região 18 - Araucárias,Região 18 - Araucárias,Região 18 - Araucárias
431861,2ª CRS,Região 08 - Vale do Caí e Metropolitana,Região 08 - Vale do Caí e Metropolitana,Região 08 - Vale do Caí e Metropolitana
431862,5ª CRS,Região 24 - Campos de Cima da Serra,Região 24 - Campos de Cima da Serra,Região 24 - Campos de Cima da Serra
431870,1ª CRS,Região 07 - Vale dos Sinos,Região 07 - Vale dos Sinos,Região 07 - Vale dos Sinos
431880,3ª CRS,Região 21 - Sul,Região 21 - Sul,Região 21 - Sul
431890,12ª CRS,Região 11 - Sete Povos das Missões,Região 11 - Sete Povos das Missões,Região 11 - Sete Povos das Missões
431900,5ª CRS,Região 26 - Uva Vale,Região 26 - Uva Vale,Região 26 - Uva Vale
431910,17ª CRS,Região 13 - Diversidade,Região 13 - Diversidade,Região 13 - Diversidade
431912,4ª CRS,Região 01 - Verdes Campos,Região 01 - Verdes Campos,Região 01 - Verdes Campos
431915,12ª CRS,Região 11 - Sete Povos das Missões,Região 11 - Sete Povos das Missões,Região 11 - Sete Povos das Missões
431920,12ª CRS,Região 11 - Sete Povos das Missões,Região 11 - Sete Povos das Missões,Região 11 - Sete Povos das Missões
431930,14ª CRS,Região 14 - Fronteira Noroeste,Região 14 - Fronteira Noroeste,Região 14 - Fronteira Noroeste
431935,2ª CRS,Região 08 - Vale do Caí e Metropolitana,Região 08 - Vale do Caí e Metropolitana,Região 08 - Vale do Caí e Metropolitana
431936,15ª  CRS,Região 20 - Rota da Produção,Região 20 - Rota da Produção,Região 20 - Rota da Produção
431937,12ª CRS,Região 11 - Sete Povos das Missões,Região 11 - Sete Povos das Missões,Região 11 - Sete Povos das Missões
431940,4ª CRS,Região 01 - Verdes Campos,Região 01 - Verdes Campos,Região 01 - Verdes Campos
431950,2ª CRS,Região 08 - Vale do Caí e Metropolitana,Região 08 - Vale do Caí e Metropolitana,Região 08 - Vale do Caí e Metropolitana
431960,4ª CRS,Região 01 - Verdes Campos,Região 01 - Verdes Campos,Região 01 - Verdes Campos
431970,11ª CRS,Região 16 - Alto Uruguai Gaúcho,Região 16 - Alto Uruguai Gaúcho,Região 16 - Alto Uruguai Gaúcho
431971,16ª CRS,Região 29 - Vales e Montanhas,Região 29 - Vales e Montanhas,Região 29 - Vales e Montanhas
431973,17ª CRS,Região 13 - Diversidade,Região 13 - Diversidade,Região 13 - Diversidade
431975,5ª CRS,Região 26 - Uva Vale,Região 26 - Uva Vale,Região 26 - Uva Vale
431980,4ª CRS,Região 02 - Entre Rios,Região 02 - Entre Rios,Região 02 - Entre Rios
431990,1ª CRS,Região 07 - Vale dos Sinos,Região 07 - Vale dos Sinos,Região 07 - Vale dos Sinos
432000,1ª CRS,Região 08 - Vale do Caí e Metropolitana,Região 08 - Vale do Caí e Metropolitana,Região 08 - Vale do Caí e Metropolitana
432010,15ª  CRS,Região 20 - Rota da Produção,Região 20 - Rota da Produção,Região 20 - Rota da Produção
432020,19ª CRS,Região 15 - Caminho das Águas,Região 15 - Caminho das Águas,Região 15 - Caminho das Águas
432023,17ª CRS,Região 13 - Diversidade,Região 13 - Diversidade,Região 13 - Diversidade
432026,8ª CRS,Região 27 - Jacuí Centro,Região 27 - Jacuí Centro,Região 27 - Jacuí Centro
432030,9ª CRS,Região 12 - Portal das Missões,Região 12 - Portal das Missões,Região 12 - Portal das Missões
432032,14ª CRS,Região 14 - Fronteira Noroeste,Região 14 - Fronteira Noroeste,Região 14 - Fronteira Noroeste
432035,2ª CRS,Região 09 - Carbonífera/Costa Doce,Região 09 - Carbonífera/Costa Doce,Região 09 - Carbonífera/Costa Doce
432040,6ª CRS,Região 17 - Planalto,Região 17 - Planalto,Região 17 - Planalto
432045,16ª CRS,Região 29 - Vales e Montanhas,Região 29 - Vales e Montanhas,Região 29 - Vales e Montanhas
432050,6ª CRS,Região 17 - Planalto,Região 17 - Planalto,Região 17 - Planalto
432055,2ª CRS,Região 09 - Carbonífera/Costa Doce,Região 09 - Carbonífera/Costa Doce,Região 09 - Carbonífera/Costa Doce
432057,12ª CRS,Região 11 - Sete Povos das Missões,Região 11 - Sete Povos das Missões,Região 11 - Sete Povos das Missões
432060,11ª CRS,Região 16 - Alto Uruguai Gaúcho,Região 16 - Alto Uruguai Gaúcho,Região 16 - Alto Uruguai Gaúcho
432065,4ª CRS,Região 01 - Verdes Campos,Região 01 - Verdes Campos,Região 01 - Verdes Campos
432067,13ª CRS,Região 28 - Vinte e Oito,Região 28 - Vinte e Oito,Região 28 - Vinte e Oito
432070,8ª CRS,Região 27 - Jacuí Centro,Região 27 - Jacuí Centro,Região 27 - Jacuí Centro
432080,6ª CRS,Região 19 - Botucaraí,Região 19 - Botucaraí,Região 19 - Botucaraí
432085,16ª CRS,Região 08 - Vale do Caí e Metropolitana,Região 08 - Vale do Caí e Metropolitana,Região 08 - Vale do Caí e Metropolitana
432090,6ª CRS,Região 18 - Araucárias,Região 18 - Araucárias,Região 18 - Araucárias
432100,6ª CRS,Região 19 - Botucaraí,Região 19 - Botucaraí,Região 19 - Botucaraí
432110,2ª CRS,Região 09 - Carbonífera/Costa Doce,Região 09 - Carbonífera/Costa Doce,Região 09 - Carbonífera/Costa Doce
432120,2ª CRS,Região 06 - Vale do Paranhana e Costa Serr,Região 06 - Vale do Paranhana e Costa Serr,Região 06 - Vale do Paranhana e Costa Serra
432130,16ª CRS,Região 30 - Vale da Luz,Região 30 - Vale da Luz,Região 30 - Vale da Luz
432132,19ª CRS,Região 15 - Caminho das Águas,Região 15 - Caminho das Águas,Região 15 - Caminho das Águas
432135,18ª CRS,Região 05 - Bons Ventos,Região 05 - Bons Ventos,Região 05 - Bons Ventos
432140,19ª CRS,Região 15 - Caminho das Águas,Região 15 - Caminho das Águas,Região 15 - Caminho das Águas
432143,18ª CRS,Região 04 - Belas Praias,Região 04 - Belas Praias,Região 04 - Belas Praias
432145,16ª CRS,Região 30 - Vale da Luz,Região 30 - Vale da Luz,Região 30 - Vale da Luz
432146,6ª CRS,Região 19 - Botucaraí,Região 19 - Botucaraí,Região 19 - Botucaraí
432147,19ª CRS,Região 15 - Caminho das Águas,Região 15 - Caminho das Águas,Região 15 - Caminho das Águas
432149,4ª CRS,Região 01 - Verdes Campos,Região 01 - Verdes Campos,Região 01 - Verdes Campos
432150,18ª CRS,Região 04 - Belas Praias,Região 04 - Belas Praias,Região 04 - Belas Praias
432160,18ª CRS,Região 05 - Bons Ventos,Região 05 - Bons Ventos,Região 05 - Bons Ventos
432162,16ª CRS,Região 29 - Vales e Montanhas,Região 29 - Vales e Montanhas,Região 29 - Vales e Montanhas
432163,11ª CRS,Região 16 - Alto Uruguai Gaúcho,Região 16 - Alto Uruguai Gaúcho,Região 16 - Alto Uruguai Gaúcho
432166,18ª CRS,Região 04 - Belas Praias,Região 04 - Belas Praias,Região 04 - Belas Praias
432170,2ª CRS,Região 06 - Vale do Paranhana e Costa Serr,Região 06 - Vale do Paranhana e Costa Serr,Região 06 - Vale do Paranhana e Costa Serra
432180,14ª CRS,Região 14 - Fronteira Noroeste,Região 14 - Fronteira Noroeste,Região 14 - Fronteira Noroeste
432183,18ª CRS,Região 04 - Belas Praias,Região 04 - Belas Praias,Região 04 - Belas Praias
432185,15ª  CRS,Região 20 - Rota da Produção,Região 20 - Rota da Produção,Região 20 - Rota da Produção
432190,19ª CRS,Região 15 - Caminho das Águas,Região 15 - Caminho das Águas,Região 15 - Caminho das Águas
432195,15ª  CRS,Região 20 - Rota da Produção,Região 20 - Rota da Produção,Região 20 - Rota da Produção
432200,2ª CRS,Região 08 - Vale do Caí e Metropolitana,Região 08 - Vale do Caí e Metropolitana,Região 08 - Vale do Caí e Metropolitana
432210,14ª CRS,Região 14 - Fronteira Noroeste,Região 14 - Fronteira Noroeste,Região 14 - Fronteira Noroeste
432215,6ª CRS,Região 19 - Botucaraí,Região 19 - Botucaraí,Região 19 - Botucaraí
432218,6ª CRS,Região 18 - Araucárias,Região 18 - Araucárias,Região 18 - Araucárias
432220,4ª CRS,Região 12 - Portal das Missões,Região 12 - Portal das Missões,Região 12 - Portal das Missões
432225,2ª CRS,Região 08 - Vale do Caí e Metropolitana,Região 08 - Vale do Caí e Metropolitana,Região 08 - Vale do Caí e Metropolitana
432230,14ª CRS,Região 14 - Fronteira Noroeste,Região 14 - Fronteira Noroeste,Região 14 - Fronteira Noroeste
432232,3ª CRS,Região 21 - Sul,Região 21 - Sul,Região 21 - Sul
432234,12ª CRS,Região 11 - Sete Povos das Missões,Região 11 - Sete Povos das Missões,Região 11 - Sete Povos das Missões
432235,5ª CRS,Região 25 - Vinhedos e Basalto,Região 25 - Vinhedos e Basalto,Região 25 - Vinhedos e Basalto
432237,4ª CRS,Região 02 - Entre Rios,Região 02 - Entre Rios,Região 02 - Entre Rios
432240,10ª CRS,Região 03 - Fronteira Oeste,Região 03 - Fronteira Oeste,Região 03 - Fronteira Oeste
432250,5ª CRS,Região 24 - Campos de Cima da Serra,Região 24 - Campos de Cima da Serra,Região 24 - Campos de Cima da Serra
432252,13ª CRS,Região 28 - Vinte e Oito,Região 28 - Vinte e Oito,Região 28 - Vinte e Oito
432253,13ª CRS,Região 28 - Vinte e Oito,Região 28 - Vinte e Oito,Região 28 - Vinte e Oito
432254,5ª CRS,Região 26 - Uva Vale,Região 26 - Uva Vale,Região 26 - Uva Vale
432255,6ª CRS,Região 17 - Planalto,Região 17 - Planalto,Região 17 - Planalto
432260,13ª CRS,Região 28 - Vinte e Oito,Região 28 - Vinte e Oito,Região 28 - Vinte e Oito
432270,13ª CRS,Região 28 - Vinte e Oito,Região 28 - Vinte e Oito,Região 28 - Vinte e Oito
432280,5ª CRS,Região 25 - Vinhedos e Basalto,Região 25 - Vinhedos e Basalto,Região 25 - Vinhedos e Basalto
432285,16ª CRS,Região 29 - Vales e Montanhas,Região 29 - Vales e Montanhas,Região 29 - Vales e Montanhas
432290,11ª CRS,Região 16 - Alto Uruguai Gaúcho,Região 16 - Alto Uruguai Gaúcho,Região 16 - Alto Uruguai Gaúcho
432300,1ª CRS,Região 10 - Capital e Vale do Gravataí,Região 10 - Capital e Vale do Gravataí,Região 10 - Capital e Vale do Gravataí
432310,19ª CRS,Região 15 - Caminho das Águas,Região 15 - Caminho das Águas,Região 15 - Caminho das Águas
432320,6ª CRS,Região 17 - Planalto,Região 17 - Planalto,Região 17 - Planalto
432330,5ª CRS,Região 25 - Vinhedos e Basalto,Região 25 - Vinhedos e Basalto,Região 25 - Vinhedos e Basalto
432335,6ª CRS,Região 18 - Araucárias,Região 18 - Araucárias,Região 18 - Araucárias
432340,6ª CRS,Região 17 - Planalto,Região 17 - Planalto,Região 17 - Planalto
432345,4ª CRS,Região 01 - Verdes Campos,Região 01 - Verdes Campos,Região 01 - Verdes Campos
432350,19ª CRS,Região 15 - Caminho das Águas,Região 15 - Caminho das Águas,Região 15 - Caminho das Águas
432360,5ª CRS,Região 25 - Vinhedos e Basalto,Região 25 - Vinhedos e Basalto,Região 25 - Vinhedos e Basalto
432370,19ª CRS,Região 15 - Caminho das Águas,Região 15 - Caminho das Águas,Região 15 - Caminho das Águas
432375,12ª CRS,Região 11 - Sete Povos das Missões,Região 11 - Sete Povos das Missões,Região 11 - Sete Povos das Missões
432377,16ª CRS,Região 30 - Vale da Luz,Região 30 - Vale da Luz,Região 30 - Vale da Luz
432380,18ª CRS,Região 04 - Belas Praias,Região 04 - Belas Praias,Região 04 - Belas Praias
