year,from,to,hospitalizations
1998,"{'latlong': [-44.27497484025333, -5.493289451643147], 'name': 'Macrorregião Leste'}","{'latlong': [-44.27497484025333, -5.493289451643147], 'name': 'Macrorregião Leste'}",387
1998,"{'latlong': [-44.27497484025333, -5.493289451643147], 'name': 'Macrorregião Leste'}","{'latlong': [-44.80345012921731, -2.9260426894763576], 'name': 'Macrorregião Norte'}",12
1998,"{'latlong': [-44.80345012921731, -2.9260426894763576], 'name': 'Macrorregião Norte'}","{'latlong': [-44.80345012921731, -2.9260426894763576], 'name': 'Macrorregião Norte'}",836
1998,"{'latlong': [-44.80345012921731, -2.9260426894763576], 'name': 'Macrorregião Norte'}","{'latlong': [-46.430337294867904, -6.654407452005538], 'name': 'Macrorregião Sul'}",1
1998,"{'latlong': [-46.430337294867904, -6.654407452005538], 'name': 'Macrorregião Sul'}","{'latlong': [-44.27497484025333, -5.493289451643147], 'name': 'Macrorregião Leste'}",1
1998,"{'latlong': [-46.430337294867904, -6.654407452005538], 'name': 'Macrorregião Sul'}","{'latlong': [-46.430337294867904, -6.654407452005538], 'name': 'Macrorregião Sul'}",173
1999,"{'latlong': [-44.27497484025333, -5.493289451643147], 'name': 'Macrorregião Leste'}","{'latlong': [-44.27497484025333, -5.493289451643147], 'name': 'Macrorregião Leste'}",547
1999,"{'latlong': [-44.27497484025333, -5.493289451643147], 'name': 'Macrorregião Leste'}","{'latlong': [-44.80345012921731, -2.9260426894763576], 'name': 'Macrorregião Norte'}",18
1999,"{'latlong': [-44.80345012921731, -2.9260426894763576], 'name': 'Macrorregião Norte'}","{'latlong': [-44.27497484025333, -5.493289451643147], 'name': 'Macrorregião Leste'}",6
1999,"{'latlong': [-44.80345012921731, -2.9260426894763576], 'name': 'Macrorregião Norte'}","{'latlong': [-44.80345012921731, -2.9260426894763576], 'name': 'Macrorregião Norte'}",1137
1999,"{'latlong': [-46.430337294867904, -6.654407452005538], 'name': 'Macrorregião Sul'}","{'latlong': [-44.27497484025333, -5.493289451643147], 'name': 'Macrorregião Leste'}",2
1999,"{'latlong': [-46.430337294867904, -6.654407452005538], 'name': 'Macrorregião Sul'}","{'latlong': [-44.80345012921731, -2.9260426894763576], 'name': 'Macrorregião Norte'}",7
1999,"{'latlong': [-46.430337294867904, -6.654407452005538], 'name': 'Macrorregião Sul'}","{'latlong': [-46.430337294867904, -6.654407452005538], 'name': 'Macrorregião Sul'}",230
2000,"{'latlong': [-44.27497484025333, -5.493289451643147], 'name': 'Macrorregião Leste'}","{'latlong': [-44.27497484025333, -5.493289451643147], 'name': 'Macrorregião Leste'}",555
2000,"{'latlong': [-44.27497484025333, -5.493289451643147], 'name': 'Macrorregião Leste'}","{'latlong': [-44.80345012921731, -2.9260426894763576], 'name': 'Macrorregião Norte'}",16
2000,"{'latlong': [-44.27497484025333, -5.493289451643147], 'name': 'Macrorregião Leste'}","{'latlong': [-46.430337294867904, -6.654407452005538], 'name': 'Macrorregião Sul'}",2
2000,"{'latlong': [-44.80345012921731, -2.9260426894763576], 'name': 'Macrorregião Norte'}","{'latlong': [-44.27497484025333, -5.493289451643147], 'name': 'Macrorregião Leste'}",6
2000,"{'latlong': [-44.80345012921731, -2.9260426894763576], 'name': 'Macrorregião Norte'}","{'latlong': [-44.80345012921731, -2.9260426894763576], 'name': 'Macrorregião Norte'}",1347
2000,"{'latlong': [-44.80345012921731, -2.9260426894763576], 'name': 'Macrorregião Norte'}","{'latlong': [-46.430337294867904, -6.654407452005538], 'name': 'Macrorregião Sul'}",1
2000,"{'latlong': [-46.430337294867904, -6.654407452005538], 'name': 'Macrorregião Sul'}","{'latlong': [-44.27497484025333, -5.493289451643147], 'name': 'Macrorregião Leste'}",2
2000,"{'latlong': [-46.430337294867904, -6.654407452005538], 'name': 'Macrorregião Sul'}","{'latlong': [-44.80345012921731, -2.9260426894763576], 'name': 'Macrorregião Norte'}",7
2000,"{'latlong': [-46.430337294867904, -6.654407452005538], 'name': 'Macrorregião Sul'}","{'latlong': [-46.430337294867904, -6.654407452005538], 'name': 'Macrorregião Sul'}",324
2001,"{'latlong': [-44.27497484025333, -5.493289451643147], 'name': 'Macrorregião Leste'}","{'latlong': [-44.27497484025333, -5.493289451643147], 'name': 'Macrorregião Leste'}",648
2001,"{'latlong': [-44.27497484025333, -5.493289451643147], 'name': 'Macrorregião Leste'}","{'latlong': [-44.80345012921731, -2.9260426894763576], 'name': 'Macrorregião Norte'}",13
2001,"{'latlong': [-44.80345012921731, -2.9260426894763576], 'name': 'Macrorregião Norte'}","{'latlong': [-44.27497484025333, -5.493289451643147], 'name': 'Macrorregião Leste'}",7
2001,"{'latlong': [-44.80345012921731, -2.9260426894763576], 'name': 'Macrorregião Norte'}","{'latlong': [-44.80345012921731, -2.9260426894763576], 'name': 'Macrorregião Norte'}",1511
2001,"{'latlong': [-46.430337294867904, -6.654407452005538], 'name': 'Macrorregião Sul'}","{'latlong': [-44.27497484025333, -5.493289451643147], 'name': 'Macrorregião Leste'}",1
2001,"{'latlong': [-46.430337294867904, -6.654407452005538], 'name': 'Macrorregião Sul'}","{'latlong': [-44.80345012921731, -2.9260426894763576], 'name': 'Macrorregião Norte'}",9
2001,"{'latlong': [-46.430337294867904, -6.654407452005538], 'name': 'Macrorregião Sul'}","{'latlong': [-46.430337294867904, -6.654407452005538], 'name': 'Macrorregião Sul'}",321
2002,"{'latlong': [-44.27497484025333, -5.493289451643147], 'name': 'Macrorregião Leste'}","{'latlong': [-44.27497484025333, -5.493289451643147], 'name': 'Macrorregião Leste'}",604
2002,"{'latlong': [-44.27497484025333, -5.493289451643147], 'name': 'Macrorregião Leste'}","{'latlong': [-44.80345012921731, -2.9260426894763576], 'name': 'Macrorregião Norte'}",10
2002,"{'latlong': [-44.80345012921731, -2.9260426894763576], 'name': 'Macrorregião Norte'}","{'latlong': [-44.27497484025333, -5.493289451643147], 'name': 'Macrorregião Leste'}",6
2002,"{'latlong': [-44.80345012921731, -2.9260426894763576], 'name': 'Macrorregião Norte'}","{'latlong': [-44.80345012921731, -2.9260426894763576], 'name': 'Macrorregião Norte'}",1206
2002,"{'latlong': [-44.80345012921731, -2.9260426894763576], 'name': 'Macrorregião Norte'}","{'latlong': [-46.430337294867904, -6.654407452005538], 'name': 'Macrorregião Sul'}",1
2002,"{'latlong': [-46.430337294867904, -6.654407452005538], 'name': 'Macrorregião Sul'}","{'latlong': [-44.80345012921731, -2.9260426894763576], 'name': 'Macrorregião Norte'}",12
2002,"{'latlong': [-46.430337294867904, -6.654407452005538], 'name': 'Macrorregião Sul'}","{'latlong': [-46.430337294867904, -6.654407452005538], 'name': 'Macrorregião Sul'}",301
2003,"{'latlong': [-44.27497484025333, -5.493289451643147], 'name': 'Macrorregião Leste'}","{'latlong': [-44.27497484025333, -5.493289451643147], 'name': 'Macrorregião Leste'}",655
2003,"{'latlong': [-44.27497484025333, -5.493289451643147], 'name': 'Macrorregião Leste'}","{'latlong': [-44.80345012921731, -2.9260426894763576], 'name': 'Macrorregião Norte'}",12
2003,"{'latlong': [-44.80345012921731, -2.9260426894763576], 'name': 'Macrorregião Norte'}","{'latlong': [-44.27497484025333, -5.493289451643147], 'name': 'Macrorregião Leste'}",8
2003,"{'latlong': [-44.80345012921731, -2.9260426894763576], 'name': 'Macrorregião Norte'}","{'latlong': [-44.80345012921731, -2.9260426894763576], 'name': 'Macrorregião Norte'}",1222
2003,"{'latlong': [-46.430337294867904, -6.654407452005538], 'name': 'Macrorregião Sul'}","{'latlong': [-44.80345012921731, -2.9260426894763576], 'name': 'Macrorregião Norte'}",1
2003,"{'latlong': [-46.430337294867904, -6.654407452005538], 'name': 'Macrorregião Sul'}","{'latlong': [-46.430337294867904, -6.654407452005538], 'name': 'Macrorregião Sul'}",277
2004,"{'latlong': [-44.27497484025333, -5.493289451643147], 'name': 'Macrorregião Leste'}","{'latlong': [-44.27497484025333, -5.493289451643147], 'name': 'Macrorregião Leste'}",605
2004,"{'latlong': [-44.27497484025333, -5.493289451643147], 'name': 'Macrorregião Leste'}","{'latlong': [-44.80345012921731, -2.9260426894763576], 'name': 'Macrorregião Norte'}",18
2004,"{'latlong': [-44.80345012921731, -2.9260426894763576], 'name': 'Macrorregião Norte'}","{'latlong': [-44.27497484025333, -5.493289451643147], 'name': 'Macrorregião Leste'}",5
2004,"{'latlong': [-44.80345012921731, -2.9260426894763576], 'name': 'Macrorregião Norte'}","{'latlong': [-44.80345012921731, -2.9260426894763576], 'name': 'Macrorregião Norte'}",1270
2004,"{'latlong': [-44.80345012921731, -2.9260426894763576], 'name': 'Macrorregião Norte'}","{'latlong': [-46.430337294867904, -6.654407452005538], 'name': 'Macrorregião Sul'}",1
2004,"{'latlong': [-46.430337294867904, -6.654407452005538], 'name': 'Macrorregião Sul'}","{'latlong': [-44.27497484025333, -5.493289451643147], 'name': 'Macrorregião Leste'}",1
2004,"{'latlong': [-46.430337294867904, -6.654407452005538], 'name': 'Macrorregião Sul'}","{'latlong': [-44.80345012921731, -2.9260426894763576], 'name': 'Macrorregião Norte'}",11
2004,"{'latlong': [-46.430337294867904, -6.654407452005538], 'name': 'Macrorregião Sul'}","{'latlong': [-46.430337294867904, -6.654407452005538], 'name': 'Macrorregião Sul'}",268
2005,"{'latlong': [-44.27497484025333, -5.493289451643147], 'name': 'Macrorregião Leste'}","{'latlong': [-44.27497484025333, -5.493289451643147], 'name': 'Macrorregião Leste'}",789
2005,"{'latlong': [-44.27497484025333, -5.493289451643147], 'name': 'Macrorregião Leste'}","{'latlong': [-44.80345012921731, -2.9260426894763576], 'name': 'Macrorregião Norte'}",13
2005,"{'latlong': [-44.27497484025333, -5.493289451643147], 'name': 'Macrorregião Leste'}","{'latlong': [-46.430337294867904, -6.654407452005538], 'name': 'Macrorregião Sul'}",1
2005,"{'latlong': [-44.80345012921731, -2.9260426894763576], 'name': 'Macrorregião Norte'}","{'latlong': [-44.27497484025333, -5.493289451643147], 'name': 'Macrorregião Leste'}",2
2005,"{'latlong': [-44.80345012921731, -2.9260426894763576], 'name': 'Macrorregião Norte'}","{'latlong': [-44.80345012921731, -2.9260426894763576], 'name': 'Macrorregião Norte'}",1191
2005,"{'latlong': [-46.430337294867904, -6.654407452005538], 'name': 'Macrorregião Sul'}","{'latlong': [-44.27497484025333, -5.493289451643147], 'name': 'Macrorregião Leste'}",1
2005,"{'latlong': [-46.430337294867904, -6.654407452005538], 'name': 'Macrorregião Sul'}","{'latlong': [-44.80345012921731, -2.9260426894763576], 'name': 'Macrorregião Norte'}",4
2005,"{'latlong': [-46.430337294867904, -6.654407452005538], 'name': 'Macrorregião Sul'}","{'latlong': [-46.430337294867904, -6.654407452005538], 'name': 'Macrorregião Sul'}",338
2006,"{'latlong': [-44.27497484025333, -5.493289451643147], 'name': 'Macrorregião Leste'}","{'latlong': [-44.27497484025333, -5.493289451643147], 'name': 'Macrorregião Leste'}",886
2006,"{'latlong': [-44.27497484025333, -5.493289451643147], 'name': 'Macrorregião Leste'}","{'latlong': [-44.80345012921731, -2.9260426894763576], 'name': 'Macrorregião Norte'}",18
2006,"{'latlong': [-44.80345012921731, -2.9260426894763576], 'name': 'Macrorregião Norte'}","{'latlong': [-44.27497484025333, -5.493289451643147], 'name': 'Macrorregião Leste'}",3
2006,"{'latlong': [-44.80345012921731, -2.9260426894763576], 'name': 'Macrorregião Norte'}","{'latlong': [-44.80345012921731, -2.9260426894763576], 'name': 'Macrorregião Norte'}",1157
2006,"{'latlong': [-46.430337294867904, -6.654407452005538], 'name': 'Macrorregião Sul'}","{'latlong': [-44.80345012921731, -2.9260426894763576], 'name': 'Macrorregião Norte'}",4
2006,"{'latlong': [-46.430337294867904, -6.654407452005538], 'name': 'Macrorregião Sul'}","{'latlong': [-46.430337294867904, -6.654407452005538], 'name': 'Macrorregião Sul'}",392
2007,"{'latlong': [-44.27497484025333, -5.493289451643147], 'name': 'Macrorregião Leste'}","{'latlong': [-44.27497484025333, -5.493289451643147], 'name': 'Macrorregião Leste'}",866
2007,"{'latlong': [-44.27497484025333, -5.493289451643147], 'name': 'Macrorregião Leste'}","{'latlong': [-44.80345012921731, -2.9260426894763576], 'name': 'Macrorregião Norte'}",8
2007,"{'latlong': [-44.80345012921731, -2.9260426894763576], 'name': 'Macrorregião Norte'}","{'latlong': [-44.27497484025333, -5.493289451643147], 'name': 'Macrorregião Leste'}",2
2007,"{'latlong': [-44.80345012921731, -2.9260426894763576], 'name': 'Macrorregião Norte'}","{'latlong': [-44.80345012921731, -2.9260426894763576], 'name': 'Macrorregião Norte'}",1133
2007,"{'latlong': [-46.430337294867904, -6.654407452005538], 'name': 'Macrorregião Sul'}","{'latlong': [-44.27497484025333, -5.493289451643147], 'name': 'Macrorregião Leste'}",1
2007,"{'latlong': [-46.430337294867904, -6.654407452005538], 'name': 'Macrorregião Sul'}","{'latlong': [-44.80345012921731, -2.9260426894763576], 'name': 'Macrorregião Norte'}",4
2007,"{'latlong': [-46.430337294867904, -6.654407452005538], 'name': 'Macrorregião Sul'}","{'latlong': [-46.430337294867904, -6.654407452005538], 'name': 'Macrorregião Sul'}",623
2008,"{'latlong': [-44.27497484025333, -5.493289451643147], 'name': 'Macrorregião Leste'}","{'latlong': [-44.27497484025333, -5.493289451643147], 'name': 'Macrorregião Leste'}",1007
2008,"{'latlong': [-44.27497484025333, -5.493289451643147], 'name': 'Macrorregião Leste'}","{'latlong': [-44.80345012921731, -2.9260426894763576], 'name': 'Macrorregião Norte'}",26
2008,"{'latlong': [-44.27497484025333, -5.493289451643147], 'name': 'Macrorregião Leste'}","{'latlong': [-46.430337294867904, -6.654407452005538], 'name': 'Macrorregião Sul'}",1
2008,"{'latlong': [-44.80345012921731, -2.9260426894763576], 'name': 'Macrorregião Norte'}","{'latlong': [-44.27497484025333, -5.493289451643147], 'name': 'Macrorregião Leste'}",2
2008,"{'latlong': [-44.80345012921731, -2.9260426894763576], 'name': 'Macrorregião Norte'}","{'latlong': [-44.80345012921731, -2.9260426894763576], 'name': 'Macrorregião Norte'}",1354
2008,"{'latlong': [-46.430337294867904, -6.654407452005538], 'name': 'Macrorregião Sul'}","{'latlong': [-44.27497484025333, -5.493289451643147], 'name': 'Macrorregião Leste'}",1
2008,"{'latlong': [-46.430337294867904, -6.654407452005538], 'name': 'Macrorregião Sul'}","{'latlong': [-44.80345012921731, -2.9260426894763576], 'name': 'Macrorregião Norte'}",1
2008,"{'latlong': [-46.430337294867904, -6.654407452005538], 'name': 'Macrorregião Sul'}","{'latlong': [-46.430337294867904, -6.654407452005538], 'name': 'Macrorregião Sul'}",891
2009,"{'latlong': [-44.27497484025333, -5.493289451643147], 'name': 'Macrorregião Leste'}","{'latlong': [-44.27497484025333, -5.493289451643147], 'name': 'Macrorregião Leste'}",1259
2009,"{'latlong': [-44.27497484025333, -5.493289451643147], 'name': 'Macrorregião Leste'}","{'latlong': [-44.80345012921731, -2.9260426894763576], 'name': 'Macrorregião Norte'}",10
2009,"{'latlong': [-44.27497484025333, -5.493289451643147], 'name': 'Macrorregião Leste'}","{'latlong': [-46.430337294867904, -6.654407452005538], 'name': 'Macrorregião Sul'}",2
2009,"{'latlong': [-44.80345012921731, -2.9260426894763576], 'name': 'Macrorregião Norte'}","{'latlong': [-44.27497484025333, -5.493289451643147], 'name': 'Macrorregião Leste'}",2
2009,"{'latlong': [-44.80345012921731, -2.9260426894763576], 'name': 'Macrorregião Norte'}","{'latlong': [-44.80345012921731, -2.9260426894763576], 'name': 'Macrorregião Norte'}",1814
2009,"{'latlong': [-44.80345012921731, -2.9260426894763576], 'name': 'Macrorregião Norte'}","{'latlong': [-46.430337294867904, -6.654407452005538], 'name': 'Macrorregião Sul'}",1
2009,"{'latlong': [-46.430337294867904, -6.654407452005538], 'name': 'Macrorregião Sul'}","{'latlong': [-44.27497484025333, -5.493289451643147], 'name': 'Macrorregião Leste'}",4
2009,"{'latlong': [-46.430337294867904, -6.654407452005538], 'name': 'Macrorregião Sul'}","{'latlong': [-44.80345012921731, -2.9260426894763576], 'name': 'Macrorregião Norte'}",2
2009,"{'latlong': [-46.430337294867904, -6.654407452005538], 'name': 'Macrorregião Sul'}","{'latlong': [-46.430337294867904, -6.654407452005538], 'name': 'Macrorregião Sul'}",1008
2010,"{'latlong': [-44.27497484025333, -5.493289451643147], 'name': 'Macrorregião Leste'}","{'latlong': [-44.27497484025333, -5.493289451643147], 'name': 'Macrorregião Leste'}",1508
2010,"{'latlong': [-44.27497484025333, -5.493289451643147], 'name': 'Macrorregião Leste'}","{'latlong': [-44.80345012921731, -2.9260426894763576], 'name': 'Macrorregião Norte'}",38
2010,"{'latlong': [-44.27497484025333, -5.493289451643147], 'name': 'Macrorregião Leste'}","{'latlong': [-46.430337294867904, -6.654407452005538], 'name': 'Macrorregião Sul'}",1
2010,"{'latlong': [-44.80345012921731, -2.9260426894763576], 'name': 'Macrorregião Norte'}","{'latlong': [-44.27497484025333, -5.493289451643147], 'name': 'Macrorregião Leste'}",14
2010,"{'latlong': [-44.80345012921731, -2.9260426894763576], 'name': 'Macrorregião Norte'}","{'latlong': [-44.80345012921731, -2.9260426894763576], 'name': 'Macrorregião Norte'}",2211
2010,"{'latlong': [-44.80345012921731, -2.9260426894763576], 'name': 'Macrorregião Norte'}","{'latlong': [-46.430337294867904, -6.654407452005538], 'name': 'Macrorregião Sul'}",4
2010,"{'latlong': [-46.430337294867904, -6.654407452005538], 'name': 'Macrorregião Sul'}","{'latlong': [-44.27497484025333, -5.493289451643147], 'name': 'Macrorregião Leste'}",2
2010,"{'latlong': [-46.430337294867904, -6.654407452005538], 'name': 'Macrorregião Sul'}","{'latlong': [-44.80345012921731, -2.9260426894763576], 'name': 'Macrorregião Norte'}",3
2010,"{'latlong': [-46.430337294867904, -6.654407452005538], 'name': 'Macrorregião Sul'}","{'latlong': [-46.430337294867904, -6.654407452005538], 'name': 'Macrorregião Sul'}",1156
2011,"{'latlong': [-44.27497484025333, -5.493289451643147], 'name': 'Macrorregião Leste'}","{'latlong': [-44.27497484025333, -5.493289451643147], 'name': 'Macrorregião Leste'}",2139
2011,"{'latlong': [-44.27497484025333, -5.493289451643147], 'name': 'Macrorregião Leste'}","{'latlong': [-44.80345012921731, -2.9260426894763576], 'name': 'Macrorregião Norte'}",38
2011,"{'latlong': [-44.27497484025333, -5.493289451643147], 'name': 'Macrorregião Leste'}","{'latlong': [-46.430337294867904, -6.654407452005538], 'name': 'Macrorregião Sul'}",1
2011,"{'latlong': [-44.80345012921731, -2.9260426894763576], 'name': 'Macrorregião Norte'}","{'latlong': [-44.27497484025333, -5.493289451643147], 'name': 'Macrorregião Leste'}",12
2011,"{'latlong': [-44.80345012921731, -2.9260426894763576], 'name': 'Macrorregião Norte'}","{'latlong': [-44.80345012921731, -2.9260426894763576], 'name': 'Macrorregião Norte'}",3170
2011,"{'latlong': [-44.80345012921731, -2.9260426894763576], 'name': 'Macrorregião Norte'}","{'latlong': [-46.430337294867904, -6.654407452005538], 'name': 'Macrorregião Sul'}",1
2011,"{'latlong': [-46.430337294867904, -6.654407452005538], 'name': 'Macrorregião Sul'}","{'latlong': [-44.27497484025333, -5.493289451643147], 'name': 'Macrorregião Leste'}",4
2011,"{'latlong': [-46.430337294867904, -6.654407452005538], 'name': 'Macrorregião Sul'}","{'latlong': [-44.80345012921731, -2.9260426894763576], 'name': 'Macrorregião Norte'}",4
2011,"{'latlong': [-46.430337294867904, -6.654407452005538], 'name': 'Macrorregião Sul'}","{'latlong': [-46.430337294867904, -6.654407452005538], 'name': 'Macrorregião Sul'}",1206
2012,"{'latlong': [-44.27497484025333, -5.493289451643147], 'name': 'Macrorregião Leste'}","{'latlong': [-44.27497484025333, -5.493289451643147], 'name': 'Macrorregião Leste'}",1906
2012,"{'latlong': [-44.27497484025333, -5.493289451643147], 'name': 'Macrorregião Leste'}","{'latlong': [-44.80345012921731, -2.9260426894763576], 'name': 'Macrorregião Norte'}",23
2012,"{'latlong': [-44.27497484025333, -5.493289451643147], 'name': 'Macrorregião Leste'}","{'latlong': [-46.430337294867904, -6.654407452005538], 'name': 'Macrorregião Sul'}",3
2012,"{'latlong': [-44.80345012921731, -2.9260426894763576], 'name': 'Macrorregião Norte'}","{'latlong': [-44.27497484025333, -5.493289451643147], 'name': 'Macrorregião Leste'}",16
2012,"{'latlong': [-44.80345012921731, -2.9260426894763576], 'name': 'Macrorregião Norte'}","{'latlong': [-44.80345012921731, -2.9260426894763576], 'name': 'Macrorregião Norte'}",3241
2012,"{'latlong': [-44.80345012921731, -2.9260426894763576], 'name': 'Macrorregião Norte'}","{'latlong': [-46.430337294867904, -6.654407452005538], 'name': 'Macrorregião Sul'}",5
2012,"{'latlong': [-46.430337294867904, -6.654407452005538], 'name': 'Macrorregião Sul'}","{'latlong': [-44.27497484025333, -5.493289451643147], 'name': 'Macrorregião Leste'}",4
2012,"{'latlong': [-46.430337294867904, -6.654407452005538], 'name': 'Macrorregião Sul'}","{'latlong': [-44.80345012921731, -2.9260426894763576], 'name': 'Macrorregião Norte'}",6
2012,"{'latlong': [-46.430337294867904, -6.654407452005538], 'name': 'Macrorregião Sul'}","{'latlong': [-46.430337294867904, -6.654407452005538], 'name': 'Macrorregião Sul'}",1218
2013,"{'latlong': [-44.27497484025333, -5.493289451643147], 'name': 'Macrorregião Leste'}","{'latlong': [-44.27497484025333, -5.493289451643147], 'name': 'Macrorregião Leste'}",2439
2013,"{'latlong': [-44.27497484025333, -5.493289451643147], 'name': 'Macrorregião Leste'}","{'latlong': [-44.80345012921731, -2.9260426894763576], 'name': 'Macrorregião Norte'}",18
2013,"{'latlong': [-44.27497484025333, -5.493289451643147], 'name': 'Macrorregião Leste'}","{'latlong': [-46.430337294867904, -6.654407452005538], 'name': 'Macrorregião Sul'}",1
2013,"{'latlong': [-44.80345012921731, -2.9260426894763576], 'name': 'Macrorregião Norte'}","{'latlong': [-44.27497484025333, -5.493289451643147], 'name': 'Macrorregião Leste'}",34
2013,"{'latlong': [-44.80345012921731, -2.9260426894763576], 'name': 'Macrorregião Norte'}","{'latlong': [-44.80345012921731, -2.9260426894763576], 'name': 'Macrorregião Norte'}",3550
2013,"{'latlong': [-46.430337294867904, -6.654407452005538], 'name': 'Macrorregião Sul'}","{'latlong': [-44.27497484025333, -5.493289451643147], 'name': 'Macrorregião Leste'}",8
2013,"{'latlong': [-46.430337294867904, -6.654407452005538], 'name': 'Macrorregião Sul'}","{'latlong': [-44.80345012921731, -2.9260426894763576], 'name': 'Macrorregião Norte'}",2
2013,"{'latlong': [-46.430337294867904, -6.654407452005538], 'name': 'Macrorregião Sul'}","{'latlong': [-46.430337294867904, -6.654407452005538], 'name': 'Macrorregião Sul'}",1835
2014,"{'latlong': [-44.27497484025333, -5.493289451643147], 'name': 'Macrorregião Leste'}","{'latlong': [-44.27497484025333, -5.493289451643147], 'name': 'Macrorregião Leste'}",2656
2014,"{'latlong': [-44.27497484025333, -5.493289451643147], 'name': 'Macrorregião Leste'}","{'latlong': [-44.80345012921731, -2.9260426894763576], 'name': 'Macrorregião Norte'}",39
2014,"{'latlong': [-44.80345012921731, -2.9260426894763576], 'name': 'Macrorregião Norte'}","{'latlong': [-44.27497484025333, -5.493289451643147], 'name': 'Macrorregião Leste'}",33
2014,"{'latlong': [-44.80345012921731, -2.9260426894763576], 'name': 'Macrorregião Norte'}","{'latlong': [-44.80345012921731, -2.9260426894763576], 'name': 'Macrorregião Norte'}",4165
2014,"{'latlong': [-44.80345012921731, -2.9260426894763576], 'name': 'Macrorregião Norte'}","{'latlong': [-46.430337294867904, -6.654407452005538], 'name': 'Macrorregião Sul'}",4
2014,"{'latlong': [-46.430337294867904, -6.654407452005538], 'name': 'Macrorregião Sul'}","{'latlong': [-44.27497484025333, -5.493289451643147], 'name': 'Macrorregião Leste'}",4
2014,"{'latlong': [-46.430337294867904, -6.654407452005538], 'name': 'Macrorregião Sul'}","{'latlong': [-44.80345012921731, -2.9260426894763576], 'name': 'Macrorregião Norte'}",4
2014,"{'latlong': [-46.430337294867904, -6.654407452005538], 'name': 'Macrorregião Sul'}","{'latlong': [-46.430337294867904, -6.654407452005538], 'name': 'Macrorregião Sul'}",1735
2015,"{'latlong': [-44.27497484025333, -5.493289451643147], 'name': 'Macrorregião Leste'}","{'latlong': [-44.27497484025333, -5.493289451643147], 'name': 'Macrorregião Leste'}",2937
2015,"{'latlong': [-44.27497484025333, -5.493289451643147], 'name': 'Macrorregião Leste'}","{'latlong': [-44.80345012921731, -2.9260426894763576], 'name': 'Macrorregião Norte'}",45
2015,"{'latlong': [-44.27497484025333, -5.493289451643147], 'name': 'Macrorregião Leste'}","{'latlong': [-46.430337294867904, -6.654407452005538], 'name': 'Macrorregião Sul'}",6
2015,"{'latlong': [-44.80345012921731, -2.9260426894763576], 'name': 'Macrorregião Norte'}","{'latlong': [-44.27497484025333, -5.493289451643147], 'name': 'Macrorregião Leste'}",26
2015,"{'latlong': [-44.80345012921731, -2.9260426894763576], 'name': 'Macrorregião Norte'}","{'latlong': [-44.80345012921731, -2.9260426894763576], 'name': 'Macrorregião Norte'}",4151
2015,"{'latlong': [-44.80345012921731, -2.9260426894763576], 'name': 'Macrorregião Norte'}","{'latlong': [-46.430337294867904, -6.654407452005538], 'name': 'Macrorregião Sul'}",3
2015,"{'latlong': [-46.430337294867904, -6.654407452005538], 'name': 'Macrorregião Sul'}","{'latlong': [-44.27497484025333, -5.493289451643147], 'name': 'Macrorregião Leste'}",5
2015,"{'latlong': [-46.430337294867904, -6.654407452005538], 'name': 'Macrorregião Sul'}","{'latlong': [-44.80345012921731, -2.9260426894763576], 'name': 'Macrorregião Norte'}",11
2015,"{'latlong': [-46.430337294867904, -6.654407452005538], 'name': 'Macrorregião Sul'}","{'latlong': [-46.430337294867904, -6.654407452005538], 'name': 'Macrorregião Sul'}",1855
2016,"{'latlong': [-44.27497484025333, -5.493289451643147], 'name': 'Macrorregião Leste'}","{'latlong': [-44.27497484025333, -5.493289451643147], 'name': 'Macrorregião Leste'}",2351
2016,"{'latlong': [-44.27497484025333, -5.493289451643147], 'name': 'Macrorregião Leste'}","{'latlong': [-44.80345012921731, -2.9260426894763576], 'name': 'Macrorregião Norte'}",40
2016,"{'latlong': [-44.27497484025333, -5.493289451643147], 'name': 'Macrorregião Leste'}","{'latlong': [-46.430337294867904, -6.654407452005538], 'name': 'Macrorregião Sul'}",6
2016,"{'latlong': [-44.80345012921731, -2.9260426894763576], 'name': 'Macrorregião Norte'}","{'latlong': [-44.27497484025333, -5.493289451643147], 'name': 'Macrorregião Leste'}",28
2016,"{'latlong': [-44.80345012921731, -2.9260426894763576], 'name': 'Macrorregião Norte'}","{'latlong': [-44.80345012921731, -2.9260426894763576], 'name': 'Macrorregião Norte'}",4038
2016,"{'latlong': [-44.80345012921731, -2.9260426894763576], 'name': 'Macrorregião Norte'}","{'latlong': [-46.430337294867904, -6.654407452005538], 'name': 'Macrorregião Sul'}",11
2016,"{'latlong': [-46.430337294867904, -6.654407452005538], 'name': 'Macrorregião Sul'}","{'latlong': [-44.27497484025333, -5.493289451643147], 'name': 'Macrorregião Leste'}",3
2016,"{'latlong': [-46.430337294867904, -6.654407452005538], 'name': 'Macrorregião Sul'}","{'latlong': [-44.80345012921731, -2.9260426894763576], 'name': 'Macrorregião Norte'}",10
2016,"{'latlong': [-46.430337294867904, -6.654407452005538], 'name': 'Macrorregião Sul'}","{'latlong': [-46.430337294867904, -6.654407452005538], 'name': 'Macrorregião Sul'}",1424
2017,"{'latlong': [-44.27497484025333, -5.493289451643147], 'name': 'Macrorregião Leste'}","{'latlong': [-44.27497484025333, -5.493289451643147], 'name': 'Macrorregião Leste'}",2841
2017,"{'latlong': [-44.27497484025333, -5.493289451643147], 'name': 'Macrorregião Leste'}","{'latlong': [-44.80345012921731, -2.9260426894763576], 'name': 'Macrorregião Norte'}",40
2017,"{'latlong': [-44.27497484025333, -5.493289451643147], 'name': 'Macrorregião Leste'}","{'latlong': [-46.430337294867904, -6.654407452005538], 'name': 'Macrorregião Sul'}",12
2017,"{'latlong': [-44.80345012921731, -2.9260426894763576], 'name': 'Macrorregião Norte'}","{'latlong': [-44.27497484025333, -5.493289451643147], 'name': 'Macrorregião Leste'}",32
2017,"{'latlong': [-44.80345012921731, -2.9260426894763576], 'name': 'Macrorregião Norte'}","{'latlong': [-44.80345012921731, -2.9260426894763576], 'name': 'Macrorregião Norte'}",4523
2017,"{'latlong': [-44.80345012921731, -2.9260426894763576], 'name': 'Macrorregião Norte'}","{'latlong': [-46.430337294867904, -6.654407452005538], 'name': 'Macrorregião Sul'}",10
2017,"{'latlong': [-46.430337294867904, -6.654407452005538], 'name': 'Macrorregião Sul'}","{'latlong': [-44.27497484025333, -5.493289451643147], 'name': 'Macrorregião Leste'}",8
2017,"{'latlong': [-46.430337294867904, -6.654407452005538], 'name': 'Macrorregião Sul'}","{'latlong': [-44.80345012921731, -2.9260426894763576], 'name': 'Macrorregião Norte'}",9
2017,"{'latlong': [-46.430337294867904, -6.654407452005538], 'name': 'Macrorregião Sul'}","{'latlong': [-46.430337294867904, -6.654407452005538], 'name': 'Macrorregião Sul'}",2028
2018,"{'latlong': [-44.27497484025333, -5.493289451643147], 'name': 'Macrorregião Leste'}","{'latlong': [-44.27497484025333, -5.493289451643147], 'name': 'Macrorregião Leste'}",3114
2018,"{'latlong': [-44.27497484025333, -5.493289451643147], 'name': 'Macrorregião Leste'}","{'latlong': [-44.80345012921731, -2.9260426894763576], 'name': 'Macrorregião Norte'}",50
2018,"{'latlong': [-44.27497484025333, -5.493289451643147], 'name': 'Macrorregião Leste'}","{'latlong': [-46.430337294867904, -6.654407452005538], 'name': 'Macrorregião Sul'}",4
2018,"{'latlong': [-44.80345012921731, -2.9260426894763576], 'name': 'Macrorregião Norte'}","{'latlong': [-44.27497484025333, -5.493289451643147], 'name': 'Macrorregião Leste'}",21
2018,"{'latlong': [-44.80345012921731, -2.9260426894763576], 'name': 'Macrorregião Norte'}","{'latlong': [-44.80345012921731, -2.9260426894763576], 'name': 'Macrorregião Norte'}",4784
2018,"{'latlong': [-44.80345012921731, -2.9260426894763576], 'name': 'Macrorregião Norte'}","{'latlong': [-46.430337294867904, -6.654407452005538], 'name': 'Macrorregião Sul'}",18
2018,"{'latlong': [-46.430337294867904, -6.654407452005538], 'name': 'Macrorregião Sul'}","{'latlong': [-44.27497484025333, -5.493289451643147], 'name': 'Macrorregião Leste'}",7
2018,"{'latlong': [-46.430337294867904, -6.654407452005538], 'name': 'Macrorregião Sul'}","{'latlong': [-44.80345012921731, -2.9260426894763576], 'name': 'Macrorregião Norte'}",16
2018,"{'latlong': [-46.430337294867904, -6.654407452005538], 'name': 'Macrorregião Sul'}","{'latlong': [-46.430337294867904, -6.654407452005538], 'name': 'Macrorregião Sul'}",1877
2019,"{'latlong': [-44.27497484025333, -5.493289451643147], 'name': 'Macrorregião Leste'}","{'latlong': [-44.27497484025333, -5.493289451643147], 'name': 'Macrorregião Leste'}",2845
2019,"{'latlong': [-44.27497484025333, -5.493289451643147], 'name': 'Macrorregião Leste'}","{'latlong': [-44.80345012921731, -2.9260426894763576], 'name': 'Macrorregião Norte'}",97
2019,"{'latlong': [-44.27497484025333, -5.493289451643147], 'name': 'Macrorregião Leste'}","{'latlong': [-46.430337294867904, -6.654407452005538], 'name': 'Macrorregião Sul'}",19
2019,"{'latlong': [-44.80345012921731, -2.9260426894763576], 'name': 'Macrorregião Norte'}","{'latlong': [-44.27497484025333, -5.493289451643147], 'name': 'Macrorregião Leste'}",36
2019,"{'latlong': [-44.80345012921731, -2.9260426894763576], 'name': 'Macrorregião Norte'}","{'latlong': [-44.80345012921731, -2.9260426894763576], 'name': 'Macrorregião Norte'}",5644
2019,"{'latlong': [-44.80345012921731, -2.9260426894763576], 'name': 'Macrorregião Norte'}","{'latlong': [-46.430337294867904, -6.654407452005538], 'name': 'Macrorregião Sul'}",9
2019,"{'latlong': [-46.430337294867904, -6.654407452005538], 'name': 'Macrorregião Sul'}","{'latlong': [-44.27497484025333, -5.493289451643147], 'name': 'Macrorregião Leste'}",18
2019,"{'latlong': [-46.430337294867904, -6.654407452005538], 'name': 'Macrorregião Sul'}","{'latlong': [-44.80345012921731, -2.9260426894763576], 'name': 'Macrorregião Norte'}",15
2019,"{'latlong': [-46.430337294867904, -6.654407452005538], 'name': 'Macrorregião Sul'}","{'latlong': [-46.430337294867904, -6.654407452005538], 'name': 'Macrorregião Sul'}",1851
2020,"{'latlong': [-44.27497484025333, -5.493289451643147], 'name': 'Macrorregião Leste'}","{'latlong': [-44.27497484025333, -5.493289451643147], 'name': 'Macrorregião Leste'}",761
2020,"{'latlong': [-44.27497484025333, -5.493289451643147], 'name': 'Macrorregião Leste'}","{'latlong': [-44.80345012921731, -2.9260426894763576], 'name': 'Macrorregião Norte'}",31
2020,"{'latlong': [-44.27497484025333, -5.493289451643147], 'name': 'Macrorregião Leste'}","{'latlong': [-46.430337294867904, -6.654407452005538], 'name': 'Macrorregião Sul'}",4
2020,"{'latlong': [-44.80345012921731, -2.9260426894763576], 'name': 'Macrorregião Norte'}","{'latlong': [-44.27497484025333, -5.493289451643147], 'name': 'Macrorregião Leste'}",12
2020,"{'latlong': [-44.80345012921731, -2.9260426894763576], 'name': 'Macrorregião Norte'}","{'latlong': [-44.80345012921731, -2.9260426894763576], 'name': 'Macrorregião Norte'}",1686
2020,"{'latlong': [-44.80345012921731, -2.9260426894763576], 'name': 'Macrorregião Norte'}","{'latlong': [-46.430337294867904, -6.654407452005538], 'name': 'Macrorregião Sul'}",5
2020,"{'latlong': [-46.430337294867904, -6.654407452005538], 'name': 'Macrorregião Sul'}","{'latlong': [-44.27497484025333, -5.493289451643147], 'name': 'Macrorregião Leste'}",5
2020,"{'latlong': [-46.430337294867904, -6.654407452005538], 'name': 'Macrorregião Sul'}","{'latlong': [-44.80345012921731, -2.9260426894763576], 'name': 'Macrorregião Norte'}",1
2020,"{'latlong': [-46.430337294867904, -6.654407452005538], 'name': 'Macrorregião Sul'}","{'latlong': [-46.430337294867904, -6.654407452005538], 'name': 'Macrorregião Sul'}",596
