year,from,to,hospitalizations
1994,"{'latlong': [-41.74084505657541, -21.799306433880908], 'name': 'Macrorregião III'}","{'latlong': [-41.74084505657541, -21.799306433880908], 'name': 'Macrorregião III'}",2
1994,"{'latlong': [-42.78374566691811, -22.435006717319105], 'name': 'Macrorregião II'}","{'latlong': [-42.78374566691811, -22.435006717319105], 'name': 'Macrorregião II'}",1
1995,"{'latlong': [-41.74084505657541, -21.799306433880908], 'name': 'Macrorregião III'}","{'latlong': [-41.74084505657541, -21.799306433880908], 'name': 'Macrorregião III'}",2
1995,"{'latlong': [-42.78374566691811, -22.435006717319105], 'name': 'Macrorregião II'}","{'latlong': [-42.78374566691811, -22.435006717319105], 'name': 'Macrorregião II'}",5
1998,"{'latlong': [-41.74084505657541, -21.799306433880908], 'name': 'Macrorregião III'}","{'latlong': [-41.74084505657541, -21.799306433880908], 'name': 'Macrorregião III'}",13620
1998,"{'latlong': [-41.74084505657541, -21.799306433880908], 'name': 'Macrorregião III'}","{'latlong': [-42.78374566691811, -22.435006717319105], 'name': 'Macrorregião II'}",182
1998,"{'latlong': [-41.74084505657541, -21.799306433880908], 'name': 'Macrorregião III'}","{'latlong': [-43.93088259914695, -22.50640773396086], 'name': 'Metropolitana I'}",2
1998,"{'latlong': [-42.78374566691811, -22.435006717319105], 'name': 'Macrorregião II'}","{'latlong': [-41.74084505657541, -21.799306433880908], 'name': 'Macrorregião III'}",376
1998,"{'latlong': [-42.78374566691811, -22.435006717319105], 'name': 'Macrorregião II'}","{'latlong': [-42.78374566691811, -22.435006717319105], 'name': 'Macrorregião II'}",67049
1998,"{'latlong': [-42.78374566691811, -22.435006717319105], 'name': 'Macrorregião II'}","{'latlong': [-43.93088259914695, -22.50640773396086], 'name': 'Metropolitana I'}",763
1998,"{'latlong': [-43.93088259914695, -22.50640773396086], 'name': 'Metropolitana I'}","{'latlong': [-41.74084505657541, -21.799306433880908], 'name': 'Macrorregião III'}",44
1998,"{'latlong': [-43.93088259914695, -22.50640773396086], 'name': 'Metropolitana I'}","{'latlong': [-42.78374566691811, -22.435006717319105], 'name': 'Macrorregião II'}",388
1998,"{'latlong': [-43.93088259914695, -22.50640773396086], 'name': 'Metropolitana I'}","{'latlong': [-43.93088259914695, -22.50640773396086], 'name': 'Metropolitana I'}",9134
1999,"{'latlong': [-41.74084505657541, -21.799306433880908], 'name': 'Macrorregião III'}","{'latlong': [-41.74084505657541, -21.799306433880908], 'name': 'Macrorregião III'}",15564
1999,"{'latlong': [-41.74084505657541, -21.799306433880908], 'name': 'Macrorregião III'}","{'latlong': [-42.78374566691811, -22.435006717319105], 'name': 'Macrorregião II'}",266
1999,"{'latlong': [-41.74084505657541, -21.799306433880908], 'name': 'Macrorregião III'}","{'latlong': [-43.93088259914695, -22.50640773396086], 'name': 'Metropolitana I'}",3
1999,"{'latlong': [-42.78374566691811, -22.435006717319105], 'name': 'Macrorregião II'}","{'latlong': [-41.74084505657541, -21.799306433880908], 'name': 'Macrorregião III'}",505
1999,"{'latlong': [-42.78374566691811, -22.435006717319105], 'name': 'Macrorregião II'}","{'latlong': [-42.78374566691811, -22.435006717319105], 'name': 'Macrorregião II'}",75441
1999,"{'latlong': [-42.78374566691811, -22.435006717319105], 'name': 'Macrorregião II'}","{'latlong': [-43.93088259914695, -22.50640773396086], 'name': 'Metropolitana I'}",427
1999,"{'latlong': [-43.93088259914695, -22.50640773396086], 'name': 'Metropolitana I'}","{'latlong': [-41.74084505657541, -21.799306433880908], 'name': 'Macrorregião III'}",69
1999,"{'latlong': [-43.93088259914695, -22.50640773396086], 'name': 'Metropolitana I'}","{'latlong': [-42.78374566691811, -22.435006717319105], 'name': 'Macrorregião II'}",350
1999,"{'latlong': [-43.93088259914695, -22.50640773396086], 'name': 'Metropolitana I'}","{'latlong': [-43.93088259914695, -22.50640773396086], 'name': 'Metropolitana I'}",11006
2000,"{'latlong': [-41.74084505657541, -21.799306433880908], 'name': 'Macrorregião III'}","{'latlong': [-41.74084505657541, -21.799306433880908], 'name': 'Macrorregião III'}",15656
2000,"{'latlong': [-41.74084505657541, -21.799306433880908], 'name': 'Macrorregião III'}","{'latlong': [-42.78374566691811, -22.435006717319105], 'name': 'Macrorregião II'}",294
2000,"{'latlong': [-41.74084505657541, -21.799306433880908], 'name': 'Macrorregião III'}","{'latlong': [-43.93088259914695, -22.50640773396086], 'name': 'Metropolitana I'}",2
2000,"{'latlong': [-42.78374566691811, -22.435006717319105], 'name': 'Macrorregião II'}","{'latlong': [-41.74084505657541, -21.799306433880908], 'name': 'Macrorregião III'}",724
2000,"{'latlong': [-42.78374566691811, -22.435006717319105], 'name': 'Macrorregião II'}","{'latlong': [-42.78374566691811, -22.435006717319105], 'name': 'Macrorregião II'}",75357
2000,"{'latlong': [-42.78374566691811, -22.435006717319105], 'name': 'Macrorregião II'}","{'latlong': [-43.93088259914695, -22.50640773396086], 'name': 'Metropolitana I'}",364
2000,"{'latlong': [-43.93088259914695, -22.50640773396086], 'name': 'Metropolitana I'}","{'latlong': [-41.74084505657541, -21.799306433880908], 'name': 'Macrorregião III'}",107
2000,"{'latlong': [-43.93088259914695, -22.50640773396086], 'name': 'Metropolitana I'}","{'latlong': [-42.78374566691811, -22.435006717319105], 'name': 'Macrorregião II'}",399
2000,"{'latlong': [-43.93088259914695, -22.50640773396086], 'name': 'Metropolitana I'}","{'latlong': [-43.93088259914695, -22.50640773396086], 'name': 'Metropolitana I'}",12318
2001,"{'latlong': [-41.74084505657541, -21.799306433880908], 'name': 'Macrorregião III'}","{'latlong': [-41.74084505657541, -21.799306433880908], 'name': 'Macrorregião III'}",15743
2001,"{'latlong': [-41.74084505657541, -21.799306433880908], 'name': 'Macrorregião III'}","{'latlong': [-42.78374566691811, -22.435006717319105], 'name': 'Macrorregião II'}",174
2001,"{'latlong': [-42.78374566691811, -22.435006717319105], 'name': 'Macrorregião II'}","{'latlong': [-41.74084505657541, -21.799306433880908], 'name': 'Macrorregião III'}",395
2001,"{'latlong': [-42.78374566691811, -22.435006717319105], 'name': 'Macrorregião II'}","{'latlong': [-42.78374566691811, -22.435006717319105], 'name': 'Macrorregião II'}",70844
2001,"{'latlong': [-42.78374566691811, -22.435006717319105], 'name': 'Macrorregião II'}","{'latlong': [-43.93088259914695, -22.50640773396086], 'name': 'Metropolitana I'}",821
2001,"{'latlong': [-43.93088259914695, -22.50640773396086], 'name': 'Metropolitana I'}","{'latlong': [-41.74084505657541, -21.799306433880908], 'name': 'Macrorregião III'}",97
2001,"{'latlong': [-43.93088259914695, -22.50640773396086], 'name': 'Metropolitana I'}","{'latlong': [-42.78374566691811, -22.435006717319105], 'name': 'Macrorregião II'}",322
2001,"{'latlong': [-43.93088259914695, -22.50640773396086], 'name': 'Metropolitana I'}","{'latlong': [-43.93088259914695, -22.50640773396086], 'name': 'Metropolitana I'}",12283
2002,"{'latlong': [-41.74084505657541, -21.799306433880908], 'name': 'Macrorregião III'}","{'latlong': [-41.74084505657541, -21.799306433880908], 'name': 'Macrorregião III'}",14607
2002,"{'latlong': [-41.74084505657541, -21.799306433880908], 'name': 'Macrorregião III'}","{'latlong': [-42.78374566691811, -22.435006717319105], 'name': 'Macrorregião II'}",233
2002,"{'latlong': [-41.74084505657541, -21.799306433880908], 'name': 'Macrorregião III'}","{'latlong': [-43.93088259914695, -22.50640773396086], 'name': 'Metropolitana I'}",3
2002,"{'latlong': [-42.78374566691811, -22.435006717319105], 'name': 'Macrorregião II'}","{'latlong': [-41.74084505657541, -21.799306433880908], 'name': 'Macrorregião III'}",451
2002,"{'latlong': [-42.78374566691811, -22.435006717319105], 'name': 'Macrorregião II'}","{'latlong': [-42.78374566691811, -22.435006717319105], 'name': 'Macrorregião II'}",70879
2002,"{'latlong': [-42.78374566691811, -22.435006717319105], 'name': 'Macrorregião II'}","{'latlong': [-43.93088259914695, -22.50640773396086], 'name': 'Metropolitana I'}",1033
2002,"{'latlong': [-43.93088259914695, -22.50640773396086], 'name': 'Metropolitana I'}","{'latlong': [-41.74084505657541, -21.799306433880908], 'name': 'Macrorregião III'}",174
2002,"{'latlong': [-43.93088259914695, -22.50640773396086], 'name': 'Metropolitana I'}","{'latlong': [-42.78374566691811, -22.435006717319105], 'name': 'Macrorregião II'}",307
2002,"{'latlong': [-43.93088259914695, -22.50640773396086], 'name': 'Metropolitana I'}","{'latlong': [-43.93088259914695, -22.50640773396086], 'name': 'Metropolitana I'}",13026
2003,"{'latlong': [-41.74084505657541, -21.799306433880908], 'name': 'Macrorregião III'}","{'latlong': [-41.74084505657541, -21.799306433880908], 'name': 'Macrorregião III'}",15076
2003,"{'latlong': [-41.74084505657541, -21.799306433880908], 'name': 'Macrorregião III'}","{'latlong': [-42.78374566691811, -22.435006717319105], 'name': 'Macrorregião II'}",184
2003,"{'latlong': [-42.78374566691811, -22.435006717319105], 'name': 'Macrorregião II'}","{'latlong': [-41.74084505657541, -21.799306433880908], 'name': 'Macrorregião III'}",421
2003,"{'latlong': [-42.78374566691811, -22.435006717319105], 'name': 'Macrorregião II'}","{'latlong': [-42.78374566691811, -22.435006717319105], 'name': 'Macrorregião II'}",74617
2003,"{'latlong': [-42.78374566691811, -22.435006717319105], 'name': 'Macrorregião II'}","{'latlong': [-43.93088259914695, -22.50640773396086], 'name': 'Metropolitana I'}",934
2003,"{'latlong': [-43.93088259914695, -22.50640773396086], 'name': 'Metropolitana I'}","{'latlong': [-41.74084505657541, -21.799306433880908], 'name': 'Macrorregião III'}",231
2003,"{'latlong': [-43.93088259914695, -22.50640773396086], 'name': 'Metropolitana I'}","{'latlong': [-42.78374566691811, -22.435006717319105], 'name': 'Macrorregião II'}",300
2003,"{'latlong': [-43.93088259914695, -22.50640773396086], 'name': 'Metropolitana I'}","{'latlong': [-43.93088259914695, -22.50640773396086], 'name': 'Metropolitana I'}",14022
2004,"{'latlong': [-41.74084505657541, -21.799306433880908], 'name': 'Macrorregião III'}","{'latlong': [-41.74084505657541, -21.799306433880908], 'name': 'Macrorregião III'}",14656
2004,"{'latlong': [-41.74084505657541, -21.799306433880908], 'name': 'Macrorregião III'}","{'latlong': [-42.78374566691811, -22.435006717319105], 'name': 'Macrorregião II'}",223
2004,"{'latlong': [-41.74084505657541, -21.799306433880908], 'name': 'Macrorregião III'}","{'latlong': [-43.93088259914695, -22.50640773396086], 'name': 'Metropolitana I'}",1
2004,"{'latlong': [-42.78374566691811, -22.435006717319105], 'name': 'Macrorregião II'}","{'latlong': [-41.74084505657541, -21.799306433880908], 'name': 'Macrorregião III'}",480
2004,"{'latlong': [-42.78374566691811, -22.435006717319105], 'name': 'Macrorregião II'}","{'latlong': [-42.78374566691811, -22.435006717319105], 'name': 'Macrorregião II'}",72068
2004,"{'latlong': [-42.78374566691811, -22.435006717319105], 'name': 'Macrorregião II'}","{'latlong': [-43.93088259914695, -22.50640773396086], 'name': 'Metropolitana I'}",1706
2004,"{'latlong': [-43.93088259914695, -22.50640773396086], 'name': 'Metropolitana I'}","{'latlong': [-41.74084505657541, -21.799306433880908], 'name': 'Macrorregião III'}",314
2004,"{'latlong': [-43.93088259914695, -22.50640773396086], 'name': 'Metropolitana I'}","{'latlong': [-42.78374566691811, -22.435006717319105], 'name': 'Macrorregião II'}",256
2004,"{'latlong': [-43.93088259914695, -22.50640773396086], 'name': 'Metropolitana I'}","{'latlong': [-43.93088259914695, -22.50640773396086], 'name': 'Metropolitana I'}",13516
2005,"{'latlong': [-41.74084505657541, -21.799306433880908], 'name': 'Macrorregião III'}","{'latlong': [-41.74084505657541, -21.799306433880908], 'name': 'Macrorregião III'}",14809
2005,"{'latlong': [-41.74084505657541, -21.799306433880908], 'name': 'Macrorregião III'}","{'latlong': [-42.78374566691811, -22.435006717319105], 'name': 'Macrorregião II'}",179
2005,"{'latlong': [-42.78374566691811, -22.435006717319105], 'name': 'Macrorregião II'}","{'latlong': [-41.74084505657541, -21.799306433880908], 'name': 'Macrorregião III'}",476
2005,"{'latlong': [-42.78374566691811, -22.435006717319105], 'name': 'Macrorregião II'}","{'latlong': [-42.78374566691811, -22.435006717319105], 'name': 'Macrorregião II'}",68698
2005,"{'latlong': [-42.78374566691811, -22.435006717319105], 'name': 'Macrorregião II'}","{'latlong': [-43.93088259914695, -22.50640773396086], 'name': 'Metropolitana I'}",1451
2005,"{'latlong': [-43.93088259914695, -22.50640773396086], 'name': 'Metropolitana I'}","{'latlong': [-41.74084505657541, -21.799306433880908], 'name': 'Macrorregião III'}",360
2005,"{'latlong': [-43.93088259914695, -22.50640773396086], 'name': 'Metropolitana I'}","{'latlong': [-42.78374566691811, -22.435006717319105], 'name': 'Macrorregião II'}",161
2005,"{'latlong': [-43.93088259914695, -22.50640773396086], 'name': 'Metropolitana I'}","{'latlong': [-43.93088259914695, -22.50640773396086], 'name': 'Metropolitana I'}",12828
2006,"{'latlong': [-41.74084505657541, -21.799306433880908], 'name': 'Macrorregião III'}","{'latlong': [-41.74084505657541, -21.799306433880908], 'name': 'Macrorregião III'}",14820
2006,"{'latlong': [-41.74084505657541, -21.799306433880908], 'name': 'Macrorregião III'}","{'latlong': [-42.78374566691811, -22.435006717319105], 'name': 'Macrorregião II'}",232
2006,"{'latlong': [-41.74084505657541, -21.799306433880908], 'name': 'Macrorregião III'}","{'latlong': [-43.93088259914695, -22.50640773396086], 'name': 'Metropolitana I'}",1
2006,"{'latlong': [-42.78374566691811, -22.435006717319105], 'name': 'Macrorregião II'}","{'latlong': [-41.74084505657541, -21.799306433880908], 'name': 'Macrorregião III'}",711
2006,"{'latlong': [-42.78374566691811, -22.435006717319105], 'name': 'Macrorregião II'}","{'latlong': [-42.78374566691811, -22.435006717319105], 'name': 'Macrorregião II'}",70959
2006,"{'latlong': [-42.78374566691811, -22.435006717319105], 'name': 'Macrorregião II'}","{'latlong': [-43.93088259914695, -22.50640773396086], 'name': 'Metropolitana I'}",1356
2006,"{'latlong': [-43.93088259914695, -22.50640773396086], 'name': 'Metropolitana I'}","{'latlong': [-41.74084505657541, -21.799306433880908], 'name': 'Macrorregião III'}",359
2006,"{'latlong': [-43.93088259914695, -22.50640773396086], 'name': 'Metropolitana I'}","{'latlong': [-42.78374566691811, -22.435006717319105], 'name': 'Macrorregião II'}",232
2006,"{'latlong': [-43.93088259914695, -22.50640773396086], 'name': 'Metropolitana I'}","{'latlong': [-43.93088259914695, -22.50640773396086], 'name': 'Metropolitana I'}",13370
2007,"{'latlong': [-41.74084505657541, -21.799306433880908], 'name': 'Macrorregião III'}","{'latlong': [-41.74084505657541, -21.799306433880908], 'name': 'Macrorregião III'}",14632
2007,"{'latlong': [-41.74084505657541, -21.799306433880908], 'name': 'Macrorregião III'}","{'latlong': [-42.78374566691811, -22.435006717319105], 'name': 'Macrorregião II'}",195
2007,"{'latlong': [-42.78374566691811, -22.435006717319105], 'name': 'Macrorregião II'}","{'latlong': [-41.74084505657541, -21.799306433880908], 'name': 'Macrorregião III'}",890
2007,"{'latlong': [-42.78374566691811, -22.435006717319105], 'name': 'Macrorregião II'}","{'latlong': [-42.78374566691811, -22.435006717319105], 'name': 'Macrorregião II'}",73434
2007,"{'latlong': [-42.78374566691811, -22.435006717319105], 'name': 'Macrorregião II'}","{'latlong': [-43.93088259914695, -22.50640773396086], 'name': 'Metropolitana I'}",1337
2007,"{'latlong': [-43.93088259914695, -22.50640773396086], 'name': 'Metropolitana I'}","{'latlong': [-41.74084505657541, -21.799306433880908], 'name': 'Macrorregião III'}",335
2007,"{'latlong': [-43.93088259914695, -22.50640773396086], 'name': 'Metropolitana I'}","{'latlong': [-42.78374566691811, -22.435006717319105], 'name': 'Macrorregião II'}",201
2007,"{'latlong': [-43.93088259914695, -22.50640773396086], 'name': 'Metropolitana I'}","{'latlong': [-43.93088259914695, -22.50640773396086], 'name': 'Metropolitana I'}",13553
2008,"{'latlong': [-41.74084505657541, -21.799306433880908], 'name': 'Macrorregião III'}","{'latlong': [-41.74084505657541, -21.799306433880908], 'name': 'Macrorregião III'}",14797
2008,"{'latlong': [-41.74084505657541, -21.799306433880908], 'name': 'Macrorregião III'}","{'latlong': [-42.78374566691811, -22.435006717319105], 'name': 'Macrorregião II'}",231
2008,"{'latlong': [-41.74084505657541, -21.799306433880908], 'name': 'Macrorregião III'}","{'latlong': [-43.93088259914695, -22.50640773396086], 'name': 'Metropolitana I'}",3
2008,"{'latlong': [-42.78374566691811, -22.435006717319105], 'name': 'Macrorregião II'}","{'latlong': [-41.74084505657541, -21.799306433880908], 'name': 'Macrorregião III'}",986
2008,"{'latlong': [-42.78374566691811, -22.435006717319105], 'name': 'Macrorregião II'}","{'latlong': [-42.78374566691811, -22.435006717319105], 'name': 'Macrorregião II'}",66640
2008,"{'latlong': [-42.78374566691811, -22.435006717319105], 'name': 'Macrorregião II'}","{'latlong': [-43.93088259914695, -22.50640773396086], 'name': 'Metropolitana I'}",1297
2008,"{'latlong': [-43.93088259914695, -22.50640773396086], 'name': 'Metropolitana I'}","{'latlong': [-41.74084505657541, -21.799306433880908], 'name': 'Macrorregião III'}",330
2008,"{'latlong': [-43.93088259914695, -22.50640773396086], 'name': 'Metropolitana I'}","{'latlong': [-42.78374566691811, -22.435006717319105], 'name': 'Macrorregião II'}",191
2008,"{'latlong': [-43.93088259914695, -22.50640773396086], 'name': 'Metropolitana I'}","{'latlong': [-43.93088259914695, -22.50640773396086], 'name': 'Metropolitana I'}",13997
2009,"{'latlong': [-41.74084505657541, -21.799306433880908], 'name': 'Macrorregião III'}","{'latlong': [-41.74084505657541, -21.799306433880908], 'name': 'Macrorregião III'}",14941
2009,"{'latlong': [-41.74084505657541, -21.799306433880908], 'name': 'Macrorregião III'}","{'latlong': [-42.78374566691811, -22.435006717319105], 'name': 'Macrorregião II'}",137
2009,"{'latlong': [-41.74084505657541, -21.799306433880908], 'name': 'Macrorregião III'}","{'latlong': [-43.93088259914695, -22.50640773396086], 'name': 'Metropolitana I'}",2
2009,"{'latlong': [-42.78374566691811, -22.435006717319105], 'name': 'Macrorregião II'}","{'latlong': [-41.74084505657541, -21.799306433880908], 'name': 'Macrorregião III'}",1166
2009,"{'latlong': [-42.78374566691811, -22.435006717319105], 'name': 'Macrorregião II'}","{'latlong': [-42.78374566691811, -22.435006717319105], 'name': 'Macrorregião II'}",66460
2009,"{'latlong': [-42.78374566691811, -22.435006717319105], 'name': 'Macrorregião II'}","{'latlong': [-43.93088259914695, -22.50640773396086], 'name': 'Metropolitana I'}",1103
2009,"{'latlong': [-43.93088259914695, -22.50640773396086], 'name': 'Metropolitana I'}","{'latlong': [-41.74084505657541, -21.799306433880908], 'name': 'Macrorregião III'}",160
2009,"{'latlong': [-43.93088259914695, -22.50640773396086], 'name': 'Metropolitana I'}","{'latlong': [-42.78374566691811, -22.435006717319105], 'name': 'Macrorregião II'}",188
2009,"{'latlong': [-43.93088259914695, -22.50640773396086], 'name': 'Metropolitana I'}","{'latlong': [-43.93088259914695, -22.50640773396086], 'name': 'Metropolitana I'}",12969
2010,"{'latlong': [-41.74084505657541, -21.799306433880908], 'name': 'Macrorregião III'}","{'latlong': [-41.74084505657541, -21.799306433880908], 'name': 'Macrorregião III'}",14972
2010,"{'latlong': [-41.74084505657541, -21.799306433880908], 'name': 'Macrorregião III'}","{'latlong': [-42.78374566691811, -22.435006717319105], 'name': 'Macrorregião II'}",154
2010,"{'latlong': [-41.74084505657541, -21.799306433880908], 'name': 'Macrorregião III'}","{'latlong': [-43.93088259914695, -22.50640773396086], 'name': 'Metropolitana I'}",4
2010,"{'latlong': [-42.78374566691811, -22.435006717319105], 'name': 'Macrorregião II'}","{'latlong': [-41.74084505657541, -21.799306433880908], 'name': 'Macrorregião III'}",963
2010,"{'latlong': [-42.78374566691811, -22.435006717319105], 'name': 'Macrorregião II'}","{'latlong': [-42.78374566691811, -22.435006717319105], 'name': 'Macrorregião II'}",64747
2010,"{'latlong': [-42.78374566691811, -22.435006717319105], 'name': 'Macrorregião II'}","{'latlong': [-43.93088259914695, -22.50640773396086], 'name': 'Metropolitana I'}",859
2010,"{'latlong': [-43.93088259914695, -22.50640773396086], 'name': 'Metropolitana I'}","{'latlong': [-41.74084505657541, -21.799306433880908], 'name': 'Macrorregião III'}",129
2010,"{'latlong': [-43.93088259914695, -22.50640773396086], 'name': 'Metropolitana I'}","{'latlong': [-42.78374566691811, -22.435006717319105], 'name': 'Macrorregião II'}",178
2010,"{'latlong': [-43.93088259914695, -22.50640773396086], 'name': 'Metropolitana I'}","{'latlong': [-43.93088259914695, -22.50640773396086], 'name': 'Metropolitana I'}",12872
2011,"{'latlong': [-41.74084505657541, -21.799306433880908], 'name': 'Macrorregião III'}","{'latlong': [-41.74084505657541, -21.799306433880908], 'name': 'Macrorregião III'}",15216
2011,"{'latlong': [-41.74084505657541, -21.799306433880908], 'name': 'Macrorregião III'}","{'latlong': [-42.78374566691811, -22.435006717319105], 'name': 'Macrorregião II'}",155
2011,"{'latlong': [-41.74084505657541, -21.799306433880908], 'name': 'Macrorregião III'}","{'latlong': [-43.93088259914695, -22.50640773396086], 'name': 'Metropolitana I'}",4
2011,"{'latlong': [-42.78374566691811, -22.435006717319105], 'name': 'Macrorregião II'}","{'latlong': [-41.74084505657541, -21.799306433880908], 'name': 'Macrorregião III'}",875
2011,"{'latlong': [-42.78374566691811, -22.435006717319105], 'name': 'Macrorregião II'}","{'latlong': [-42.78374566691811, -22.435006717319105], 'name': 'Macrorregião II'}",60713
2011,"{'latlong': [-42.78374566691811, -22.435006717319105], 'name': 'Macrorregião II'}","{'latlong': [-43.93088259914695, -22.50640773396086], 'name': 'Metropolitana I'}",440
2011,"{'latlong': [-43.93088259914695, -22.50640773396086], 'name': 'Metropolitana I'}","{'latlong': [-41.74084505657541, -21.799306433880908], 'name': 'Macrorregião III'}",152
2011,"{'latlong': [-43.93088259914695, -22.50640773396086], 'name': 'Metropolitana I'}","{'latlong': [-42.78374566691811, -22.435006717319105], 'name': 'Macrorregião II'}",176
2011,"{'latlong': [-43.93088259914695, -22.50640773396086], 'name': 'Metropolitana I'}","{'latlong': [-43.93088259914695, -22.50640773396086], 'name': 'Metropolitana I'}",12595
2012,"{'latlong': [-41.74084505657541, -21.799306433880908], 'name': 'Macrorregião III'}","{'latlong': [-41.74084505657541, -21.799306433880908], 'name': 'Macrorregião III'}",14104
2012,"{'latlong': [-41.74084505657541, -21.799306433880908], 'name': 'Macrorregião III'}","{'latlong': [-42.78374566691811, -22.435006717319105], 'name': 'Macrorregião II'}",155
2012,"{'latlong': [-41.74084505657541, -21.799306433880908], 'name': 'Macrorregião III'}","{'latlong': [-43.93088259914695, -22.50640773396086], 'name': 'Metropolitana I'}",11
2012,"{'latlong': [-42.78374566691811, -22.435006717319105], 'name': 'Macrorregião II'}","{'latlong': [-41.74084505657541, -21.799306433880908], 'name': 'Macrorregião III'}",598
2012,"{'latlong': [-42.78374566691811, -22.435006717319105], 'name': 'Macrorregião II'}","{'latlong': [-42.78374566691811, -22.435006717319105], 'name': 'Macrorregião II'}",55244
2012,"{'latlong': [-42.78374566691811, -22.435006717319105], 'name': 'Macrorregião II'}","{'latlong': [-43.93088259914695, -22.50640773396086], 'name': 'Metropolitana I'}",315
2012,"{'latlong': [-43.93088259914695, -22.50640773396086], 'name': 'Metropolitana I'}","{'latlong': [-41.74084505657541, -21.799306433880908], 'name': 'Macrorregião III'}",84
2012,"{'latlong': [-43.93088259914695, -22.50640773396086], 'name': 'Metropolitana I'}","{'latlong': [-42.78374566691811, -22.435006717319105], 'name': 'Macrorregião II'}",187
2012,"{'latlong': [-43.93088259914695, -22.50640773396086], 'name': 'Metropolitana I'}","{'latlong': [-43.93088259914695, -22.50640773396086], 'name': 'Metropolitana I'}",12018
2013,"{'latlong': [-41.74084505657541, -21.799306433880908], 'name': 'Macrorregião III'}","{'latlong': [-41.74084505657541, -21.799306433880908], 'name': 'Macrorregião III'}",13257
2013,"{'latlong': [-41.74084505657541, -21.799306433880908], 'name': 'Macrorregião III'}","{'latlong': [-42.78374566691811, -22.435006717319105], 'name': 'Macrorregião II'}",175
2013,"{'latlong': [-41.74084505657541, -21.799306433880908], 'name': 'Macrorregião III'}","{'latlong': [-43.93088259914695, -22.50640773396086], 'name': 'Metropolitana I'}",17
2013,"{'latlong': [-42.78374566691811, -22.435006717319105], 'name': 'Macrorregião II'}","{'latlong': [-41.74084505657541, -21.799306433880908], 'name': 'Macrorregião III'}",376
2013,"{'latlong': [-42.78374566691811, -22.435006717319105], 'name': 'Macrorregião II'}","{'latlong': [-42.78374566691811, -22.435006717319105], 'name': 'Macrorregião II'}",52012
2013,"{'latlong': [-42.78374566691811, -22.435006717319105], 'name': 'Macrorregião II'}","{'latlong': [-43.93088259914695, -22.50640773396086], 'name': 'Metropolitana I'}",251
2013,"{'latlong': [-43.93088259914695, -22.50640773396086], 'name': 'Metropolitana I'}","{'latlong': [-41.74084505657541, -21.799306433880908], 'name': 'Macrorregião III'}",104
2013,"{'latlong': [-43.93088259914695, -22.50640773396086], 'name': 'Metropolitana I'}","{'latlong': [-42.78374566691811, -22.435006717319105], 'name': 'Macrorregião II'}",194
2013,"{'latlong': [-43.93088259914695, -22.50640773396086], 'name': 'Metropolitana I'}","{'latlong': [-43.93088259914695, -22.50640773396086], 'name': 'Metropolitana I'}",11309
2014,"{'latlong': [-41.74084505657541, -21.799306433880908], 'name': 'Macrorregião III'}","{'latlong': [-41.74084505657541, -21.799306433880908], 'name': 'Macrorregião III'}",13082
2014,"{'latlong': [-41.74084505657541, -21.799306433880908], 'name': 'Macrorregião III'}","{'latlong': [-42.78374566691811, -22.435006717319105], 'name': 'Macrorregião II'}",163
2014,"{'latlong': [-41.74084505657541, -21.799306433880908], 'name': 'Macrorregião III'}","{'latlong': [-43.93088259914695, -22.50640773396086], 'name': 'Metropolitana I'}",30
2014,"{'latlong': [-42.78374566691811, -22.435006717319105], 'name': 'Macrorregião II'}","{'latlong': [-41.74084505657541, -21.799306433880908], 'name': 'Macrorregião III'}",465
2014,"{'latlong': [-42.78374566691811, -22.435006717319105], 'name': 'Macrorregião II'}","{'latlong': [-42.78374566691811, -22.435006717319105], 'name': 'Macrorregião II'}",51656
2014,"{'latlong': [-42.78374566691811, -22.435006717319105], 'name': 'Macrorregião II'}","{'latlong': [-43.93088259914695, -22.50640773396086], 'name': 'Metropolitana I'}",426
2014,"{'latlong': [-43.93088259914695, -22.50640773396086], 'name': 'Metropolitana I'}","{'latlong': [-41.74084505657541, -21.799306433880908], 'name': 'Macrorregião III'}",75
2014,"{'latlong': [-43.93088259914695, -22.50640773396086], 'name': 'Metropolitana I'}","{'latlong': [-42.78374566691811, -22.435006717319105], 'name': 'Macrorregião II'}",192
2014,"{'latlong': [-43.93088259914695, -22.50640773396086], 'name': 'Metropolitana I'}","{'latlong': [-43.93088259914695, -22.50640773396086], 'name': 'Metropolitana I'}",11002
2015,"{'latlong': [-41.74084505657541, -21.799306433880908], 'name': 'Macrorregião III'}","{'latlong': [-41.74084505657541, -21.799306433880908], 'name': 'Macrorregião III'}",12506
2015,"{'latlong': [-41.74084505657541, -21.799306433880908], 'name': 'Macrorregião III'}","{'latlong': [-42.78374566691811, -22.435006717319105], 'name': 'Macrorregião II'}",204
2015,"{'latlong': [-41.74084505657541, -21.799306433880908], 'name': 'Macrorregião III'}","{'latlong': [-43.93088259914695, -22.50640773396086], 'name': 'Metropolitana I'}",22
2015,"{'latlong': [-42.78374566691811, -22.435006717319105], 'name': 'Macrorregião II'}","{'latlong': [-41.74084505657541, -21.799306433880908], 'name': 'Macrorregião III'}",467
2015,"{'latlong': [-42.78374566691811, -22.435006717319105], 'name': 'Macrorregião II'}","{'latlong': [-42.78374566691811, -22.435006717319105], 'name': 'Macrorregião II'}",53043
2015,"{'latlong': [-42.78374566691811, -22.435006717319105], 'name': 'Macrorregião II'}","{'latlong': [-43.93088259914695, -22.50640773396086], 'name': 'Metropolitana I'}",596
2015,"{'latlong': [-43.93088259914695, -22.50640773396086], 'name': 'Metropolitana I'}","{'latlong': [-41.74084505657541, -21.799306433880908], 'name': 'Macrorregião III'}",85
2015,"{'latlong': [-43.93088259914695, -22.50640773396086], 'name': 'Metropolitana I'}","{'latlong': [-42.78374566691811, -22.435006717319105], 'name': 'Macrorregião II'}",183
2015,"{'latlong': [-43.93088259914695, -22.50640773396086], 'name': 'Metropolitana I'}","{'latlong': [-43.93088259914695, -22.50640773396086], 'name': 'Metropolitana I'}",10696
2016,"{'latlong': [-41.74084505657541, -21.799306433880908], 'name': 'Macrorregião III'}","{'latlong': [-41.74084505657541, -21.799306433880908], 'name': 'Macrorregião III'}",12834
2016,"{'latlong': [-41.74084505657541, -21.799306433880908], 'name': 'Macrorregião III'}","{'latlong': [-42.78374566691811, -22.435006717319105], 'name': 'Macrorregião II'}",198
2016,"{'latlong': [-41.74084505657541, -21.799306433880908], 'name': 'Macrorregião III'}","{'latlong': [-43.93088259914695, -22.50640773396086], 'name': 'Metropolitana I'}",20
2016,"{'latlong': [-42.78374566691811, -22.435006717319105], 'name': 'Macrorregião II'}","{'latlong': [-41.74084505657541, -21.799306433880908], 'name': 'Macrorregião III'}",498
2016,"{'latlong': [-42.78374566691811, -22.435006717319105], 'name': 'Macrorregião II'}","{'latlong': [-42.78374566691811, -22.435006717319105], 'name': 'Macrorregião II'}",50283
2016,"{'latlong': [-42.78374566691811, -22.435006717319105], 'name': 'Macrorregião II'}","{'latlong': [-43.93088259914695, -22.50640773396086], 'name': 'Metropolitana I'}",623
2016,"{'latlong': [-43.93088259914695, -22.50640773396086], 'name': 'Metropolitana I'}","{'latlong': [-41.74084505657541, -21.799306433880908], 'name': 'Macrorregião III'}",67
2016,"{'latlong': [-43.93088259914695, -22.50640773396086], 'name': 'Metropolitana I'}","{'latlong': [-42.78374566691811, -22.435006717319105], 'name': 'Macrorregião II'}",205
2016,"{'latlong': [-43.93088259914695, -22.50640773396086], 'name': 'Metropolitana I'}","{'latlong': [-43.93088259914695, -22.50640773396086], 'name': 'Metropolitana I'}",11092
2017,"{'latlong': [-41.74084505657541, -21.799306433880908], 'name': 'Macrorregião III'}","{'latlong': [-41.74084505657541, -21.799306433880908], 'name': 'Macrorregião III'}",12594
2017,"{'latlong': [-41.74084505657541, -21.799306433880908], 'name': 'Macrorregião III'}","{'latlong': [-42.78374566691811, -22.435006717319105], 'name': 'Macrorregião II'}",278
2017,"{'latlong': [-41.74084505657541, -21.799306433880908], 'name': 'Macrorregião III'}","{'latlong': [-43.93088259914695, -22.50640773396086], 'name': 'Metropolitana I'}",17
2017,"{'latlong': [-42.78374566691811, -22.435006717319105], 'name': 'Macrorregião II'}","{'latlong': [-41.74084505657541, -21.799306433880908], 'name': 'Macrorregião III'}",602
2017,"{'latlong': [-42.78374566691811, -22.435006717319105], 'name': 'Macrorregião II'}","{'latlong': [-42.78374566691811, -22.435006717319105], 'name': 'Macrorregião II'}",47924
2017,"{'latlong': [-42.78374566691811, -22.435006717319105], 'name': 'Macrorregião II'}","{'latlong': [-43.93088259914695, -22.50640773396086], 'name': 'Metropolitana I'}",810
2017,"{'latlong': [-43.93088259914695, -22.50640773396086], 'name': 'Metropolitana I'}","{'latlong': [-41.74084505657541, -21.799306433880908], 'name': 'Macrorregião III'}",39
2017,"{'latlong': [-43.93088259914695, -22.50640773396086], 'name': 'Metropolitana I'}","{'latlong': [-42.78374566691811, -22.435006717319105], 'name': 'Macrorregião II'}",256
2017,"{'latlong': [-43.93088259914695, -22.50640773396086], 'name': 'Metropolitana I'}","{'latlong': [-43.93088259914695, -22.50640773396086], 'name': 'Metropolitana I'}",11599
2018,"{'latlong': [-41.74084505657541, -21.799306433880908], 'name': 'Macrorregião III'}","{'latlong': [-41.74084505657541, -21.799306433880908], 'name': 'Macrorregião III'}",12989
2018,"{'latlong': [-41.74084505657541, -21.799306433880908], 'name': 'Macrorregião III'}","{'latlong': [-42.78374566691811, -22.435006717319105], 'name': 'Macrorregião II'}",310
2018,"{'latlong': [-41.74084505657541, -21.799306433880908], 'name': 'Macrorregião III'}","{'latlong': [-43.93088259914695, -22.50640773396086], 'name': 'Metropolitana I'}",65
2018,"{'latlong': [-42.78374566691811, -22.435006717319105], 'name': 'Macrorregião II'}","{'latlong': [-41.74084505657541, -21.799306433880908], 'name': 'Macrorregião III'}",592
2018,"{'latlong': [-42.78374566691811, -22.435006717319105], 'name': 'Macrorregião II'}","{'latlong': [-42.78374566691811, -22.435006717319105], 'name': 'Macrorregião II'}",48201
2018,"{'latlong': [-42.78374566691811, -22.435006717319105], 'name': 'Macrorregião II'}","{'latlong': [-43.93088259914695, -22.50640773396086], 'name': 'Metropolitana I'}",1066
2018,"{'latlong': [-43.93088259914695, -22.50640773396086], 'name': 'Metropolitana I'}","{'latlong': [-41.74084505657541, -21.799306433880908], 'name': 'Macrorregião III'}",16
2018,"{'latlong': [-43.93088259914695, -22.50640773396086], 'name': 'Metropolitana I'}","{'latlong': [-42.78374566691811, -22.435006717319105], 'name': 'Macrorregião II'}",279
2018,"{'latlong': [-43.93088259914695, -22.50640773396086], 'name': 'Metropolitana I'}","{'latlong': [-43.93088259914695, -22.50640773396086], 'name': 'Metropolitana I'}",12437
2019,"{'latlong': [-41.74084505657541, -21.799306433880908], 'name': 'Macrorregião III'}","{'latlong': [-41.74084505657541, -21.799306433880908], 'name': 'Macrorregião III'}",14114
2019,"{'latlong': [-41.74084505657541, -21.799306433880908], 'name': 'Macrorregião III'}","{'latlong': [-42.78374566691811, -22.435006717319105], 'name': 'Macrorregião II'}",371
2019,"{'latlong': [-41.74084505657541, -21.799306433880908], 'name': 'Macrorregião III'}","{'latlong': [-43.93088259914695, -22.50640773396086], 'name': 'Metropolitana I'}",70
2019,"{'latlong': [-42.78374566691811, -22.435006717319105], 'name': 'Macrorregião II'}","{'latlong': [-41.74084505657541, -21.799306433880908], 'name': 'Macrorregião III'}",473
2019,"{'latlong': [-42.78374566691811, -22.435006717319105], 'name': 'Macrorregião II'}","{'latlong': [-42.78374566691811, -22.435006717319105], 'name': 'Macrorregião II'}",49972
2019,"{'latlong': [-42.78374566691811, -22.435006717319105], 'name': 'Macrorregião II'}","{'latlong': [-43.93088259914695, -22.50640773396086], 'name': 'Metropolitana I'}",1399
2019,"{'latlong': [-43.93088259914695, -22.50640773396086], 'name': 'Metropolitana I'}","{'latlong': [-41.74084505657541, -21.799306433880908], 'name': 'Macrorregião III'}",11
2019,"{'latlong': [-43.93088259914695, -22.50640773396086], 'name': 'Metropolitana I'}","{'latlong': [-42.78374566691811, -22.435006717319105], 'name': 'Macrorregião II'}",266
2019,"{'latlong': [-43.93088259914695, -22.50640773396086], 'name': 'Metropolitana I'}","{'latlong': [-43.93088259914695, -22.50640773396086], 'name': 'Metropolitana I'}",13863
2020,"{'latlong': [-41.74084505657541, -21.799306433880908], 'name': 'Macrorregião III'}","{'latlong': [-41.74084505657541, -21.799306433880908], 'name': 'Macrorregião III'}",4534
2020,"{'latlong': [-41.74084505657541, -21.799306433880908], 'name': 'Macrorregião III'}","{'latlong': [-42.78374566691811, -22.435006717319105], 'name': 'Macrorregião II'}",168
2020,"{'latlong': [-41.74084505657541, -21.799306433880908], 'name': 'Macrorregião III'}","{'latlong': [-43.93088259914695, -22.50640773396086], 'name': 'Metropolitana I'}",23
2020,"{'latlong': [-42.78374566691811, -22.435006717319105], 'name': 'Macrorregião II'}","{'latlong': [-41.74084505657541, -21.799306433880908], 'name': 'Macrorregião III'}",98
2020,"{'latlong': [-42.78374566691811, -22.435006717319105], 'name': 'Macrorregião II'}","{'latlong': [-42.78374566691811, -22.435006717319105], 'name': 'Macrorregião II'}",16634
2020,"{'latlong': [-42.78374566691811, -22.435006717319105], 'name': 'Macrorregião II'}","{'latlong': [-43.93088259914695, -22.50640773396086], 'name': 'Metropolitana I'}",444
2020,"{'latlong': [-43.93088259914695, -22.50640773396086], 'name': 'Metropolitana I'}","{'latlong': [-41.74084505657541, -21.799306433880908], 'name': 'Macrorregião III'}",1
2020,"{'latlong': [-43.93088259914695, -22.50640773396086], 'name': 'Metropolitana I'}","{'latlong': [-42.78374566691811, -22.435006717319105], 'name': 'Macrorregião II'}",104
2020,"{'latlong': [-43.93088259914695, -22.50640773396086], 'name': 'Metropolitana I'}","{'latlong': [-43.93088259914695, -22.50640773396086], 'name': 'Metropolitana I'}",4717
