year,all
1994,42.902820507207224
1995,44.42272865826325
1996,44.76550356950098
1997,39.95061664306207
1998,37.83385979340525
1999,36.464274979477054
2000,38.29271911556398
2001,49.35954550717144
2002,43.31484258263094
2003,37.715770239784405
2004,48.534205961364734
2005,45.18534180620615
2006,38.32344884684021
2007,44.74250257416562
2008,39.39031870821852
2009,43.69588870634528
2010,44.06297664100352
2011,46.208368505224016
2012,45.70898984561484
2013,44.6163830485359
2014,45.96551323141826
2015,44.34935664510318
2016,49.112159472150275
2017,45.700116918354325
2018,48.027757315302296
2019,53.23869808316557
2020,
