CD_MUN,region
350010,Adamantina
350020,José Bonifácio
350030,Mantiqueira
350040,Mantiqueira
350050,Campinas
350055,Vale do Jurumirim
350060,Piracicaba
350070,Bauru
350075,Itapetininga
350080,Alta Sorocabana
350090,Norte - Barretos
350100,Vale das Cachoeiras
350110,Consórcios do DRS II
350115,Sorocaba
350120,Votuporanga
350130,Alta Sorocabana
350140,Marília
350150,Marília
350160,Oeste VII
350170,Central do DRS III
350180,Votuporanga
350190,Campinas
350200,Rio Claro
350210,Lagos do DRS II
350220,Itapetininga
350230,Paulo Cuesta
350240,Alta Sorocabana
350250,Circuito da Fé e Vale Histórico
350260,Jales
350270,Itapeva
350275,Sorocaba
350280,Central do DRS II
350290,Sorocaba
350300,Alta Mogiana
350310,Vale do Jurumirim
350315,Circuito da Fé e Vale Histórico
350320,Central do DRS III
350330,Araras
350335,Tupã
350340,Bauru
350350,Circuito da Fé e Vale Histórico
350360,Paulo Cuesta
350370,Catanduva
350380,Oeste VII
350390,Alto do Tietê
350395,Jales
350400,Assis
350410,Bragança
350420,Central do DRS II
350430,Bauru
350440,Consórcios do DRS II
350450,Vale do Jurumirim
350460,São José do Rio Preto
350470,Bauru
350480,São José do Rio Preto
350490,Circuito da Fé e Vale Histórico
350500,Vale do Jurumirim
350510,Consórcios do DRS II
350520,Jaú
350530,Jaú
350535,Itapeva
350540,Vale do Ribeira
350550,Norte - Barretos
350560,Horizonte Verde
350570,Rota dos Bandeirantes
350580,Tupã
350590,Vale das Cachoeiras
350600,Bauru
350610,Sul - Barretos
350620,Central do DRS II
350630,Ourinhos
350635,Baixada Santista
350640,Central do DRS II
350650,Consórcios do DRS II
350660,Alto do Tietê
350670,Central do DRS III
350680,Jaú
350690,Paulo Cuesta
350700,Sorocaba
350710,Bragança
350715,Itapeva
350720,Assis
350730,Jaú
350740,Centro Oeste do DRS III
350745,Bauru
350750,Paulo Cuesta
350760,Bragança
350770,Consórcios do DRS II
350775,Consórcios do DRS II
350780,Vale das Cachoeiras
350790,Jaú
350800,Itapeva
350810,Consórcios do DRS II
350820,Alta Mogiana
350830,Bauru
350840,Jundiaí
350850,Alto Vale do Paraíba
350860,Circuito da Fé e Vale Histórico
350870,Rio Pardo
350880,Lins
350890,Alta Sorocabana
350900,Franco da Rocha
350910,Extremo Oeste Paulista
350920,Franco da Rocha
350925,Vale do Ribeira
350930,Norte - Barretos
350940,Vale das Cachoeiras
350945,Itapetininga
350950,Campinas
350960,Jundiaí
350970,Vale do Paraíba/ Região Serrana
350980,Marília
350990,Vale do Ribeira
350995,Circuito da Fé e Vale Histórico
351000,Assis
351010,Norte do DRS III
351015,Ourinhos
351020,Itapeva
351030,Sorocaba
351040,Piracicaba
351050,Litoral Norte
351060,Rota dos Bandeirantes
351070,Votuporanga
351080,Rio Pardo
351090,Vale das Cachoeiras
351100,Lagos do DRS II
351110,Catanduva
351120,Catanduva
351130,São José do Rio Preto
351140,Vale do Jurumirim
351150,Itapetininga
351160,Itapetininga
351170,Piracicaba
351190,Consórcios do DRS II
351200,Norte - Barretos
351210,Norte - Barretos
351220,Araras
351230,Paulo Cuesta
351240,Limeira
351250,Consórcios do DRS II
351260,Vale do Jurumirim
351270,Rio Claro
351280,Oeste VII
351290,Votuporanga
351300,Mananciais
351310,Aquífero Guarani
351320,Três Colinas
351330,Assis
351340,Circuito da Fé e Vale Histórico
351350,Baixada Santista
351360,Circuito da Fé e Vale Histórico
351370,Coração do DRS III
351380,Grande ABC
351385,Jales
351390,Rio Pardo
351400,Norte do DRS III
351410,Jaú
351420,Jales
351430,Coração do DRS III
351440,Alta Paulista
351450,Bauru
351460,Horizonte Verde
351470,Marília
351480,Vale do Ribeira
351490,Piracicaba
351492,Catanduva
351495,Catanduva
351500,Mananciais
351510,Mananciais
351512,Alta Sorocabana
351515,Limeira
351518,Mantiqueira
351519,Ourinhos
351520,Fernandópolis
351530,Alta Sorocabana
351535,Pontal do Paranapanema
351540,Vale do Jurumirim
351550,Fernandópolis
351560,Catanduva
351565,Marília
351570,Alto do Tietê
351580,Alta Paulista
351590,Votuporanga
351600,Adamantina
351610,Assis
351620,Três Colinas
351630,Franco da Rocha
351640,Franco da Rocha
351650,Consórcios do DRS II
351660,Marília
351670,Marília
351680,Votuporanga
351685,Central do DRS III
351690,Votuporanga
351700,Lins
351710,Consórcios do DRS II
351720,Lins
351730,Marília
351740,Norte - Barretos
351750,São José do Rio Preto
351760,Itapeva
351770,Alta Mogiana
351780,Lagos do DRS II
351790,Norte - Barretos
351800,Fernandópolis
351810,Marília
351820,Central do DRS II
351830,Alto do Tietê
351840,Circuito da Fé e Vale Histórico
351850,Itapetininga
351860,Horizonte Verde
351870,Baixada Santista
351880,Alto do Tietê
351885,Aquífero Guarani
351890,Central do DRS II
351900,Tupã
351905,Oeste VII
351907,Oeste VII
351910,Bauru
351920,Tupã
351925,Vale do Jurumirim
351930,Coração do DRS III
351940,São José do Rio Preto
351950,Assis
351960,Centro Oeste do DRS III
351970,Sorocaba
351980,São José do Rio Preto
351990,Alto Capivari
352000,Jaú
352010,Alta Mogiana
352020,Alto Vale do Paraíba
352030,Vale do Ribeira
352040,Litoral Norte
352042,Vale do Ribeira
352044,Lagos do DRS II
352050,Campinas
352060,Alta Sorocabana
352070,Fernandópolis
352080,Adamantina
352090,Ourinhos
352100,Sorocaba
352110,Rio Claro
352115,São José do Rio Preto
352120,Vale do Ribeira
352130,Alta Anhanguera
352140,Limeira
352150,Catanduva
352160,Alta Paulista
352170,Itapeva
352180,Vale do Jurumirim
352190,Catanduva
352200,Jaú
352210,Baixada Santista
352215,Itapeva
352220,Mananciais
352230,Itapetininga
352240,Itapeva
352250,Rota dos Bandeirantes
352260,Baixa Mogiana
352265,Itapeva
352270,Centro Oeste do DRS III
352280,Vale do Jurumirim
352290,Jaú
352300,Lagos do DRS II
352310,Alto do Tietê
352320,Itapeva
352330,Vale do Ribeira
352340,Jundiaí
352350,Paulo Cuesta
352360,Rio Claro
352370,Três Colinas
352380,Rio Pardo
352390,Sorocaba
352400,Jundiaí
352410,Alta Mogiana
352420,Norte - Barretos
352430,Horizonte Verde
352440,Alto Vale do Paraíba
352450,José Bonifácio
352460,Vale do Ribeira
352470,Oeste VII
352480,Jales
352490,Alto Vale do Paraíba
352500,Rota dos Bandeirantes
352510,Aquífero Guarani
352520,Jundiaí
352530,Jaú
352540,Três Colinas
352550,Bragança
352560,Alto Capivari
352570,José Bonifácio
352580,Marília
352585,Sorocaba
352590,Jundiaí
352600,Alta Paulista
352610,Vale do Ribeira
352620,Mananciais
352630,Vale do Paraíba/ Região Serrana
352640,Paulo Cuesta
352650,Lagos do DRS II
352660,Circuito da Fé e Vale Histórico
352670,Araras
352680,Bauru
352690,Limeira
352700,Campinas
352710,Lins
352720,Circuito da Fé e Vale Histórico
352725,Consórcios do DRS II
352730,Jundiaí
352740,Adamantina
352750,Bauru
352760,Aquífero Guarani
352770,Consórcios do DRS II
352780,Marília
352790,Assis
352800,Bauru
352810,Votuporanga
352820,Fernandópolis
352830,Votuporanga
352840,Sorocaba
352850,Franco da Rocha
352860,Vale do Jurumirim
352870,Extremo Oeste Paulista
352880,Assis
352885,Catanduva
352890,Adamantina
352900,Marília
352910,Jales
352920,Alta Sorocabana
352930,Norte do DRS III
352940,Grande ABC
352950,José Bonifácio
352960,Fernandópolis
352965,Jales
352970,Alta Mogiana
352980,Jaú
352990,Vale do Ribeira
353000,Fernandópolis
353010,Lagos do DRS II
353020,Pontal do Paranapanema
353030,São José do Rio Preto
353040,São José do Rio Preto
353050,Rio Pardo
353060,Alto do Tietê
353070,Baixa Mogiana
353080,Baixa Mogiana
353090,Piracicaba
353100,Votuporanga
353110,Baixada Santista
353120,Campinas
353130,Horizonte Verde
353140,José Bonifácio
353150,Sul - Barretos
353160,Alta Paulista
353170,Alto Vale do Paraíba
353180,Campinas
353190,Alta Anhanguera
353200,Jundiaí
353205,Central do DRS III
353210,Lagos do DRS II
353215,Alto Capivari
353220,Alta Sorocabana
353230,Vale do Paraíba/ Região Serrana
353240,Bragança
353250,São José do Rio Preto
353260,Votuporanga
353270,José Bonifácio
353280,São José do Rio Preto
353282,Itapeva
353284,Santa Fé do Sul
353286,Central do DRS II
353290,Centro Oeste do DRS III
353300,São José do Rio Preto
353310,Alta Paulista
353320,Lagos do DRS II
353325,Catanduva
353330,Central do DRS II
353340,Oeste VII
353350,Catanduva
353360,Alta Anhanguera
353370,Marília
353380,Ourinhos
353390,Norte - Barretos
353400,São José do Rio Preto
353410,Marília
353420,São José do Rio Preto
353430,Alta Anhanguera
353440,Rota dos Bandeirantes
353450,Marília
353460,Adamantina
353470,Ourinhos
353475,Fernandópolis
353480,Alta Paulista
353490,Adamantina
353500,São José do Rio Preto
353510,Catanduva
353520,Jales
353530,Assis
353540,Alta Paulista
353550,Assis
353560,Alto Vale do Paraíba
353570,Catanduva
353580,Vale do Jurumirim
353590,Jales
353600,Tupã
353610,Paulo Cuesta
353620,Vale do Ribeira
353625,Votuporanga
353630,Três Colinas
353640,Alta Paulista
353650,Oeste VII
353657,Bauru
353660,São José do Rio Preto
353670,Bauru
353680,Bragança
353690,Fernandópolis
353700,Três Colinas
353710,Campinas
353715,Assis
353720,Vale do Ribeira
353730,Consórcios do DRS II
353740,Lagos do DRS II
353750,Paulo Cuesta
353760,Baixada Santista
353770,Consórcios do DRS II
353780,Sorocaba
353790,Sorocaba
353800,Vale do Paraíba/ Região Serrana
353810,Catanduva
353820,Bragança
353830,Extremo Oeste Paulista
353850,Circuito da Fé e Vale Histórico
353860,Bragança
353870,Piracicaba
353880,Vale do Jurumirim
353890,Bauru
353900,Catanduva
353910,Rota dos Bandeirantes
353920,Alta Sorocabana
353930,Araras
353940,Bauru
353950,Horizonte Verde
353960,José Bonifácio
353970,Assis
353980,Alto do Tietê
353990,José Bonifácio
354000,Marília
354010,Lins
354020,Horizonte Verde
354025,Jales
354030,Votuporanga
354040,Fernandópolis
354050,Paulo Cuesta
354060,Sorocaba
354070,Coração do DRS III
354075,Circuito da Fé e Vale Histórico
354080,São José do Rio Preto
354085,Adamantina
354090,Horizonte Verde
354100,Baixada Santista
354105,Paulo Cuesta
354110,Bauru
354120,Alta Sorocabana
354130,Extremo Oeste Paulista
354140,Alta Sorocabana
354150,Extremo Oeste Paulista
354160,Lins
354165,Itapetininga
354170,Alto Capivari
354180,Tupã
354190,Circuito da Fé e Vale Histórico
354200,Marília
354210,Piracicaba
354220,Alto Capivari
354230,Vale do Paraíba/ Região Serrana
354240,Alta Sorocabana
354250,Bauru
354260,Vale do Ribeira
354270,Três Colinas
354280,Itapeva
354290,Coração do DRS III
354300,Itapeva
354310,Três Colinas
354320,Ourinhos
354323,Alta Sorocabana
354325,Itapeva
354330,Grande ABC
354340,Aquífero Guarani
354350,Itapeva
354360,Três Colinas
354370,Central do DRS III
354380,Tupã
354390,Rio Claro
354400,Piracicaba
354410,Grande ABC
354420,Votuporanga
354425,Pontal do Paranapanema
354430,Circuito da Fé e Vale Histórico
354440,Central do DRS II
354450,Santa Fé do Sul
354460,Lins
354470,Adamantina
354480,Catanduva
354490,Alta Anhanguera
354500,Alto do Tietê
354510,Adamantina
354515,Piracicaba
354520,Sorocaba
354530,Sorocaba
354540,Ourinhos
354550,Alta Sorocabana
354560,Catanduva
354570,Jales
354580,Oeste VII
354600,Alto Vale do Paraíba
354610,Santa Fé do Sul
354620,Araras
354625,Vale das Cachoeiras
354630,Mantiqueira
354640,Ourinhos
354650,Norte do DRS III
354660,Santa Fé do Sul
354670,Rio Claro
354680,Alto do Tietê
354690,Central do DRS III
354700,Piracicaba
354710,Alta Paulista
354720,Jales
354730,Rota dos Bandeirantes
354740,Santa Fé do Sul
354750,Aquífero Guarani
354760,Aquífero Guarani
354765,Jales
354770,Alta Sorocabana
354780,Grande ABC
354790,Vale das Cachoeiras
354800,Oeste VII
354805,Central do DRS II
354810,Mantiqueira
354820,Vale do Paraíba/ Região Serrana
354830,Alta Sorocabana
354840,Consórcios do DRS II
354850,Baixada Santista
354860,Vale do Paraíba/ Região Serrana
354870,Grande ABC
354880,Grande ABC
354890,Coração do DRS III
354900,Jales
354910,Mantiqueira
354920,Fernandópolis
354925,Fernandópolis
354930,Alta Paulista
354940,Alta Anhanguera
354950,Três Colinas
354960,Circuito da Fé e Vale Histórico
354970,Rio Pardo
354980,São José do Rio Preto
354990,Alto Vale do Paraíba
354995,Mananciais
355000,Vale do Paraíba/ Região Serrana
355010,Paulo Cuesta
355020,Itapetininga
355030,São Paulo
355040,Piracicaba
355050,Ourinhos
355060,Sorocaba
355070,Litoral Norte
355080,Rio Pardo
355090,Aquífero Guarani
355100,Baixada Santista
355110,Itapetininga
355120,Vale do Jurumirim
355130,Votuporanga
355140,Aquífero Guarani
355150,Aquífero Guarani
355160,Campinas
355170,Horizonte Verde
355180,Vale do Ribeira
355190,Norte - Barretos
355200,Circuito da Fé e Vale Histórico
355210,Bragança
355220,Sorocaba
355230,Lagos do DRS II
355240,Oeste VII
355250,Alto do Tietê
355255,Lagos do DRS II
355260,Catanduva
355270,Centro Oeste do DRS III
355280,Mananciais
355290,Alta Sorocabana
355300,Vale do Jurumirim
355310,Sul - Barretos
355320,Sul - Barretos
355330,Mantiqueira
355340,São José do Rio Preto
355350,Sorocaba
355360,Rio Pardo
355365,Sul - Barretos
355370,Norte do DRS III
355380,Vale do Jurumirim
355385,Itapeva
355390,Alta Sorocabana
355395,Assis
355400,Itapetininga
355410,Vale do Paraíba/ Região Serrana
355420,Vale do Jurumirim
355430,Pontal do Paranapanema
355440,Sul - Barretos
355450,Sorocaba
355460,Ourinhos
355465,Paulo Cuesta
355470,Jaú
355475,Central do DRS III
355480,Vale do Paraíba/ Região Serrana
355490,Santa Fé do Sul
355495,Bragança
355500,Tupã
355510,Alta Paulista
355520,Consórcios do DRS II
355530,Fernandópolis
355535,José Bonifácio
355540,Litoral Norte
355550,Marília
355560,São José do Rio Preto
355570,José Bonifácio
355580,Jales
355590,Lins
355600,Catanduva
355610,Votuporanga
355620,Campinas
355630,Central do DRS II
355635,Bragança
355640,Mantiqueira
355645,Mananciais
355650,Jundiaí
355660,Marília
355670,Campinas
355680,Sul - Barretos
355690,Sul - Barretos
355695,Jales
355700,Sorocaba
355710,Votuporanga
355715,José Bonifácio
355720,Ourinhos
355730,Baixa Mogiana
