CD_MUN,region
230010,Brejo Santo
230015,Maracanaú
230020,Acaraú
230030,Iguatú
230040,Tauá
230050,Sobral
230060,Crato
230070,Limoeiro do Norte
230075,Itapipoca
230080,Crato
230090,Caucaia
230100,Fortaleza
230110,Aracati
230120,Baturité
230125,Crateús
230130,Crato
230140,Baturité
230150,Tauá
230160,Crato
230170,Brejo Santo
230180,Icó
230185,Quixadá
230190,Juazeiro do Norte
230195,Maracanaú
230200,Brejo Santo
230205,Camocim
230210,Baturité
230220,Cascavel
230230,Acaraú
230240,Canindé
230250,Brejo Santo
230260,Camocim
230270,Crato
230280,Canindé
230290,Baturité
230300,Canindé
230310,Sobral
230320,Juazeiro do Norte
230330,Iguatú
230340,Tianguá
230350,Cascavel
230360,Iguatú
230365,Sobral
230370,Caucaia
230380,Icó
230390,Camocim
230393,Quixadá
230395,Cascavel
230400,Sobral
230410,Crateús
230420,Crato
230423,Tianguá
230425,Acaraú
230426,Iguatú
230427,Limoeiro do Norte
230428,Fortaleza
230430,Crato
230435,Sobral
230440,Fortaleza
230445,Aracati
230450,Sobral
230460,Caucaia
230465,Sobral
230470,Camocim
230480,Juazeiro do Norte
230490,Sobral
230495,Maracanaú
230500,Tianguá
230510,Baturité
230520,Sobral
230523,Cascavel
230526,Quixadá
230530,Tianguá
230533,Quixadá
230535,Aracati
230540,Icó
230550,Iguatú
230560,Crateús
230565,Crateús
230570,Icó
230580,Sobral
230590,Crateús
230600,Limoeiro do Norte
230610,Sobral
230620,Aracati
230625,Fortaleza
230630,Caucaia
230640,Itapipoca
230650,Baturité
230655,Acaraú
230660,Canindé
230670,Russas
230680,Limoeiro do Norte
230690,Limoeiro do Norte
230700,Russas
230710,Juazeiro do Norte
230720,Brejo Santo
230725,Acaraú
230730,Juazeiro do Norte
230740,Iguatú
230750,Icó
230760,Limoeiro do Norte
230763,Canindé
230765,Maracanaú
230770,Maracanaú
230780,Acaraú
230790,Camocim
230800,Sobral
230810,Brejo Santo
230820,Sobral
230830,Brejo Santo
230835,Quixadá
230837,Itapipoca
230840,Juazeiro do Norte
230850,Iguatú
230860,Crateús
230870,Russas
230880,Sobral
230890,Acaraú
230900,Sobral
230910,Baturité
230920,Crato
230930,Crateús
230940,Crateús
230945,Cascavel
230950,Icó
230960,Cascavel
230970,Maracanaú
230980,Baturité
230990,Sobral
231000,Russas
231010,Maracanaú
231020,Caucaia
231025,Caucaia
231030,Tauá
231040,Canindé
231050,Quixadá
231060,Brejo Santo
231070,Caucaia
231080,Limoeiro do Norte
231085,Cascavel
231090,Iguatú
231095,Sobral
231100,Crateús
231110,Brejo Santo
231120,Crato
231123,Limoeiro do Norte
231126,Crateús
231130,Quixadá
231135,Iguatú
231140,Quixadá
231150,Limoeiro do Norte
231160,Maracanaú
231170,Sobral
231180,Russas
231190,Iguatú
231195,Crato
231200,Sobral
231210,Crato
231220,Sobral
231230,Tianguá
231240,Caucaia
231250,Limoeiro do Norte
231260,Caucaia
231270,Quixadá
231280,Sobral
231290,Sobral
231300,Quixadá
231310,Limoeiro do Norte
231320,Crateús
231325,Crato
231330,Tauá
231335,Caucaia
231340,Tianguá
231350,Itapipoca
231355,Itapipoca
231360,Tianguá
231370,Icó
231375,Itapipoca
231380,Itapipoca
231390,Sobral
231395,Sobral
231400,Crato
231410,Tianguá
