CD_MUN,region
290010,Seabra
290020,Paulo Afonso
290030,Alagoinhas
290035,Ribeira do Pombal
290040,Serrinha
290050,Brumado
290060,Jequié
290070,Alagoinhas
290080,Teixeira de Freitas
290090,Itabuna
290100,Santo Antônio de Jesus
290110,Feira de Santana
290115,Irecê
290120,Vitória da Conquista
290130,Itaberaba
290135,Senhor do Bonfim
290140,Barreiras
290150,Feira de Santana
290160,Ribeira do Pombal
290170,Feira de Santana
290180,Senhor do Bonfim
290190,Alagoinhas
290195,Jequié
290200,Brumado
290205,Alagoinhas
290210,Serrinha
290220,Alagoinhas
290225,Ilhéus
290230,Santo Antônio de Jesus
290240,Itabuna
290250,Barreiras
290260,Feira de Santana
290265,Ribeira do Pombal
290270,Ibotirama
290280,Brumado
290290,Vitória da Conquista
290300,Irecê
290310,Jequié
290320,Barreiras
290323,Irecê
290327,Serrinha
290330,Itabuna
290340,Porto Seguro
290350,Vitória da Conquista
290360,Serrinha
290370,Jequié
290380,Itaberaba
290390,Santa Maria da Vitória
290395,Vitória da Conquista
290400,Seabra
290405,Itaberaba
290410,Brumado
290420,Brumado
290430,Jequié
290440,Barreiras
290450,Ibotirama
290460,Brumado
290470,Itabuna
290475,Ibotirama
290480,Itapetinga
290485,Cruz das Almas
290490,Cruz das Almas
290500,Guanambi
290510,Jacobina
290515,Vitória da Conquista
290520,Guanambi
290530,Irecê
290540,Valença
290550,Jacobina
290560,Itabuna
290570,Camaçari
290580,Valença
290590,Juazeiro
290600,Senhor do Bonfim
290610,Santa Maria da Vitória
290620,Irecê
290630,Ilhéus
290640,Feira de Santana
290650,Salvador
290660,Guanambi
290670,Vitória da Conquista
290680,Serrinha
290682,Juazeiro
290685,Feira de Santana
290687,Jacobina
290689,Vitória da Conquista
290690,Teixeira de Freitas
290700,Alagoinhas
290710,Guanambi
290720,Juazeiro
290730,Santo Antônio de Jesus
290740,Barreiras
290750,Alagoinhas
290755,Brumado
290760,Irecê
290770,Paulo Afonso
290780,Ribeira do Pombal
290790,Ribeira do Pombal
290800,Itabuna
290810,Santa Maria da Vitória
290820,Cruz das Almas
290830,Santo Antônio de Jesus
290840,Serrinha
290850,Feira de Santana
290860,Camaçari
290870,Vitória da Conquista
290880,Brumado
290890,Feira de Santana
290900,Vitória da Conquista
290910,Santa Maria da Vitória
290920,Ribeira do Pombal
290930,Santa Maria da Vitória
290940,Barreiras
290950,Jequié
290960,Alagoinhas
290970,Barreiras
290980,Cruz das Almas
290990,Juazeiro
291000,Jequié
291005,Camaçari
291010,Brumado
291020,Santo Antônio de Jesus
291030,Santo Antônio de Jesus
291040,Vitória da Conquista
291050,Alagoinhas
291060,Alagoinhas
291070,Serrinha
291072,Porto Seguro
291075,Ribeira do Pombal
291077,Santa Maria da Vitória
291080,Feira de Santana
291085,Senhor do Bonfim
291090,Itapetinga
291100,Itabuna
291110,Barreiras
291120,Valença
291125,Feira de Santana
291130,Irecê
291140,Paulo Afonso
291150,Itabuna
291160,Cruz das Almas
291165,Brumado
291170,Guanambi
291180,Porto Seguro
291185,Ribeira do Pombal
291190,Itaberaba
291200,Guanambi
291210,Itabuna
291220,Brumado
291230,Itapetinga
291240,Irecê
291250,Brumado
291260,Itaberaba
291270,Itabuna
291280,Teixeira de Freitas
291290,Jequié
291300,Seabra
291310,Irecê
291320,Ibotirama
291330,Feira de Santana
291340,Guanambi
291345,Valença
291350,Itapetinga
291360,Ilhéus
291370,Alagoinhas
291380,Feira de Santana
291390,Jequié
291400,Feira de Santana
291410,Ibotirama
291420,Jequié
291430,Jequié
291440,Seabra
291450,Feira de Santana
291460,Irecê
291465,Porto Seguro
291470,Itaberaba
291480,Itabuna
291490,Ilhéus
291500,Itaberaba
291510,Jequié
291520,Jequié
291530,Porto Seguro
291535,Irecê
291540,Itabuna
291550,Itabuna
291560,Teixeira de Freitas
291570,Jequié
291580,Itapetinga
291590,Alagoinhas
291600,Teixeira de Freitas
291610,Salvador
291620,Itabuna
291630,Porto Seguro
291640,Itapetinga
291650,Alagoinhas
291660,Itabuna
291670,Jequié
291680,Itapetinga
291685,Santo Antônio de Jesus
291690,Jequié
291700,Senhor do Bonfim
291710,Itapetinga
291720,Brumado
291730,Valença
291733,Guanambi
291735,Santa Maria da Vitória
291740,Guanambi
291750,Jacobina
291760,Jequié
291770,Senhor do Bonfim
291780,Santo Antônio de Jesus
291790,Alagoinhas
291800,Jequié
291810,Paulo Afonso
291820,Santo Antônio de Jesus
291830,Jequié
291835,Irecê
291840,Juazeiro
291845,Teixeira de Freitas
291850,Irecê
291855,Itabuna
291860,Brumado
291870,Jequié
291875,Guanambi
291880,Santo Antônio de Jesus
291890,Teixeira de Freitas
291900,Itaberaba
291905,Jequié
291910,Serrinha
291915,Irecê
291920,Salvador
291930,Seabra
291940,Guanambi
291950,Brumado
291955,Barreiras
291960,Itaberaba
291970,Itapetinga
291980,Brumado
291990,Paulo Afonso
291992,Salvador
291995,Vitória da Conquista
292000,Itapetinga
292010,Jacobina
292020,Guanambi
292030,Brumado
292040,Jequié
292045,Barreiras
292050,Jequié
292060,Cruz das Almas
292070,Itabuna
292080,Itaberaba
292090,Ilhéus
292100,Camaçari
292105,Guanambi
292110,Teixeira de Freitas
292120,Jacobina
292130,Santo Antônio de Jesus
292140,Jacobina
292145,Vitória da Conquista
292150,Serrinha
292160,Ibotirama
292170,Jacobina
292180,Guanambi
292190,Seabra
292200,Teixeira de Freitas
292205,Irecê
292210,Feira de Santana
292220,Santo Antônio de Jesus
292225,Ibotirama
292230,Cruz das Almas
292240,Santo Antônio de Jesus
292250,Santo Antônio de Jesus
292260,Valença
292265,Serrinha
292270,Itapetinga
292273,Feira de Santana
292275,Valença
292280,Santo Antônio de Jesus
292285,Itaberaba
292290,Ribeira do Pombal
292300,Teixeira de Freitas
292303,Seabra
292305,Ribeira do Pombal
292310,Ribeira do Pombal
292320,Ibotirama
292330,Alagoinhas
292335,Jacobina
292340,Guanambi
292350,Seabra
292360,Brumado
292370,Ibotirama
292380,Ribeira do Pombal
292390,Itabuna
292400,Paulo Afonso
292405,Feira de Santana
292410,Alagoinhas
292420,Paulo Afonso
292430,Seabra
292440,Juazeiro
292450,Guanambi
292460,Senhor do Bonfim
292465,Feira de Santana
292467,Valença
292470,Vitória da Conquista
292480,Jacobina
292490,Jequié
292500,Vitória da Conquista
292510,Vitória da Conquista
292520,Camaçari
292525,Senhor do Bonfim
292530,Porto Seguro
292540,Itapetinga
292550,Teixeira de Freitas
292560,Irecê
292570,Vitória da Conquista
292575,Santo Antônio de Jesus
292580,Serrinha
292590,Serrinha
292593,Jacobina
292595,Feira de Santana
292600,Juazeiro
292610,Serrinha
292620,Barreiras
292630,Feira de Santana
292640,Guanambi
292650,Ribeira do Pombal
292660,Ribeira do Pombal
292665,Vitória da Conquista
292670,Brumado
292680,Guanambi
292690,Brumado
292700,Alagoinhas
292710,Paulo Afonso
292720,Itaberaba
292730,Santo Antônio de Jesus
292740,Salvador
292750,Feira de Santana
292760,Paulo Afonso
292770,Porto Seguro
292780,Itabuna
292790,Jequié
292800,Serrinha
292805,Ilhéus
292810,Santa Maria da Vitória
292820,Santa Maria da Vitória
292830,Feira de Santana
292840,Barreiras
292850,Santo Antônio de Jesus
292860,Salvador
292870,Santo Antônio de Jesus
292880,Feira de Santana
292890,Barreiras
292895,Serrinha
292900,Cruz das Almas
292905,Santa Maria da Vitória
292910,Santo Antônio de Jesus
292920,Salvador
292925,Irecê
292930,Feira de Santana
292935,Itabuna
292937,Jacobina
292940,Santo Antônio de Jesus
292950,Salvador
292960,Cruz das Almas
292970,Alagoinhas
292975,Salvador
292980,Jacobina
292990,Seabra
293000,Guanambi
293010,Senhor do Bonfim
293015,Santa Maria da Vitória
293020,Juazeiro
293030,Santa Maria da Vitória
293040,Feira de Santana
293050,Serrinha
293060,Jacobina
293070,Camaçari
293075,Santa Maria da Vitória
293076,Ribeira do Pombal
293077,Juazeiro
293080,Seabra
293090,Barreiras
293100,Brumado
293105,Guanambi
293110,Feira de Santana
293120,Valença
293130,Jacobina
293135,Teixeira de Freitas
293140,Feira de Santana
293150,Serrinha
293160,Valença
293170,Feira de Santana
293180,Vitória da Conquista
293190,Serrinha
293200,Juazeiro
293210,Santo Antônio de Jesus
293220,Itabuna
293230,Itabuna
293240,Irecê
293245,Jacobina
293250,Ilhéus
293260,Guanambi
293270,Ilhéus
293280,Itaberaba
293290,Valença
293300,Serrinha
293305,Jacobina
293310,Jacobina
293315,Jacobina
293317,Santo Antônio de Jesus
293320,Salvador
293325,Teixeira de Freitas
293330,Vitória da Conquista
293340,Itaberaba
293345,Barreiras
293350,Valença
293360,Irecê
