year,macroregion,self_hospitalizations,to_hospitalizations,from_hospitalizations,lifo,lofi
1994,1ª Macro - Fortaleza,36419,37763,36581,0.9644096072875566,0.9955714715289358
1994,2ª Macro - Sobral,15502,15649,15875,0.9906064285257844,0.976503937007874
1994,3ª Macro - Cariri,21078,21149,21355,0.9966428672750485,0.9870287988761414
1994,4ª Macro - Sertão Central,5001,5090,5504,0.9825147347740668,0.9086119186046512
1994,5ª Macro - Litoral Leste/Jaguaribe,5165,5229,5565,0.9877605660738191,0.9281221922731356
1995,1ª Macro - Fortaleza,342147,356311,345068,0.9602482101310372,0.9915350017967474
1995,2ª Macro - Sobral,136537,137315,140110,0.9943341950988602,0.9744986082363857
1995,3ª Macro - Cariri,161439,163737,164361,0.9859652980083915,0.9822220599777319
1995,4ª Macro - Sertão Central,40794,41525,45783,0.9823961468994582,0.8910294214009566
1995,5ª Macro - Litoral Leste/Jaguaribe,43843,44622,48188,0.9825422437362736,0.9098323234000166
1996,1ª Macro - Fortaleza,244987,256566,245656,0.9548693123796606,0.9972766795844595
1996,2ª Macro - Sobral,97258,97779,100387,0.9946716575133719,0.9688306254793947
1996,3ª Macro - Cariri,100502,101000,102893,0.9950693069306931,0.9767622675983789
1996,4ª Macro - Sertão Central,32472,33116,36484,0.980553206909047,0.8900339875013704
1996,5ª Macro - Litoral Leste/Jaguaribe,29671,30074,33115,0.9865997206889672,0.8959987920881776
1997,1ª Macro - Fortaleza,242632,254123,243234,0.9547817395513196,0.9975250170617594
1997,2ª Macro - Sobral,96845,97276,99948,0.9955693079485176,0.9689538560051226
1997,3ª Macro - Cariri,96770,97183,98809,0.995750285543768,0.9793642279549434
1997,4ª Macro - Sertão Central,33922,34235,37970,0.9908573097707025,0.8933895180405583
1997,5ª Macro - Litoral Leste/Jaguaribe,28951,29503,32359,0.9812900383011897,0.8946815414567817
1998,1ª Macro - Fortaleza,246145,258681,246622,0.9515387678260097,0.9980658659811371
1998,2ª Macro - Sobral,92235,92572,95317,0.9963595903728989,0.9676657888939014
1998,3ª Macro - Cariri,95269,95551,97546,0.9970486965076242,0.9766571668751153
1998,4ª Macro - Sertão Central,34554,34800,38990,0.9929310344827587,0.8862272377532701
1998,5ª Macro - Litoral Leste/Jaguaribe,26736,27347,30476,0.9776575127070611,0.8772804830030188
1999,1ª Macro - Fortaleza,259433,273454,259795,0.9487262940019162,0.9986065936603861
1999,2ª Macro - Sobral,94459,94764,97513,0.996781478198472,0.968681098930399
1999,3ª Macro - Cariri,97438,97657,99909,0.9977574572227286,0.9752674934190113
1999,4ª Macro - Sertão Central,34339,34490,39349,0.9956219193969267,0.8726778317110981
1999,5ª Macro - Litoral Leste/Jaguaribe,28076,28567,32366,0.9828123359120664,0.8674535005870357
2000,1ª Macro - Fortaleza,263285,279559,263614,0.941786885773665,0.9987519630975593
2000,2ª Macro - Sobral,90861,91052,94508,0.9979022975881914,0.9614106742286367
2000,3ª Macro - Cariri,99428,99657,102233,0.9977021182656511,0.9725626754570442
2000,4ª Macro - Sertão Central,32501,32601,38133,0.9969326094291586,0.8523064012797315
2000,5ª Macro - Litoral Leste/Jaguaribe,26099,26624,31005,0.9802809495192307,0.8417674568617964
2001,1ª Macro - Fortaleza,258503,274374,258853,0.942155597833614,0.9986478812298872
2001,2ª Macro - Sobral,87552,87747,91318,0.997777701801771,0.9587594997700344
2001,3ª Macro - Cariri,98420,98628,101213,0.9978910654175285,0.9724047306176085
2001,4ª Macro - Sertão Central,32941,33057,38390,0.9964909096409232,0.858061995311279
2001,5ª Macro - Litoral Leste/Jaguaribe,26533,27091,31123,0.9794027536820347,0.8525206438967966
2002,1ª Macro - Fortaleza,261845,277985,262160,0.9419393132722989,0.9987984436985047
2002,2ª Macro - Sobral,86692,86874,90701,0.9979050118562516,0.9557998258012591
2002,3ª Macro - Cariri,98572,98762,100995,0.9980761831473643,0.9760087133026387
2002,4ª Macro - Sertão Central,32292,32384,37573,0.9971590909090909,0.8594469432837409
2002,5ª Macro - Litoral Leste/Jaguaribe,27983,28521,33097,0.9811367062865959,0.8454844849986404
2003,1ª Macro - Fortaleza,261278,279389,261537,0.9351764027932381,0.9990097003483255
2003,2ª Macro - Sobral,83803,83953,88741,0.9982132860052648,0.9443549204989802
2003,3ª Macro - Cariri,94205,94351,97018,0.9984525866180539,0.971005380444866
2003,4ª Macro - Sertão Central,31842,32020,37236,0.9944409743910056,0.8551401869158879
2003,5ª Macro - Litoral Leste/Jaguaribe,24378,24827,30008,0.9819148507673098,0.8123833644361503
2004,1ª Macro - Fortaleza,266089,281958,266353,0.9437185680136758,0.9990088341411585
2004,2ª Macro - Sobral,88551,88676,92781,0.9985903739455997,0.954408769036764
2004,3ª Macro - Cariri,98347,98539,100837,0.9980515328956048,0.9753066830627647
2004,4ª Macro - Sertão Central,30496,30673,35578,0.9942294526130473,0.8571589184327393
2004,5ª Macro - Litoral Leste/Jaguaribe,26212,26676,30973,0.9826060878692457,0.8462854744454847
2005,1ª Macro - Fortaleza,272079,288107,272391,0.9443678910960164,0.9988545877066423
2005,2ª Macro - Sobral,96244,96383,100366,0.9985578369629499,0.9589303150469283
2005,3ª Macro - Cariri,101084,101254,103770,0.9983210539830525,0.9741158330924159
2005,4ª Macro - Sertão Central,30390,30573,35357,0.9940143263664017,0.859518624317674
2005,5ª Macro - Litoral Leste/Jaguaribe,25591,26092,30525,0.9807987122489652,0.8383619983619983
2006,1ª Macro - Fortaleza,268630,285653,268970,0.9404067172408481,0.9987359185039224
2006,2ª Macro - Sobral,87830,87937,92156,0.9987832198050878,0.9530578584139937
2006,3ª Macro - Cariri,103773,103898,106719,0.9987968969566305,0.9723947938042897
2006,4ª Macro - Sertão Central,29766,29950,35103,0.993856427378965,0.8479617126741305
2006,5ª Macro - Litoral Leste/Jaguaribe,24854,25339,29829,0.9808595445755555,0.833215997854437
2007,1ª Macro - Fortaleza,273921,293398,274305,0.9336157710686508,0.9986000984305791
2007,2ª Macro - Sobral,94694,94806,99547,0.9988186401704533,0.9512491586888605
2007,3ª Macro - Cariri,101808,101891,105212,0.9991854040101678,0.9676462760901798
2007,4ª Macro - Sertão Central,29681,29978,35353,0.9900927346720929,0.8395609990665573
2007,5ª Macro - Litoral Leste/Jaguaribe,23887,24291,29947,0.9833683257173439,0.7976425017530971
2008,1ª Macro - Fortaleza,258750,277760,259263,0.9315596198156681,0.9980213142638942
2008,2ª Macro - Sobral,87488,87638,92199,0.9982884137018189,0.9489040011279949
2008,3ª Macro - Cariri,98201,98331,101510,0.9986779347306546,0.9674022263816373
2008,4ª Macro - Sertão Central,28588,28872,34250,0.9901634801884178,0.8346861313868613
2008,5ª Macro - Litoral Leste/Jaguaribe,24857,25259,30638,0.9840848806366048,0.8113127488739473
2009,1ª Macro - Fortaleza,265611,284893,266189,0.9323184493827508,0.9978286104985555
2009,2ª Macro - Sobral,89566,89721,94019,0.9982724222868671,0.952637232899733
2009,3ª Macro - Cariri,101362,101480,104908,0.9988372093023256,0.9661989552750981
2009,4ª Macro - Sertão Central,31346,31639,36978,0.9907392774740036,0.847693222997458
2009,5ª Macro - Litoral Leste/Jaguaribe,27524,27970,33609,0.9840543439399356,0.8189473057811896
2010,1ª Macro - Fortaleza,252037,272659,252703,0.9243670665556611,0.9973644950792037
2010,2ª Macro - Sobral,86224,86392,91038,0.9980553754977313,0.9471209824468904
2010,3ª Macro - Cariri,98595,98753,102287,0.9984000486061183,0.9639054816350073
2010,4ª Macro - Sertão Central,31458,31765,37596,0.9903352746733827,0.8367379508458347
2010,5ª Macro - Litoral Leste/Jaguaribe,25408,25937,31882,0.979604426109419,0.7969387114986513
2011,1ª Macro - Fortaleza,253308,274690,254038,0.9221595252830463,0.9971264141585117
2011,2ª Macro - Sobral,88796,88950,93520,0.9982686902754356,0.9494867408041061
2011,3ª Macro - Cariri,96753,96882,100823,0.9986684833095931,0.9596322267736528
2011,4ª Macro - Sertão Central,30228,30488,36702,0.9914720545788507,0.8236063429785843
2011,5ª Macro - Litoral Leste/Jaguaribe,24808,25447,31374,0.9748889849491099,0.7907184292726461
2012,1ª Macro - Fortaleza,239284,261181,240007,0.9161615890895586,0.9969875878620207
2012,2ª Macro - Sobral,80763,80917,85752,0.9980968152551379,0.941820598936468
2012,3ª Macro - Cariri,87867,88034,91836,0.9981030056569052,0.956781654253234
2012,4ª Macro - Sertão Central,28279,28653,35068,0.9869472655568352,0.8064046994410858
2012,5ª Macro - Litoral Leste/Jaguaribe,23442,24096,30218,0.9728585657370518,0.7757627903898339
2013,1ª Macro - Fortaleza,263572,288775,264010,0.9127244394424725,0.9983409719328813
2013,2ª Macro - Sobral,80500,80725,85379,0.9972127593682255,0.9428548003607444
2013,3ª Macro - Cariri,91414,91583,95776,0.9981546793618903,0.9544562312061476
2013,4ª Macro - Sertão Central,28985,29174,37324,0.993521628847604,0.776578073089701
2013,5ª Macro - Litoral Leste/Jaguaribe,25824,26095,33863,0.9896148687488024,0.7626022502436287
2014,1ª Macro - Fortaleza,257214,282699,258011,0.9098511137287362,0.9969109844153932
2014,2ª Macro - Sobral,85362,85786,90455,0.9950574685846175,0.9436957603228124
2014,3ª Macro - Cariri,92448,92625,96955,0.998089068825911,0.9535145170439895
2014,4ª Macro - Sertão Central,27729,28139,35952,0.9854294751057252,0.7712783711615487
2014,5ª Macro - Litoral Leste/Jaguaribe,24835,25350,33226,0.9796844181459566,0.7474568109311984
2015,1ª Macro - Fortaleza,263427,290114,264158,0.9080120228599792,0.9972327167831374
2015,2ª Macro - Sobral,83827,84132,89411,0.9963747444491988,0.9375468342821353
2015,3ª Macro - Cariri,88746,88940,93055,0.9978187542163256,0.9536940519047875
2015,4ª Macro - Sertão Central,27926,28451,36216,0.9815472215387859,0.7710956483322289
2015,5ª Macro - Litoral Leste/Jaguaribe,22250,22681,31478,0.9809973105242273,0.7068428743884618
2016,1ª Macro - Fortaleza,261835,290251,262395,0.902098528514975,0.9978658129918634
2016,2ª Macro - Sobral,80015,80287,85795,0.9966121538978913,0.9326301066495717
2016,3ª Macro - Cariri,86450,86660,90819,0.9975767366720517,0.9518933262863498
2016,4ª Macro - Sertão Central,27470,27826,36289,0.9872062100194063,0.7569786987792444
2016,5ª Macro - Litoral Leste/Jaguaribe,19648,19925,29651,0.9860978670012547,0.6626420694074399
2017,1ª Macro - Fortaleza,254968,281992,255762,0.9041674941133082,0.9968955513328798
2017,2ª Macro - Sobral,83231,83577,88798,0.9958601050528255,0.9373071465573549
2017,3ª Macro - Cariri,88584,88810,92816,0.997455241526855,0.9544044130322358
2017,4ª Macro - Sertão Central,29236,29612,37430,0.9873024449547481,0.7810846914239915
2017,5ª Macro - Litoral Leste/Jaguaribe,20372,20803,29988,0.9792818343508148,0.6793384020274776
2018,1ª Macro - Fortaleza,259997,288833,261592,0.9001637624509665,0.9939027187375761
2018,2ª Macro - Sobral,91171,91474,97266,0.9966875833570195,0.9373367877778463
2018,3ª Macro - Cariri,88863,89072,93337,0.9976535836177475,0.9520661688290817
2018,4ª Macro - Sertão Central,36032,38050,44958,0.9469645203679369,0.8014591396414431
2018,5ª Macro - Litoral Leste/Jaguaribe,23948,24603,34879,0.9733772304190546,0.6866022535049744
2019,1ª Macro - Fortaleza,265903,297861,268406,0.8927083438248042,0.9906745750840145
2019,2ª Macro - Sobral,104446,104815,111751,0.9964795115202977,0.9346314574366225
2019,3ª Macro - Cariri,96372,96602,101650,0.9976190969131074,0.9480767338908018
2019,4ª Macro - Sertão Central,40284,44282,49972,0.9097150083555395,0.8061314336028176
2019,5ª Macro - Litoral Leste/Jaguaribe,23537,24236,36017,0.9711586070308632,0.653496959768998
2020,1ª Macro - Fortaleza,97852,109490,98809,0.8937071878710384,0.9903146474511431
2020,2ª Macro - Sobral,37608,37752,40135,0.996185632549269,0.9370374984427557
2020,3ª Macro - Cariri,34766,34829,36718,0.9981911625369663,0.9468380630753309
2020,4ª Macro - Sertão Central,13592,15278,17187,0.8896452415237597,0.7908302786990167
2020,5ª Macro - Litoral Leste/Jaguaribe,9042,9286,13786,0.9737238854189102,0.6558827796315102
