year,from,to,hospitalizations,distance
1995,"{'latlong': [-41.86991671512915, -21.948198574820594], 'name': 'Macrorregião III'}","{'latlong': [-42.79682064784672, -22.45311155661895], 'name': 'Macrorregião II'}",1,111.05112669036502
1995,"{'latlong': [-42.79682064784672, -22.45311155661895], 'name': 'Macrorregião II'}","{'latlong': [-42.79682064784672, -22.45311155661895], 'name': 'Macrorregião II'}",1,0.0
1998,"{'latlong': [-41.86991671512915, -21.948198574820594], 'name': 'Macrorregião III'}","{'latlong': [-41.86991671512915, -21.948198574820594], 'name': 'Macrorregião III'}",3862,0.0
1998,"{'latlong': [-41.86991671512915, -21.948198574820594], 'name': 'Macrorregião III'}","{'latlong': [-42.79682064784672, -22.45311155661895], 'name': 'Macrorregião II'}",1768,111.05112669036502
1998,"{'latlong': [-41.86991671512915, -21.948198574820594], 'name': 'Macrorregião III'}","{'latlong': [-44.01167450855507, -22.6158211044684], 'name': 'Metropolitana I'}",7,244.0886827880899
1998,"{'latlong': [-42.79682064784672, -22.45311155661895], 'name': 'Macrorregião II'}","{'latlong': [-41.86991671512915, -21.948198574820594], 'name': 'Macrorregião III'}",134,111.05112669036502
1998,"{'latlong': [-42.79682064784672, -22.45311155661895], 'name': 'Macrorregião II'}","{'latlong': [-42.79682064784672, -22.45311155661895], 'name': 'Macrorregião II'}",50874,0.0
1998,"{'latlong': [-42.79682064784672, -22.45311155661895], 'name': 'Macrorregião II'}","{'latlong': [-44.01167450855507, -22.6158211044684], 'name': 'Metropolitana I'}",11105,135.6129357760374
1998,"{'latlong': [-44.01167450855507, -22.6158211044684], 'name': 'Metropolitana I'}","{'latlong': [-41.86991671512915, -21.948198574820594], 'name': 'Macrorregião III'}",1,244.0886827880899
1998,"{'latlong': [-44.01167450855507, -22.6158211044684], 'name': 'Metropolitana I'}","{'latlong': [-42.79682064784672, -22.45311155661895], 'name': 'Macrorregião II'}",846,135.6129357760374
1998,"{'latlong': [-44.01167450855507, -22.6158211044684], 'name': 'Metropolitana I'}","{'latlong': [-44.01167450855507, -22.6158211044684], 'name': 'Metropolitana I'}",9306,0.0
1999,"{'latlong': [-41.86991671512915, -21.948198574820594], 'name': 'Macrorregião III'}","{'latlong': [-41.86991671512915, -21.948198574820594], 'name': 'Macrorregião III'}",7660,0.0
1999,"{'latlong': [-41.86991671512915, -21.948198574820594], 'name': 'Macrorregião III'}","{'latlong': [-42.79682064784672, -22.45311155661895], 'name': 'Macrorregião II'}",3997,111.05112669036502
1999,"{'latlong': [-41.86991671512915, -21.948198574820594], 'name': 'Macrorregião III'}","{'latlong': [-44.01167450855507, -22.6158211044684], 'name': 'Metropolitana I'}",20,244.0886827880899
1999,"{'latlong': [-42.79682064784672, -22.45311155661895], 'name': 'Macrorregião II'}","{'latlong': [-41.86991671512915, -21.948198574820594], 'name': 'Macrorregião III'}",271,111.05112669036502
1999,"{'latlong': [-42.79682064784672, -22.45311155661895], 'name': 'Macrorregião II'}","{'latlong': [-42.79682064784672, -22.45311155661895], 'name': 'Macrorregião II'}",100614,0.0
1999,"{'latlong': [-42.79682064784672, -22.45311155661895], 'name': 'Macrorregião II'}","{'latlong': [-44.01167450855507, -22.6158211044684], 'name': 'Metropolitana I'}",19328,135.6129357760374
1999,"{'latlong': [-44.01167450855507, -22.6158211044684], 'name': 'Metropolitana I'}","{'latlong': [-41.86991671512915, -21.948198574820594], 'name': 'Macrorregião III'}",6,244.0886827880899
1999,"{'latlong': [-44.01167450855507, -22.6158211044684], 'name': 'Metropolitana I'}","{'latlong': [-42.79682064784672, -22.45311155661895], 'name': 'Macrorregião II'}",1676,135.6129357760374
1999,"{'latlong': [-44.01167450855507, -22.6158211044684], 'name': 'Metropolitana I'}","{'latlong': [-44.01167450855507, -22.6158211044684], 'name': 'Metropolitana I'}",16345,0.0
2000,"{'latlong': [-41.86991671512915, -21.948198574820594], 'name': 'Macrorregião III'}","{'latlong': [-41.86991671512915, -21.948198574820594], 'name': 'Macrorregião III'}",7613,0.0
2000,"{'latlong': [-41.86991671512915, -21.948198574820594], 'name': 'Macrorregião III'}","{'latlong': [-42.79682064784672, -22.45311155661895], 'name': 'Macrorregião II'}",4464,111.05112669036502
2000,"{'latlong': [-41.86991671512915, -21.948198574820594], 'name': 'Macrorregião III'}","{'latlong': [-44.01167450855507, -22.6158211044684], 'name': 'Metropolitana I'}",39,244.0886827880899
2000,"{'latlong': [-42.79682064784672, -22.45311155661895], 'name': 'Macrorregião II'}","{'latlong': [-41.86991671512915, -21.948198574820594], 'name': 'Macrorregião III'}",185,111.05112669036502
2000,"{'latlong': [-42.79682064784672, -22.45311155661895], 'name': 'Macrorregião II'}","{'latlong': [-42.79682064784672, -22.45311155661895], 'name': 'Macrorregião II'}",104907,0.0
2000,"{'latlong': [-42.79682064784672, -22.45311155661895], 'name': 'Macrorregião II'}","{'latlong': [-44.01167450855507, -22.6158211044684], 'name': 'Metropolitana I'}",19195,135.6129357760374
2000,"{'latlong': [-44.01167450855507, -22.6158211044684], 'name': 'Metropolitana I'}","{'latlong': [-41.86991671512915, -21.948198574820594], 'name': 'Macrorregião III'}",3,244.0886827880899
2000,"{'latlong': [-44.01167450855507, -22.6158211044684], 'name': 'Metropolitana I'}","{'latlong': [-42.79682064784672, -22.45311155661895], 'name': 'Macrorregião II'}",1541,135.6129357760374
2000,"{'latlong': [-44.01167450855507, -22.6158211044684], 'name': 'Metropolitana I'}","{'latlong': [-44.01167450855507, -22.6158211044684], 'name': 'Metropolitana I'}",16271,0.0
2001,"{'latlong': [-41.86991671512915, -21.948198574820594], 'name': 'Macrorregião III'}","{'latlong': [-41.86991671512915, -21.948198574820594], 'name': 'Macrorregião III'}",7386,0.0
2001,"{'latlong': [-41.86991671512915, -21.948198574820594], 'name': 'Macrorregião III'}","{'latlong': [-42.79682064784672, -22.45311155661895], 'name': 'Macrorregião II'}",2747,111.05112669036502
2001,"{'latlong': [-41.86991671512915, -21.948198574820594], 'name': 'Macrorregião III'}","{'latlong': [-44.01167450855507, -22.6158211044684], 'name': 'Metropolitana I'}",17,244.0886827880899
2001,"{'latlong': [-42.79682064784672, -22.45311155661895], 'name': 'Macrorregião II'}","{'latlong': [-41.86991671512915, -21.948198574820594], 'name': 'Macrorregião III'}",185,111.05112669036502
2001,"{'latlong': [-42.79682064784672, -22.45311155661895], 'name': 'Macrorregião II'}","{'latlong': [-42.79682064784672, -22.45311155661895], 'name': 'Macrorregião II'}",98275,0.0
2001,"{'latlong': [-42.79682064784672, -22.45311155661895], 'name': 'Macrorregião II'}","{'latlong': [-44.01167450855507, -22.6158211044684], 'name': 'Metropolitana I'}",15051,135.6129357760374
2001,"{'latlong': [-44.01167450855507, -22.6158211044684], 'name': 'Metropolitana I'}","{'latlong': [-42.79682064784672, -22.45311155661895], 'name': 'Macrorregião II'}",1231,135.6129357760374
2001,"{'latlong': [-44.01167450855507, -22.6158211044684], 'name': 'Metropolitana I'}","{'latlong': [-44.01167450855507, -22.6158211044684], 'name': 'Metropolitana I'}",15362,0.0
2002,"{'latlong': [-41.86991671512915, -21.948198574820594], 'name': 'Macrorregião III'}","{'latlong': [-41.86991671512915, -21.948198574820594], 'name': 'Macrorregião III'}",6724,0.0
2002,"{'latlong': [-41.86991671512915, -21.948198574820594], 'name': 'Macrorregião III'}","{'latlong': [-42.79682064784672, -22.45311155661895], 'name': 'Macrorregião II'}",2384,111.05112669036502
2002,"{'latlong': [-41.86991671512915, -21.948198574820594], 'name': 'Macrorregião III'}","{'latlong': [-44.01167450855507, -22.6158211044684], 'name': 'Metropolitana I'}",23,244.0886827880899
2002,"{'latlong': [-42.79682064784672, -22.45311155661895], 'name': 'Macrorregião II'}","{'latlong': [-41.86991671512915, -21.948198574820594], 'name': 'Macrorregião III'}",165,111.05112669036502
2002,"{'latlong': [-42.79682064784672, -22.45311155661895], 'name': 'Macrorregião II'}","{'latlong': [-42.79682064784672, -22.45311155661895], 'name': 'Macrorregião II'}",92849,0.0
2002,"{'latlong': [-42.79682064784672, -22.45311155661895], 'name': 'Macrorregião II'}","{'latlong': [-44.01167450855507, -22.6158211044684], 'name': 'Metropolitana I'}",13540,135.6129357760374
2002,"{'latlong': [-44.01167450855507, -22.6158211044684], 'name': 'Metropolitana I'}","{'latlong': [-41.86991671512915, -21.948198574820594], 'name': 'Macrorregião III'}",2,244.0886827880899
2002,"{'latlong': [-44.01167450855507, -22.6158211044684], 'name': 'Metropolitana I'}","{'latlong': [-42.79682064784672, -22.45311155661895], 'name': 'Macrorregião II'}",1123,135.6129357760374
2002,"{'latlong': [-44.01167450855507, -22.6158211044684], 'name': 'Metropolitana I'}","{'latlong': [-44.01167450855507, -22.6158211044684], 'name': 'Metropolitana I'}",14171,0.0
2003,"{'latlong': [-41.86991671512915, -21.948198574820594], 'name': 'Macrorregião III'}","{'latlong': [-41.86991671512915, -21.948198574820594], 'name': 'Macrorregião III'}",6427,0.0
2003,"{'latlong': [-41.86991671512915, -21.948198574820594], 'name': 'Macrorregião III'}","{'latlong': [-42.79682064784672, -22.45311155661895], 'name': 'Macrorregião II'}",2189,111.05112669036502
2003,"{'latlong': [-41.86991671512915, -21.948198574820594], 'name': 'Macrorregião III'}","{'latlong': [-44.01167450855507, -22.6158211044684], 'name': 'Metropolitana I'}",7,244.0886827880899
2003,"{'latlong': [-42.79682064784672, -22.45311155661895], 'name': 'Macrorregião II'}","{'latlong': [-41.86991671512915, -21.948198574820594], 'name': 'Macrorregião III'}",127,111.05112669036502
2003,"{'latlong': [-42.79682064784672, -22.45311155661895], 'name': 'Macrorregião II'}","{'latlong': [-42.79682064784672, -22.45311155661895], 'name': 'Macrorregião II'}",85348,0.0
2003,"{'latlong': [-42.79682064784672, -22.45311155661895], 'name': 'Macrorregião II'}","{'latlong': [-44.01167450855507, -22.6158211044684], 'name': 'Metropolitana I'}",2289,135.6129357760374
2003,"{'latlong': [-44.01167450855507, -22.6158211044684], 'name': 'Metropolitana I'}","{'latlong': [-42.79682064784672, -22.45311155661895], 'name': 'Macrorregião II'}",984,135.6129357760374
2003,"{'latlong': [-44.01167450855507, -22.6158211044684], 'name': 'Metropolitana I'}","{'latlong': [-44.01167450855507, -22.6158211044684], 'name': 'Metropolitana I'}",23465,0.0
2004,"{'latlong': [-41.86991671512915, -21.948198574820594], 'name': 'Macrorregião III'}","{'latlong': [-41.86991671512915, -21.948198574820594], 'name': 'Macrorregião III'}",6953,0.0
2004,"{'latlong': [-41.86991671512915, -21.948198574820594], 'name': 'Macrorregião III'}","{'latlong': [-42.79682064784672, -22.45311155661895], 'name': 'Macrorregião II'}",2970,111.05112669036502
2004,"{'latlong': [-42.79682064784672, -22.45311155661895], 'name': 'Macrorregião II'}","{'latlong': [-41.86991671512915, -21.948198574820594], 'name': 'Macrorregião III'}",145,111.05112669036502
2004,"{'latlong': [-42.79682064784672, -22.45311155661895], 'name': 'Macrorregião II'}","{'latlong': [-42.79682064784672, -22.45311155661895], 'name': 'Macrorregião II'}",78939,0.0
2004,"{'latlong': [-42.79682064784672, -22.45311155661895], 'name': 'Macrorregião II'}","{'latlong': [-44.01167450855507, -22.6158211044684], 'name': 'Metropolitana I'}",1623,135.6129357760374
2004,"{'latlong': [-44.01167450855507, -22.6158211044684], 'name': 'Metropolitana I'}","{'latlong': [-42.79682064784672, -22.45311155661895], 'name': 'Macrorregião II'}",951,135.6129357760374
2004,"{'latlong': [-44.01167450855507, -22.6158211044684], 'name': 'Metropolitana I'}","{'latlong': [-44.01167450855507, -22.6158211044684], 'name': 'Metropolitana I'}",22256,0.0
2005,"{'latlong': [-41.86991671512915, -21.948198574820594], 'name': 'Macrorregião III'}","{'latlong': [-41.86991671512915, -21.948198574820594], 'name': 'Macrorregião III'}",6752,0.0
2005,"{'latlong': [-41.86991671512915, -21.948198574820594], 'name': 'Macrorregião III'}","{'latlong': [-42.79682064784672, -22.45311155661895], 'name': 'Macrorregião II'}",2991,111.05112669036502
2005,"{'latlong': [-41.86991671512915, -21.948198574820594], 'name': 'Macrorregião III'}","{'latlong': [-44.01167450855507, -22.6158211044684], 'name': 'Metropolitana I'}",2,244.0886827880899
2005,"{'latlong': [-42.79682064784672, -22.45311155661895], 'name': 'Macrorregião II'}","{'latlong': [-41.86991671512915, -21.948198574820594], 'name': 'Macrorregião III'}",89,111.05112669036502
2005,"{'latlong': [-42.79682064784672, -22.45311155661895], 'name': 'Macrorregião II'}","{'latlong': [-42.79682064784672, -22.45311155661895], 'name': 'Macrorregião II'}",76239,0.0
2005,"{'latlong': [-42.79682064784672, -22.45311155661895], 'name': 'Macrorregião II'}","{'latlong': [-44.01167450855507, -22.6158211044684], 'name': 'Metropolitana I'}",1964,135.6129357760374
2005,"{'latlong': [-44.01167450855507, -22.6158211044684], 'name': 'Metropolitana I'}","{'latlong': [-42.79682064784672, -22.45311155661895], 'name': 'Macrorregião II'}",866,135.6129357760374
2005,"{'latlong': [-44.01167450855507, -22.6158211044684], 'name': 'Metropolitana I'}","{'latlong': [-44.01167450855507, -22.6158211044684], 'name': 'Metropolitana I'}",19724,0.0
2006,"{'latlong': [-41.86991671512915, -21.948198574820594], 'name': 'Macrorregião III'}","{'latlong': [-41.86991671512915, -21.948198574820594], 'name': 'Macrorregião III'}",6914,0.0
2006,"{'latlong': [-41.86991671512915, -21.948198574820594], 'name': 'Macrorregião III'}","{'latlong': [-42.79682064784672, -22.45311155661895], 'name': 'Macrorregião II'}",2685,111.05112669036502
2006,"{'latlong': [-41.86991671512915, -21.948198574820594], 'name': 'Macrorregião III'}","{'latlong': [-44.01167450855507, -22.6158211044684], 'name': 'Metropolitana I'}",13,244.0886827880899
2006,"{'latlong': [-42.79682064784672, -22.45311155661895], 'name': 'Macrorregião II'}","{'latlong': [-41.86991671512915, -21.948198574820594], 'name': 'Macrorregião III'}",86,111.05112669036502
2006,"{'latlong': [-42.79682064784672, -22.45311155661895], 'name': 'Macrorregião II'}","{'latlong': [-42.79682064784672, -22.45311155661895], 'name': 'Macrorregião II'}",72876,0.0
2006,"{'latlong': [-42.79682064784672, -22.45311155661895], 'name': 'Macrorregião II'}","{'latlong': [-44.01167450855507, -22.6158211044684], 'name': 'Metropolitana I'}",1330,135.6129357760374
2006,"{'latlong': [-44.01167450855507, -22.6158211044684], 'name': 'Metropolitana I'}","{'latlong': [-42.79682064784672, -22.45311155661895], 'name': 'Macrorregião II'}",790,135.6129357760374
2006,"{'latlong': [-44.01167450855507, -22.6158211044684], 'name': 'Metropolitana I'}","{'latlong': [-44.01167450855507, -22.6158211044684], 'name': 'Metropolitana I'}",17220,0.0
2007,"{'latlong': [-41.86991671512915, -21.948198574820594], 'name': 'Macrorregião III'}","{'latlong': [-41.86991671512915, -21.948198574820594], 'name': 'Macrorregião III'}",6643,0.0
2007,"{'latlong': [-41.86991671512915, -21.948198574820594], 'name': 'Macrorregião III'}","{'latlong': [-42.79682064784672, -22.45311155661895], 'name': 'Macrorregião II'}",2752,111.05112669036502
2007,"{'latlong': [-41.86991671512915, -21.948198574820594], 'name': 'Macrorregião III'}","{'latlong': [-44.01167450855507, -22.6158211044684], 'name': 'Metropolitana I'}",1,244.0886827880899
2007,"{'latlong': [-42.79682064784672, -22.45311155661895], 'name': 'Macrorregião II'}","{'latlong': [-41.86991671512915, -21.948198574820594], 'name': 'Macrorregião III'}",114,111.05112669036502
2007,"{'latlong': [-42.79682064784672, -22.45311155661895], 'name': 'Macrorregião II'}","{'latlong': [-42.79682064784672, -22.45311155661895], 'name': 'Macrorregião II'}",69279,0.0
2007,"{'latlong': [-42.79682064784672, -22.45311155661895], 'name': 'Macrorregião II'}","{'latlong': [-44.01167450855507, -22.6158211044684], 'name': 'Metropolitana I'}",1753,135.6129357760374
2007,"{'latlong': [-44.01167450855507, -22.6158211044684], 'name': 'Metropolitana I'}","{'latlong': [-42.79682064784672, -22.45311155661895], 'name': 'Macrorregião II'}",772,135.6129357760374
2007,"{'latlong': [-44.01167450855507, -22.6158211044684], 'name': 'Metropolitana I'}","{'latlong': [-44.01167450855507, -22.6158211044684], 'name': 'Metropolitana I'}",15743,0.0
2008,"{'latlong': [-41.86991671512915, -21.948198574820594], 'name': 'Macrorregião III'}","{'latlong': [-41.86991671512915, -21.948198574820594], 'name': 'Macrorregião III'}",6671,0.0
2008,"{'latlong': [-41.86991671512915, -21.948198574820594], 'name': 'Macrorregião III'}","{'latlong': [-42.79682064784672, -22.45311155661895], 'name': 'Macrorregião II'}",2378,111.05112669036502
2008,"{'latlong': [-41.86991671512915, -21.948198574820594], 'name': 'Macrorregião III'}","{'latlong': [-44.01167450855507, -22.6158211044684], 'name': 'Metropolitana I'}",7,244.0886827880899
2008,"{'latlong': [-42.79682064784672, -22.45311155661895], 'name': 'Macrorregião II'}","{'latlong': [-41.86991671512915, -21.948198574820594], 'name': 'Macrorregião III'}",37,111.05112669036502
2008,"{'latlong': [-42.79682064784672, -22.45311155661895], 'name': 'Macrorregião II'}","{'latlong': [-42.79682064784672, -22.45311155661895], 'name': 'Macrorregião II'}",64682,0.0
2008,"{'latlong': [-42.79682064784672, -22.45311155661895], 'name': 'Macrorregião II'}","{'latlong': [-44.01167450855507, -22.6158211044684], 'name': 'Metropolitana I'}",6638,135.6129357760374
2008,"{'latlong': [-44.01167450855507, -22.6158211044684], 'name': 'Metropolitana I'}","{'latlong': [-42.79682064784672, -22.45311155661895], 'name': 'Macrorregião II'}",749,135.6129357760374
2008,"{'latlong': [-44.01167450855507, -22.6158211044684], 'name': 'Metropolitana I'}","{'latlong': [-44.01167450855507, -22.6158211044684], 'name': 'Metropolitana I'}",8923,0.0
2009,"{'latlong': [-41.86991671512915, -21.948198574820594], 'name': 'Macrorregião III'}","{'latlong': [-41.86991671512915, -21.948198574820594], 'name': 'Macrorregião III'}",6519,0.0
2009,"{'latlong': [-41.86991671512915, -21.948198574820594], 'name': 'Macrorregião III'}","{'latlong': [-42.79682064784672, -22.45311155661895], 'name': 'Macrorregião II'}",2287,111.05112669036502
2009,"{'latlong': [-41.86991671512915, -21.948198574820594], 'name': 'Macrorregião III'}","{'latlong': [-44.01167450855507, -22.6158211044684], 'name': 'Metropolitana I'}",1,244.0886827880899
2009,"{'latlong': [-42.79682064784672, -22.45311155661895], 'name': 'Macrorregião II'}","{'latlong': [-41.86991671512915, -21.948198574820594], 'name': 'Macrorregião III'}",36,111.05112669036502
2009,"{'latlong': [-42.79682064784672, -22.45311155661895], 'name': 'Macrorregião II'}","{'latlong': [-42.79682064784672, -22.45311155661895], 'name': 'Macrorregião II'}",57151,0.0
2009,"{'latlong': [-42.79682064784672, -22.45311155661895], 'name': 'Macrorregião II'}","{'latlong': [-44.01167450855507, -22.6158211044684], 'name': 'Metropolitana I'}",6679,135.6129357760374
2009,"{'latlong': [-44.01167450855507, -22.6158211044684], 'name': 'Metropolitana I'}","{'latlong': [-42.79682064784672, -22.45311155661895], 'name': 'Macrorregião II'}",643,135.6129357760374
2009,"{'latlong': [-44.01167450855507, -22.6158211044684], 'name': 'Metropolitana I'}","{'latlong': [-44.01167450855507, -22.6158211044684], 'name': 'Metropolitana I'}",7739,0.0
2010,"{'latlong': [-41.86991671512915, -21.948198574820594], 'name': 'Macrorregião III'}","{'latlong': [-41.86991671512915, -21.948198574820594], 'name': 'Macrorregião III'}",6241,0.0
2010,"{'latlong': [-41.86991671512915, -21.948198574820594], 'name': 'Macrorregião III'}","{'latlong': [-42.79682064784672, -22.45311155661895], 'name': 'Macrorregião II'}",2132,111.05112669036502
2010,"{'latlong': [-42.79682064784672, -22.45311155661895], 'name': 'Macrorregião II'}","{'latlong': [-41.86991671512915, -21.948198574820594], 'name': 'Macrorregião III'}",28,111.05112669036502
2010,"{'latlong': [-42.79682064784672, -22.45311155661895], 'name': 'Macrorregião II'}","{'latlong': [-42.79682064784672, -22.45311155661895], 'name': 'Macrorregião II'}",53013,0.0
2010,"{'latlong': [-42.79682064784672, -22.45311155661895], 'name': 'Macrorregião II'}","{'latlong': [-44.01167450855507, -22.6158211044684], 'name': 'Metropolitana I'}",6071,135.6129357760374
2010,"{'latlong': [-44.01167450855507, -22.6158211044684], 'name': 'Metropolitana I'}","{'latlong': [-42.79682064784672, -22.45311155661895], 'name': 'Macrorregião II'}",540,135.6129357760374
2010,"{'latlong': [-44.01167450855507, -22.6158211044684], 'name': 'Metropolitana I'}","{'latlong': [-44.01167450855507, -22.6158211044684], 'name': 'Metropolitana I'}",7323,0.0
2011,"{'latlong': [-41.86991671512915, -21.948198574820594], 'name': 'Macrorregião III'}","{'latlong': [-41.86991671512915, -21.948198574820594], 'name': 'Macrorregião III'}",7074,0.0
2011,"{'latlong': [-41.86991671512915, -21.948198574820594], 'name': 'Macrorregião III'}","{'latlong': [-42.79682064784672, -22.45311155661895], 'name': 'Macrorregião II'}",1839,111.05112669036502
2011,"{'latlong': [-42.79682064784672, -22.45311155661895], 'name': 'Macrorregião II'}","{'latlong': [-41.86991671512915, -21.948198574820594], 'name': 'Macrorregião III'}",7,111.05112669036502
2011,"{'latlong': [-42.79682064784672, -22.45311155661895], 'name': 'Macrorregião II'}","{'latlong': [-42.79682064784672, -22.45311155661895], 'name': 'Macrorregião II'}",51459,0.0
2011,"{'latlong': [-42.79682064784672, -22.45311155661895], 'name': 'Macrorregião II'}","{'latlong': [-44.01167450855507, -22.6158211044684], 'name': 'Metropolitana I'}",5091,135.6129357760374
2011,"{'latlong': [-44.01167450855507, -22.6158211044684], 'name': 'Metropolitana I'}","{'latlong': [-42.79682064784672, -22.45311155661895], 'name': 'Macrorregião II'}",509,135.6129357760374
2011,"{'latlong': [-44.01167450855507, -22.6158211044684], 'name': 'Metropolitana I'}","{'latlong': [-44.01167450855507, -22.6158211044684], 'name': 'Metropolitana I'}",7089,0.0
2012,"{'latlong': [-41.86991671512915, -21.948198574820594], 'name': 'Macrorregião III'}","{'latlong': [-41.86991671512915, -21.948198574820594], 'name': 'Macrorregião III'}",6576,0.0
2012,"{'latlong': [-41.86991671512915, -21.948198574820594], 'name': 'Macrorregião III'}","{'latlong': [-42.79682064784672, -22.45311155661895], 'name': 'Macrorregião II'}",900,111.05112669036502
2012,"{'latlong': [-42.79682064784672, -22.45311155661895], 'name': 'Macrorregião II'}","{'latlong': [-41.86991671512915, -21.948198574820594], 'name': 'Macrorregião III'}",5,111.05112669036502
2012,"{'latlong': [-42.79682064784672, -22.45311155661895], 'name': 'Macrorregião II'}","{'latlong': [-42.79682064784672, -22.45311155661895], 'name': 'Macrorregião II'}",43482,0.0
2012,"{'latlong': [-42.79682064784672, -22.45311155661895], 'name': 'Macrorregião II'}","{'latlong': [-44.01167450855507, -22.6158211044684], 'name': 'Metropolitana I'}",4533,135.6129357760374
2012,"{'latlong': [-44.01167450855507, -22.6158211044684], 'name': 'Metropolitana I'}","{'latlong': [-41.86991671512915, -21.948198574820594], 'name': 'Macrorregião III'}",3,244.0886827880899
2012,"{'latlong': [-44.01167450855507, -22.6158211044684], 'name': 'Metropolitana I'}","{'latlong': [-42.79682064784672, -22.45311155661895], 'name': 'Macrorregião II'}",448,135.6129357760374
2012,"{'latlong': [-44.01167450855507, -22.6158211044684], 'name': 'Metropolitana I'}","{'latlong': [-44.01167450855507, -22.6158211044684], 'name': 'Metropolitana I'}",6412,0.0
2013,"{'latlong': [-41.86991671512915, -21.948198574820594], 'name': 'Macrorregião III'}","{'latlong': [-41.86991671512915, -21.948198574820594], 'name': 'Macrorregião III'}",6298,0.0
2013,"{'latlong': [-41.86991671512915, -21.948198574820594], 'name': 'Macrorregião III'}","{'latlong': [-42.79682064784672, -22.45311155661895], 'name': 'Macrorregião II'}",866,111.05112669036502
2013,"{'latlong': [-41.86991671512915, -21.948198574820594], 'name': 'Macrorregião III'}","{'latlong': [-44.01167450855507, -22.6158211044684], 'name': 'Metropolitana I'}",1,244.0886827880899
2013,"{'latlong': [-42.79682064784672, -22.45311155661895], 'name': 'Macrorregião II'}","{'latlong': [-41.86991671512915, -21.948198574820594], 'name': 'Macrorregião III'}",2,111.05112669036502
2013,"{'latlong': [-42.79682064784672, -22.45311155661895], 'name': 'Macrorregião II'}","{'latlong': [-42.79682064784672, -22.45311155661895], 'name': 'Macrorregião II'}",37016,0.0
2013,"{'latlong': [-42.79682064784672, -22.45311155661895], 'name': 'Macrorregião II'}","{'latlong': [-44.01167450855507, -22.6158211044684], 'name': 'Metropolitana I'}",4255,135.6129357760374
2013,"{'latlong': [-44.01167450855507, -22.6158211044684], 'name': 'Metropolitana I'}","{'latlong': [-41.86991671512915, -21.948198574820594], 'name': 'Macrorregião III'}",2,244.0886827880899
2013,"{'latlong': [-44.01167450855507, -22.6158211044684], 'name': 'Metropolitana I'}","{'latlong': [-42.79682064784672, -22.45311155661895], 'name': 'Macrorregião II'}",429,135.6129357760374
2013,"{'latlong': [-44.01167450855507, -22.6158211044684], 'name': 'Metropolitana I'}","{'latlong': [-44.01167450855507, -22.6158211044684], 'name': 'Metropolitana I'}",6092,0.0
2014,"{'latlong': [-41.86991671512915, -21.948198574820594], 'name': 'Macrorregião III'}","{'latlong': [-41.86991671512915, -21.948198574820594], 'name': 'Macrorregião III'}",5822,0.0
2014,"{'latlong': [-41.86991671512915, -21.948198574820594], 'name': 'Macrorregião III'}","{'latlong': [-42.79682064784672, -22.45311155661895], 'name': 'Macrorregião II'}",856,111.05112669036502
2014,"{'latlong': [-41.86991671512915, -21.948198574820594], 'name': 'Macrorregião III'}","{'latlong': [-44.01167450855507, -22.6158211044684], 'name': 'Metropolitana I'}",3,244.0886827880899
2014,"{'latlong': [-42.79682064784672, -22.45311155661895], 'name': 'Macrorregião II'}","{'latlong': [-41.86991671512915, -21.948198574820594], 'name': 'Macrorregião III'}",1,111.05112669036502
2014,"{'latlong': [-42.79682064784672, -22.45311155661895], 'name': 'Macrorregião II'}","{'latlong': [-42.79682064784672, -22.45311155661895], 'name': 'Macrorregião II'}",32944,0.0
2014,"{'latlong': [-42.79682064784672, -22.45311155661895], 'name': 'Macrorregião II'}","{'latlong': [-44.01167450855507, -22.6158211044684], 'name': 'Metropolitana I'}",3693,135.6129357760374
2014,"{'latlong': [-44.01167450855507, -22.6158211044684], 'name': 'Metropolitana I'}","{'latlong': [-42.79682064784672, -22.45311155661895], 'name': 'Macrorregião II'}",363,135.6129357760374
2014,"{'latlong': [-44.01167450855507, -22.6158211044684], 'name': 'Metropolitana I'}","{'latlong': [-44.01167450855507, -22.6158211044684], 'name': 'Metropolitana I'}",5417,0.0
2015,"{'latlong': [-41.86991671512915, -21.948198574820594], 'name': 'Macrorregião III'}","{'latlong': [-41.86991671512915, -21.948198574820594], 'name': 'Macrorregião III'}",4094,0.0
2015,"{'latlong': [-41.86991671512915, -21.948198574820594], 'name': 'Macrorregião III'}","{'latlong': [-42.79682064784672, -22.45311155661895], 'name': 'Macrorregião II'}",735,111.05112669036502
2015,"{'latlong': [-42.79682064784672, -22.45311155661895], 'name': 'Macrorregião II'}","{'latlong': [-41.86991671512915, -21.948198574820594], 'name': 'Macrorregião III'}",1,111.05112669036502
2015,"{'latlong': [-42.79682064784672, -22.45311155661895], 'name': 'Macrorregião II'}","{'latlong': [-42.79682064784672, -22.45311155661895], 'name': 'Macrorregião II'}",32499,0.0
2015,"{'latlong': [-42.79682064784672, -22.45311155661895], 'name': 'Macrorregião II'}","{'latlong': [-44.01167450855507, -22.6158211044684], 'name': 'Metropolitana I'}",2029,135.6129357760374
2015,"{'latlong': [-44.01167450855507, -22.6158211044684], 'name': 'Metropolitana I'}","{'latlong': [-42.79682064784672, -22.45311155661895], 'name': 'Macrorregião II'}",273,135.6129357760374
2015,"{'latlong': [-44.01167450855507, -22.6158211044684], 'name': 'Metropolitana I'}","{'latlong': [-44.01167450855507, -22.6158211044684], 'name': 'Metropolitana I'}",4360,0.0
2016,"{'latlong': [-41.86991671512915, -21.948198574820594], 'name': 'Macrorregião III'}","{'latlong': [-41.86991671512915, -21.948198574820594], 'name': 'Macrorregião III'}",4037,0.0
2016,"{'latlong': [-41.86991671512915, -21.948198574820594], 'name': 'Macrorregião III'}","{'latlong': [-42.79682064784672, -22.45311155661895], 'name': 'Macrorregião II'}",504,111.05112669036502
2016,"{'latlong': [-42.79682064784672, -22.45311155661895], 'name': 'Macrorregião II'}","{'latlong': [-42.79682064784672, -22.45311155661895], 'name': 'Macrorregião II'}",28709,0.0
2016,"{'latlong': [-42.79682064784672, -22.45311155661895], 'name': 'Macrorregião II'}","{'latlong': [-44.01167450855507, -22.6158211044684], 'name': 'Metropolitana I'}",895,135.6129357760374
2016,"{'latlong': [-44.01167450855507, -22.6158211044684], 'name': 'Metropolitana I'}","{'latlong': [-42.79682064784672, -22.45311155661895], 'name': 'Macrorregião II'}",195,135.6129357760374
2016,"{'latlong': [-44.01167450855507, -22.6158211044684], 'name': 'Metropolitana I'}","{'latlong': [-44.01167450855507, -22.6158211044684], 'name': 'Metropolitana I'}",4373,0.0
2017,"{'latlong': [-41.86991671512915, -21.948198574820594], 'name': 'Macrorregião III'}","{'latlong': [-41.86991671512915, -21.948198574820594], 'name': 'Macrorregião III'}",3293,0.0
2017,"{'latlong': [-41.86991671512915, -21.948198574820594], 'name': 'Macrorregião III'}","{'latlong': [-42.79682064784672, -22.45311155661895], 'name': 'Macrorregião II'}",349,111.05112669036502
2017,"{'latlong': [-41.86991671512915, -21.948198574820594], 'name': 'Macrorregião III'}","{'latlong': [-44.01167450855507, -22.6158211044684], 'name': 'Metropolitana I'}",3,244.0886827880899
2017,"{'latlong': [-42.79682064784672, -22.45311155661895], 'name': 'Macrorregião II'}","{'latlong': [-41.86991671512915, -21.948198574820594], 'name': 'Macrorregião III'}",9,111.05112669036502
2017,"{'latlong': [-42.79682064784672, -22.45311155661895], 'name': 'Macrorregião II'}","{'latlong': [-42.79682064784672, -22.45311155661895], 'name': 'Macrorregião II'}",27548,0.0
2017,"{'latlong': [-42.79682064784672, -22.45311155661895], 'name': 'Macrorregião II'}","{'latlong': [-44.01167450855507, -22.6158211044684], 'name': 'Metropolitana I'}",1067,135.6129357760374
2017,"{'latlong': [-44.01167450855507, -22.6158211044684], 'name': 'Metropolitana I'}","{'latlong': [-42.79682064784672, -22.45311155661895], 'name': 'Macrorregião II'}",192,135.6129357760374
2017,"{'latlong': [-44.01167450855507, -22.6158211044684], 'name': 'Metropolitana I'}","{'latlong': [-44.01167450855507, -22.6158211044684], 'name': 'Metropolitana I'}",3987,0.0
2018,"{'latlong': [-41.86991671512915, -21.948198574820594], 'name': 'Macrorregião III'}","{'latlong': [-41.86991671512915, -21.948198574820594], 'name': 'Macrorregião III'}",2083,0.0
2018,"{'latlong': [-41.86991671512915, -21.948198574820594], 'name': 'Macrorregião III'}","{'latlong': [-42.79682064784672, -22.45311155661895], 'name': 'Macrorregião II'}",163,111.05112669036502
2018,"{'latlong': [-42.79682064784672, -22.45311155661895], 'name': 'Macrorregião II'}","{'latlong': [-41.86991671512915, -21.948198574820594], 'name': 'Macrorregião III'}",13,111.05112669036502
2018,"{'latlong': [-42.79682064784672, -22.45311155661895], 'name': 'Macrorregião II'}","{'latlong': [-42.79682064784672, -22.45311155661895], 'name': 'Macrorregião II'}",23399,0.0
2018,"{'latlong': [-42.79682064784672, -22.45311155661895], 'name': 'Macrorregião II'}","{'latlong': [-44.01167450855507, -22.6158211044684], 'name': 'Metropolitana I'}",742,135.6129357760374
2018,"{'latlong': [-44.01167450855507, -22.6158211044684], 'name': 'Metropolitana I'}","{'latlong': [-42.79682064784672, -22.45311155661895], 'name': 'Macrorregião II'}",149,135.6129357760374
2018,"{'latlong': [-44.01167450855507, -22.6158211044684], 'name': 'Metropolitana I'}","{'latlong': [-44.01167450855507, -22.6158211044684], 'name': 'Metropolitana I'}",3749,0.0
2019,"{'latlong': [-41.86991671512915, -21.948198574820594], 'name': 'Macrorregião III'}","{'latlong': [-41.86991671512915, -21.948198574820594], 'name': 'Macrorregião III'}",2159,0.0
2019,"{'latlong': [-41.86991671512915, -21.948198574820594], 'name': 'Macrorregião III'}","{'latlong': [-42.79682064784672, -22.45311155661895], 'name': 'Macrorregião II'}",115,111.05112669036502
2019,"{'latlong': [-41.86991671512915, -21.948198574820594], 'name': 'Macrorregião III'}","{'latlong': [-44.01167450855507, -22.6158211044684], 'name': 'Metropolitana I'}",1,244.0886827880899
2019,"{'latlong': [-42.79682064784672, -22.45311155661895], 'name': 'Macrorregião II'}","{'latlong': [-41.86991671512915, -21.948198574820594], 'name': 'Macrorregião III'}",18,111.05112669036502
2019,"{'latlong': [-42.79682064784672, -22.45311155661895], 'name': 'Macrorregião II'}","{'latlong': [-42.79682064784672, -22.45311155661895], 'name': 'Macrorregião II'}",22210,0.0
2019,"{'latlong': [-42.79682064784672, -22.45311155661895], 'name': 'Macrorregião II'}","{'latlong': [-44.01167450855507, -22.6158211044684], 'name': 'Metropolitana I'}",530,135.6129357760374
2019,"{'latlong': [-44.01167450855507, -22.6158211044684], 'name': 'Metropolitana I'}","{'latlong': [-42.79682064784672, -22.45311155661895], 'name': 'Macrorregião II'}",81,135.6129357760374
2019,"{'latlong': [-44.01167450855507, -22.6158211044684], 'name': 'Metropolitana I'}","{'latlong': [-44.01167450855507, -22.6158211044684], 'name': 'Metropolitana I'}",3774,0.0
2020,"{'latlong': [-41.86991671512915, -21.948198574820594], 'name': 'Macrorregião III'}","{'latlong': [-41.86991671512915, -21.948198574820594], 'name': 'Macrorregião III'}",747,0.0
2020,"{'latlong': [-41.86991671512915, -21.948198574820594], 'name': 'Macrorregião III'}","{'latlong': [-42.79682064784672, -22.45311155661895], 'name': 'Macrorregião II'}",49,111.05112669036502
2020,"{'latlong': [-41.86991671512915, -21.948198574820594], 'name': 'Macrorregião III'}","{'latlong': [-44.01167450855507, -22.6158211044684], 'name': 'Metropolitana I'}",1,244.0886827880899
2020,"{'latlong': [-42.79682064784672, -22.45311155661895], 'name': 'Macrorregião II'}","{'latlong': [-41.86991671512915, -21.948198574820594], 'name': 'Macrorregião III'}",9,111.05112669036502
2020,"{'latlong': [-42.79682064784672, -22.45311155661895], 'name': 'Macrorregião II'}","{'latlong': [-42.79682064784672, -22.45311155661895], 'name': 'Macrorregião II'}",7115,0.0
2020,"{'latlong': [-42.79682064784672, -22.45311155661895], 'name': 'Macrorregião II'}","{'latlong': [-44.01167450855507, -22.6158211044684], 'name': 'Metropolitana I'}",100,135.6129357760374
2020,"{'latlong': [-44.01167450855507, -22.6158211044684], 'name': 'Metropolitana I'}","{'latlong': [-42.79682064784672, -22.45311155661895], 'name': 'Macrorregião II'}",40,135.6129357760374
2020,"{'latlong': [-44.01167450855507, -22.6158211044684], 'name': 'Metropolitana I'}","{'latlong': [-44.01167450855507, -22.6158211044684], 'name': 'Metropolitana I'}",1263,0.0
